beam-builds mailing list archives

Site index · List index
Message view « Date » · « Thread »
Top « Date » · « Thread »
From Apache Jenkins Server <jenk...@builds.apache.org>
Subject Build failed in Jenkins: beam_PostCommit_Python37 #3387
Date Fri, 29 Jan 2021 13:18:13 GMT
See <https://ci-beam.apache.org/job/beam_PostCommit_Python37/3387/display/redirect>

Changes:


------------------------------------------
[...truncated 55.17 MB...]
          "@type": "OutputReference",
          "output_name": "out",
          "step_name": "s4"
        },
        "serialized_fn": "QlpoOTFBWSZTWWeYg/EAApJ/8H/////////////cwr///+ZjwCAAYEBAAvYZlAZGGqZKeap6nqaD1Bk2o9T9UeoGgAaAaDQaNPSeoaD1PUAGnqeoMj0gZNBKmiZNCYmI1J4mSbSYg0yZAAGgABoDQaABoNAyMgGmSIQ0pspptTYiDTTQNBgQyaAGIyAGg0Bp6BNqeoGgeoOAAAAAAAAAAaAAAAAAAAAADvptRksy3rYqqrRyJX2qH0NSOBctdVUdLQAm1Vh2UANxiG8xcsPs2/V+wqRYe1ULTTsFGP9a61H8xkkgE7und2KQKCYLXStXLn3eFthcDyETfV4UGFKZNeBBEHUSJLWyzBEAWMCthwxMLlv1cDyano9cgF8al+wdq5r/REAkG1Xg8aacyW/LCkBXoTuB4iGoncNkgf7kZTycpPhEogIUlcmUXbLXkkTvSvGWUVI8gorCTQi4qGCTsUwnjQkyt2ZyOO9OYuufzYucYr+tb6skz+fLbYmGltqvc0ZyO62U1BN/063ZqwM9sHukMYDtXzQzuCo6I8hcg9bN+uA5zVxEToRovLZIoOS0PpZ6DtewoIpXjNEHdMET2MhmBwtiJO/7kFGvRXCBJCR3E0VT+tlPoVcp7u8FEolFZEAQgtDOCFCYBounGasGioKCtPYuiTpMtBVhRemCeN1kw3xz7+O3HdpAYYCUXQKJCFvkypPA1qn+cbuIJzJofIN2BcCmDlvIBCstlwFz2aQYXYogZO/bA/V1tacCaIv1lmiMtOWCxQ22hA4/JeLrKatgfimoi1XTBYqKI1UlwpqoFFxMxI7eKk1vELwoiakO73oRuciOUowiTwDyilzBw1LIP03KHIxylREq0IIBlhEEIgRqAmRKSZspXcY8WJZc1S79gLtt2o65KoRUptqAP0C0mEjQrLUMMdcwvLxdDZ2YWF3a2YmEc6V3Flq/zGko0q1i7CE9F60VVmlLVbxGN1Kc8GIjGCmM2+eg7pKnM7xezfVKYmJBAxbGHNEIVArMrZhiGweBLCVomDBhtYxZft2DIMzallLUjBweKHOZYLJJaYlEbRaHX4A2iWd0kmIYgPGrVkkFdUkblNPWmlouz7UYWBJGThIYIMpTkP5/pJL782MpXbJs/HJr2mwipgUqF1LL6WhjchFIhEb70ijjxamTOr2EAb6pUqdP+qQ4F4FkIiHj/i7kinChIM8xB+I=",
        "user_name": "m_out"
      }
    }
  ],
  "type": "JOB_TYPE_BATCH"
}
INFO:apache_beam.runners.dataflow.dataflow_runner:Job 2021-01-29_05_04_00-10937002429351327434
is in state JOB_STATE_DONE
INFO:apache_beam.runners.dataflow.internal.apiclient:Create job: <Job
 createTime: '2021-01-29T13:10:49.832679Z'
 currentStateTime: '1970-01-01T00:00:00Z'
 id: '2021-01-29_05_10_48-5573491188609145114'
 location: 'us-central1'
 name: 'beamapp-jenkins-0129131042-035827'
 projectId: 'apache-beam-testing'
 stageStates: []
 startTime: '2021-01-29T13:10:49.832679Z'
 steps: []
 tempFiles: []
 type: TypeValueValuesEnum(JOB_TYPE_BATCH, 1)>
INFO:apache_beam.runners.dataflow.internal.apiclient:Created job with id: [2021-01-29_05_10_48-5573491188609145114]
INFO:apache_beam.runners.dataflow.internal.apiclient:Submitted job: 2021-01-29_05_10_48-5573491188609145114
INFO:apache_beam.runners.dataflow.internal.apiclient:To access the Dataflow monitoring console,
please navigate to https://console.cloud.google.com/dataflow/jobs/us-central1/2021-01-29_05_10_48-5573491188609145114?project=apache-beam-testing
INFO:apache_beam.runners.dataflow.dataflow_runner:2021-01-29T13:10:47.583Z: JOB_MESSAGE_DETAILED:
Autoscaling: Resized worker pool from 1 to 0.
INFO:apache_beam.runners.dataflow.dataflow_runner:2021-01-29T13:10:47.622Z: JOB_MESSAGE_BASIC:
Worker pool stopped.
INFO:apache_beam.runners.dataflow.dataflow_runner:2021-01-29T13:10:47.654Z: JOB_MESSAGE_DEBUG:
Tearing down pending resources...
INFO:apache_beam.runners.dataflow.dataflow_runner:Job 2021-01-29_05_10_48-5573491188609145114
is in state JOB_STATE_RUNNING
INFO:apache_beam.runners.dataflow.dataflow_runner:Job 2021-01-29_05_03_52-14725024838036949537
is in state JOB_STATE_DONE
INFO:apache_beam.io.gcp.tests.bigquery_matcher:Attempting to perform query SELECT fruit from
`python_query_to_table_16119254187729.output_table`; to BQ
DEBUG:google.auth._default:Checking None for explicit credentials as part of auth process...
DEBUG:google.auth._default:Checking Cloud SDK credentials as part of auth process...
DEBUG:google.auth._default:Cloud SDK credentials not found on disk; not using them
DEBUG:google.auth._default:Checking for App Engine runtime as part of auth process...
DEBUG:google.auth._default:No App Engine library was found so cannot authentication via App
Engine Identity Credentials.
DEBUG:google.auth.transport._http_client:Making request: GET http://169.254.169.254
DEBUG:google.auth.transport._http_client:Making request: GET http://metadata.google.internal/computeMetadata/v1/project/project-id
DEBUG:urllib3.util.retry:Converted retries value: 3 -> Retry(total=3, connect=None, read=None,
redirect=None, status=None)
DEBUG:google.auth.transport.requests:Making request: GET http://metadata.google.internal/computeMetadata/v1/instance/service-accounts/default/?recursive=true
DEBUG:urllib3.connectionpool:Starting new HTTP connection (1): metadata.google.internal:80
DEBUG:urllib3.connectionpool:http://metadata.google.internal:80 "GET /computeMetadata/v1/instance/service-accounts/default/?recursive=true
HTTP/1.1" 200 144
DEBUG:google.auth.transport.requests:Making request: GET http://metadata.google.internal/computeMetadata/v1/instance/service-accounts/844138762903-compute@developer.gserviceaccount.com/token?scopes=https%3A%2F%2Fwww.googleapis.com%2Fauth%2Fbigquery%2Chttps%3A%2F%2Fwww.googleapis.com%2Fauth%2Fcloud-platform
DEBUG:urllib3.connectionpool:http://metadata.google.internal:80 "GET /computeMetadata/v1/instance/service-accounts/844138762903-compute@developer.gserviceaccount.com/token?scopes=https%3A%2F%2Fwww.googleapis.com%2Fauth%2Fbigquery%2Chttps%3A%2F%2Fwww.googleapis.com%2Fauth%2Fcloud-platform
HTTP/1.1" 200 241
DEBUG:urllib3.connectionpool:Starting new HTTPS connection (1): bigquery.googleapis.com:443
INFO:apache_beam.runners.dataflow.dataflow_runner:2021-01-29T13:10:48.244Z: JOB_MESSAGE_DETAILED:
Autoscaling is enabled for job 2021-01-29_05_10_48-5573491188609145114. The number of workers
will be between 1 and 1000.
INFO:apache_beam.runners.dataflow.dataflow_runner:2021-01-29T13:10:48.244Z: JOB_MESSAGE_DETAILED:
Autoscaling was automatically enabled for job 2021-01-29_05_10_48-5573491188609145114.
INFO:apache_beam.runners.dataflow.dataflow_runner:2021-01-29T13:10:52.069Z: JOB_MESSAGE_BASIC:
Worker configuration: n1-standard-1 in us-central1-f.
INFO:apache_beam.runners.dataflow.dataflow_runner:2021-01-29T13:10:53.809Z: JOB_MESSAGE_DETAILED:
Expanding CoGroupByKey operations into optimizable parts.
INFO:apache_beam.runners.dataflow.dataflow_runner:2021-01-29T13:10:53.848Z: JOB_MESSAGE_DEBUG:
Combiner lifting skipped for step GroupByKey: GroupByKey not followed by a combiner.
INFO:apache_beam.runners.dataflow.dataflow_runner:2021-01-29T13:10:53.883Z: JOB_MESSAGE_DETAILED:
Expanding GroupByKey operations into optimizable parts.
INFO:apache_beam.runners.dataflow.dataflow_runner:2021-01-29T13:10:53.907Z: JOB_MESSAGE_DETAILED:
Lifting ValueCombiningMappingFns into MergeBucketsMappingFns
INFO:apache_beam.runners.dataflow.dataflow_runner:2021-01-29T13:10:53.973Z: JOB_MESSAGE_DEBUG:
Annotating graph with Autotuner information.
INFO:apache_beam.runners.dataflow.dataflow_runner:2021-01-29T13:10:54.006Z: JOB_MESSAGE_DETAILED:
Fusing adjacent ParDo, Read, Write, and Flatten operations
INFO:apache_beam.runners.dataflow.dataflow_runner:2021-01-29T13:10:54.023Z: JOB_MESSAGE_DETAILED:
Fusing consumer metrics into Create/Read
INFO:apache_beam.runners.dataflow.dataflow_runner:2021-01-29T13:10:54.058Z: JOB_MESSAGE_DETAILED:
Fusing consumer map_to_common_key into metrics
INFO:apache_beam.runners.dataflow.dataflow_runner:2021-01-29T13:10:54.082Z: JOB_MESSAGE_DETAILED:
Fusing consumer GroupByKey/Reify into map_to_common_key
INFO:apache_beam.runners.dataflow.dataflow_runner:2021-01-29T13:10:54.112Z: JOB_MESSAGE_DETAILED:
Fusing consumer GroupByKey/Write into GroupByKey/Reify
INFO:apache_beam.runners.dataflow.dataflow_runner:2021-01-29T13:10:54.141Z: JOB_MESSAGE_DETAILED:
Fusing consumer GroupByKey/GroupByWindow into GroupByKey/Read
INFO:apache_beam.runners.dataflow.dataflow_runner:2021-01-29T13:10:54.165Z: JOB_MESSAGE_DETAILED:
Fusing consumer m_out into GroupByKey/GroupByWindow
INFO:apache_beam.runners.dataflow.dataflow_runner:2021-01-29T13:10:54.199Z: JOB_MESSAGE_DEBUG:
Workflow config is missing a default resource spec.
INFO:apache_beam.runners.dataflow.dataflow_runner:2021-01-29T13:10:54.223Z: JOB_MESSAGE_DEBUG:
Adding StepResource setup and teardown to workflow graph.
INFO:apache_beam.runners.dataflow.dataflow_runner:2021-01-29T13:10:54.249Z: JOB_MESSAGE_DEBUG:
Adding workflow start and stop steps.
INFO:apache_beam.runners.dataflow.dataflow_runner:2021-01-29T13:10:54.280Z: JOB_MESSAGE_DEBUG:
Assigning stage ids.
INFO:apache_beam.runners.dataflow.dataflow_runner:2021-01-29T13:10:54.480Z: JOB_MESSAGE_DEBUG:
Executing wait step start13
INFO:apache_beam.runners.dataflow.dataflow_runner:2021-01-29T13:10:54.541Z: JOB_MESSAGE_BASIC:
Executing operation GroupByKey/Create
INFO:apache_beam.runners.dataflow.dataflow_runner:2021-01-29T13:10:54.585Z: JOB_MESSAGE_DEBUG:
Starting worker pool setup.
INFO:apache_beam.runners.dataflow.dataflow_runner:2021-01-29T13:10:54.618Z: JOB_MESSAGE_BASIC:
Starting 1 workers in us-central1-f...
INFO:apache_beam.runners.dataflow.dataflow_runner:2021-01-29T13:10:54.660Z: JOB_MESSAGE_BASIC:
Finished operation GroupByKey/Create
INFO:apache_beam.runners.dataflow.dataflow_runner:2021-01-29T13:10:54.717Z: JOB_MESSAGE_DEBUG:
Value "GroupByKey/Session" materialized.
INFO:apache_beam.runners.dataflow.dataflow_runner:2021-01-29T13:10:54.769Z: JOB_MESSAGE_BASIC:
Executing operation Create/Read+metrics+map_to_common_key+GroupByKey/Reify+GroupByKey/Write
DEBUG:urllib3.connectionpool:https://bigquery.googleapis.com:443 "POST /bigquery/v2/projects/apache-beam-testing/jobs?prettyPrint=false
HTTP/1.1" 200 None
DEBUG:urllib3.connectionpool:https://bigquery.googleapis.com:443 "GET /bigquery/v2/projects/apache-beam-testing/queries/f34d6d92-e384-4046-8be3-ef896001f7ec?maxResults=0&location=US&prettyPrint=false
HTTP/1.1" 200 None
DEBUG:urllib3.connectionpool:https://bigquery.googleapis.com:443 "GET /bigquery/v2/projects/apache-beam-testing/datasets/_7357fab0f784d2a7327ddbe81cdd1f4ca7e429cd/tables/anon5f04bcb867c4caeda527144327cc60d9620acd71/data?prettyPrint=false
HTTP/1.1" 200 None
INFO:apache_beam.io.gcp.tests.bigquery_matcher:Read from given query (SELECT fruit from `python_query_to_table_16119254187729.output_table`;),
total rows 2
INFO:apache_beam.io.gcp.tests.bigquery_matcher:Generate checksum: 158a8ea1c254fcf40d4ed3e7c0242c3ea0a29e72
INFO:apache_beam.runners.dataflow.dataflow_runner:2021-01-29T13:11:14.545Z: JOB_MESSAGE_BASIC:
Your project already contains 100 Dataflow-created metric descriptors, so new user metrics
of the form custom.googleapis.com/* will not be created. However, all user metrics are also
available in the metric dataflow.googleapis.com/job/user_counter. If you rely on the custom
metrics, you can delete old / unused metric descriptors. See https://developers.google.com/apis-explorer/#p/monitoring/v3/monitoring.projects.metricDescriptors.list
and https://developers.google.com/apis-explorer/#p/monitoring/v3/monitoring.projects.metricDescriptors.delete
INFO:apache_beam.runners.dataflow.dataflow_runner:2021-01-29T13:11:33.287Z: JOB_MESSAGE_DETAILED:
Autoscaling: Raised the number of workers to 1 based on the rate of progress in the currently
running stage(s).
INFO:apache_beam.runners.dataflow.dataflow_runner:2021-01-29T13:11:51.262Z: JOB_MESSAGE_DETAILED:
Workers have started successfully.
INFO:apache_beam.runners.dataflow.dataflow_runner:2021-01-29T13:11:51.293Z: JOB_MESSAGE_DETAILED:
Workers have started successfully.
INFO:apache_beam.runners.dataflow.dataflow_runner:2021-01-29T13:13:23.046Z: JOB_MESSAGE_BASIC:
Finished operation Create/Read+ExternalTransform(simple)/Map(<lambda at external_it_test.py:43>)+assert_that/WindowInto(WindowIntoFn)+assert_that/ToVoidKey+assert_that/Group/pair_with_1+assert_that/Group/GroupByKey/Reify+assert_that/Group/GroupByKey/Write
INFO:apache_beam.runners.dataflow.dataflow_runner:2021-01-29T13:13:26.186Z: JOB_MESSAGE_BASIC:
Finished operation assert_that/Create/Read+assert_that/Group/pair_with_0+assert_that/Group/GroupByKey/Reify+assert_that/Group/GroupByKey/Write
INFO:apache_beam.runners.dataflow.dataflow_runner:2021-01-29T13:13:26.263Z: JOB_MESSAGE_BASIC:
Executing operation assert_that/Group/GroupByKey/Close
INFO:apache_beam.runners.dataflow.dataflow_runner:2021-01-29T13:13:26.309Z: JOB_MESSAGE_BASIC:
Finished operation assert_that/Group/GroupByKey/Close
INFO:apache_beam.runners.dataflow.dataflow_runner:2021-01-29T13:13:26.384Z: JOB_MESSAGE_BASIC:
Executing operation assert_that/Group/GroupByKey/Read+assert_that/Group/GroupByKey/GroupByWindow+assert_that/Group/Map(_merge_tagged_vals_under_key)+assert_that/Unkey+assert_that/Match
INFO:apache_beam.runners.dataflow.dataflow_runner:2021-01-29T13:13:35.575Z: JOB_MESSAGE_BASIC:
Finished operation assert_that/Group/GroupByKey/Read+assert_that/Group/GroupByKey/GroupByWindow+assert_that/Group/Map(_merge_tagged_vals_under_key)+assert_that/Unkey+assert_that/Match
INFO:apache_beam.runners.dataflow.dataflow_runner:2021-01-29T13:13:35.650Z: JOB_MESSAGE_DEBUG:
Executing success step success19
INFO:apache_beam.runners.dataflow.dataflow_runner:2021-01-29T13:13:36.037Z: JOB_MESSAGE_DETAILED:
Cleaning up.
INFO:apache_beam.runners.dataflow.dataflow_runner:2021-01-29T13:13:36.088Z: JOB_MESSAGE_DEBUG:
Starting worker pool teardown.
INFO:apache_beam.runners.dataflow.dataflow_runner:2021-01-29T13:13:36.121Z: JOB_MESSAGE_BASIC:
Stopping worker pool...
INFO:apache_beam.runners.dataflow.dataflow_runner:2021-01-29T13:14:11.042Z: JOB_MESSAGE_DETAILED:
Autoscaling: Resized worker pool from 1 to 0.
INFO:apache_beam.runners.dataflow.dataflow_runner:2021-01-29T13:14:11.093Z: JOB_MESSAGE_BASIC:
Worker pool stopped.
INFO:apache_beam.runners.dataflow.dataflow_runner:2021-01-29T13:14:11.131Z: JOB_MESSAGE_DEBUG:
Tearing down pending resources...
INFO:apache_beam.runners.dataflow.dataflow_runner:Job 2021-01-29_05_07_27-15745727031053277649
is in state JOB_STATE_DONE
WARNING:apache_beam.runners.dataflow.dataflow_runner:Timing out on waiting for job 2021-01-29_04_59_59-2416145751551363395
after 902 seconds
INFO:apache_beam.io.gcp.tests.bigquery_matcher:Attempting to perform query SELECT number FROM
python_pubsub_bq_16119251892491.output_table to BQ
DEBUG:google.auth._default:Checking None for explicit credentials as part of auth process...
DEBUG:google.auth._default:Checking Cloud SDK credentials as part of auth process...
DEBUG:google.auth._default:Cloud SDK credentials not found on disk; not using them
DEBUG:google.auth._default:Checking for App Engine runtime as part of auth process...
DEBUG:google.auth._default:No App Engine library was found so cannot authentication via App
Engine Identity Credentials.
DEBUG:google.auth.transport._http_client:Making request: GET http://169.254.169.254
DEBUG:google.auth.transport._http_client:Making request: GET http://metadata.google.internal/computeMetadata/v1/project/project-id
DEBUG:urllib3.util.retry:Converted retries value: 3 -> Retry(total=3, connect=None, read=None,
redirect=None, status=None)
DEBUG:google.auth.transport.requests:Making request: GET http://metadata.google.internal/computeMetadata/v1/instance/service-accounts/default/?recursive=true
DEBUG:urllib3.connectionpool:Starting new HTTP connection (1): metadata.google.internal:80
DEBUG:urllib3.connectionpool:http://metadata.google.internal:80 "GET /computeMetadata/v1/instance/service-accounts/default/?recursive=true
HTTP/1.1" 200 144
DEBUG:google.auth.transport.requests:Making request: GET http://metadata.google.internal/computeMetadata/v1/instance/service-accounts/844138762903-compute@developer.gserviceaccount.com/token?scopes=https%3A%2F%2Fwww.googleapis.com%2Fauth%2Fbigquery%2Chttps%3A%2F%2Fwww.googleapis.com%2Fauth%2Fcloud-platform
DEBUG:urllib3.connectionpool:http://metadata.google.internal:80 "GET /computeMetadata/v1/instance/service-accounts/844138762903-compute@developer.gserviceaccount.com/token?scopes=https%3A%2F%2Fwww.googleapis.com%2Fauth%2Fbigquery%2Chttps%3A%2F%2Fwww.googleapis.com%2Fauth%2Fcloud-platform
HTTP/1.1" 200 241
DEBUG:urllib3.connectionpool:Starting new HTTPS connection (1): bigquery.googleapis.com:443
DEBUG:urllib3.connectionpool:https://bigquery.googleapis.com:443 "POST /bigquery/v2/projects/apache-beam-testing/jobs?prettyPrint=false
HTTP/1.1" 200 None
DEBUG:urllib3.connectionpool:https://bigquery.googleapis.com:443 "GET /bigquery/v2/projects/apache-beam-testing/queries/d31ed927-a09a-4390-a21d-72b299c1bb49?maxResults=0&location=US&prettyPrint=false
HTTP/1.1" 200 None
DEBUG:urllib3.connectionpool:https://bigquery.googleapis.com:443 "GET /bigquery/v2/projects/apache-beam-testing/datasets/_7357fab0f784d2a7327ddbe81cdd1f4ca7e429cd/tables/anonc9d18939_b3bd_4386_aea6_8fe94bfc378e/data?prettyPrint=false
HTTP/1.1" 200 None
INFO:apache_beam.io.gcp.tests.bigquery_matcher:Result of query is: [(3,), (2,), (0,), (1,)]
DEBUG:google.auth._default:Checking None for explicit credentials as part of auth process...
DEBUG:google.auth._default:Checking Cloud SDK credentials as part of auth process...
DEBUG:google.auth._default:Cloud SDK credentials not found on disk; not using them
DEBUG:google.auth._default:Checking for App Engine runtime as part of auth process...
DEBUG:google.auth._default:No App Engine library was found so cannot authentication via App
Engine Identity Credentials.
DEBUG:google.auth.transport._http_client:Making request: GET http://169.254.169.254
DEBUG:google.auth.transport._http_client:Making request: GET http://metadata.google.internal/computeMetadata/v1/project/project-id
DEBUG:urllib3.util.retry:Converted retries value: 3 -> Retry(total=3, connect=None, read=None,
redirect=None, status=None)
DEBUG:google.auth.transport.requests:Making request: GET http://metadata.google.internal/computeMetadata/v1/instance/service-accounts/default/?recursive=true
DEBUG:urllib3.connectionpool:Starting new HTTP connection (1): metadata.google.internal:80
DEBUG:urllib3.connectionpool:http://metadata.google.internal:80 "GET /computeMetadata/v1/instance/service-accounts/default/?recursive=true
HTTP/1.1" 200 144
DEBUG:google.auth.transport.requests:Making request: GET http://metadata.google.internal/computeMetadata/v1/instance/service-accounts/844138762903-compute@developer.gserviceaccount.com/token?scopes=https%3A%2F%2Fwww.googleapis.com%2Fauth%2Fbigquery%2Chttps%3A%2F%2Fwww.googleapis.com%2Fauth%2Fcloud-platform
DEBUG:urllib3.connectionpool:http://metadata.google.internal:80 "GET /computeMetadata/v1/instance/service-accounts/844138762903-compute@developer.gserviceaccount.com/token?scopes=https%3A%2F%2Fwww.googleapis.com%2Fauth%2Fbigquery%2Chttps%3A%2F%2Fwww.googleapis.com%2Fauth%2Fcloud-platform
HTTP/1.1" 200 241
DEBUG:urllib3.connectionpool:Starting new HTTPS connection (1): bigquery.googleapis.com:443
DEBUG:urllib3.connectionpool:https://bigquery.googleapis.com:443 "DELETE /bigquery/v2/projects/apache-beam-testing/datasets/python_pubsub_bq_16119251892491?deleteContents=true&prettyPrint=false
HTTP/1.1" 200 None
INFO:apache_beam.runners.dataflow.dataflow_runner:2021-01-29T13:16:58.261Z: JOB_MESSAGE_BASIC:
Finished operation Create/Read+metrics+map_to_common_key+GroupByKey/Reify+GroupByKey/Write
INFO:apache_beam.runners.dataflow.dataflow_runner:2021-01-29T13:16:58.321Z: JOB_MESSAGE_BASIC:
Executing operation GroupByKey/Close
INFO:apache_beam.runners.dataflow.dataflow_runner:2021-01-29T13:16:58.363Z: JOB_MESSAGE_BASIC:
Finished operation GroupByKey/Close
INFO:apache_beam.runners.dataflow.dataflow_runner:2021-01-29T13:16:58.439Z: JOB_MESSAGE_BASIC:
Executing operation GroupByKey/Read+GroupByKey/GroupByWindow+m_out
INFO:apache_beam.runners.dataflow.dataflow_runner:2021-01-29T13:17:07.573Z: JOB_MESSAGE_BASIC:
Finished operation GroupByKey/Read+GroupByKey/GroupByWindow+m_out
INFO:apache_beam.runners.dataflow.dataflow_runner:2021-01-29T13:17:07.631Z: JOB_MESSAGE_DEBUG:
Executing success step success11
INFO:apache_beam.runners.dataflow.dataflow_runner:2021-01-29T13:17:07.690Z: JOB_MESSAGE_DETAILED:
Cleaning up.
INFO:apache_beam.runners.dataflow.dataflow_runner:2021-01-29T13:17:07.725Z: JOB_MESSAGE_DEBUG:
Starting worker pool teardown.
INFO:apache_beam.runners.dataflow.dataflow_runner:2021-01-29T13:17:07.752Z: JOB_MESSAGE_BASIC:
Stopping worker pool...
INFO:apache_beam.runners.dataflow.dataflow_runner:2021-01-29T13:17:57.083Z: JOB_MESSAGE_DETAILED:
Autoscaling: Resized worker pool from 1 to 0.
INFO:apache_beam.runners.dataflow.dataflow_runner:2021-01-29T13:17:57.124Z: JOB_MESSAGE_BASIC:
Worker pool stopped.
INFO:apache_beam.runners.dataflow.dataflow_runner:2021-01-29T13:17:57.141Z: JOB_MESSAGE_DEBUG:
Tearing down pending resources...
INFO:apache_beam.runners.dataflow.dataflow_runner:Job 2021-01-29_05_10_48-5573491188609145114
is in state JOB_STATE_DONE
test_bigquery_tornadoes_it (apache_beam.examples.cookbook.bigquery_tornadoes_it_test.BigqueryTornadoesIT)
... ok
test_autocomplete_it (apache_beam.examples.complete.autocomplete_test.AutocompleteTest) ...
ok
test_streaming_wordcount_debugging_it (apache_beam.examples.streaming_wordcount_debugging_it_test.StreamingWordcountDebuggingIT)
... SKIP: Skipped due to [BEAM-3377]: assert_that not working for streaming
test_datastore_wordcount_it (apache_beam.examples.cookbook.datastore_wordcount_it_test.DatastoreWordCountIT)
... ok
test_leader_board_it (apache_beam.examples.complete.game.leader_board_it_test.LeaderBoardIT)
... ok
test_game_stats_it (apache_beam.examples.complete.game.game_stats_it_test.GameStatsIT) ...
ok
test_run_example_with_setup_file (apache_beam.examples.complete.juliaset.juliaset.juliaset_test_it.JuliaSetTestIT)
... ok
test_streaming_wordcount_it (apache_beam.examples.streaming_wordcount_it_test.StreamingWordCountIT)
... ok
test_wordcount_fnapi_it (apache_beam.examples.wordcount_it_test.WordCountIT) ... ok
test_user_score_it (apache_beam.examples.complete.game.user_score_it_test.UserScoreIT) ...
ok
test_wordcount_it (apache_beam.examples.wordcount_it_test.WordCountIT) ... ok
test_hourly_team_score_it (apache_beam.examples.complete.game.hourly_team_score_it_test.HourlyTeamScoreIT)
... ok
test_avro_it (apache_beam.examples.fastavro_it_test.FastavroIT) ... ok
test_read_queries (apache_beam.io.gcp.bigquery_read_it_test.ReadAllBQTests) ... ok
test_read_via_sql (apache_beam.io.gcp.experimental.spannerio_read_it_test.SpannerReadIntegrationTest)
... ok
test_read_via_table (apache_beam.io.gcp.experimental.spannerio_read_it_test.SpannerReadIntegrationTest)
... ok
test_bigquery_read_1M_python (apache_beam.io.gcp.bigquery_io_read_it_test.BigqueryIOReadIT)
... ok
test_bigquery_read_custom_1M_python (apache_beam.io.gcp.bigquery_io_read_it_test.BigqueryIOReadIT)
... ok
test_bqfl_streaming (apache_beam.io.gcp.bigquery_file_loads_test.BigQueryFileLoadsIT) ...
SKIP: TestStream is not supported on TestDataflowRunner
test_multiple_destinations_transform (apache_beam.io.gcp.bigquery_file_loads_test.BigQueryFileLoadsIT)
... ok
test_one_job_fails_all_jobs_fail (apache_beam.io.gcp.bigquery_file_loads_test.BigQueryFileLoadsIT)
... ok
test_avro_file_load (apache_beam.io.gcp.bigquery_test.BigQueryFileLoadsIntegrationTests) ...
ok
test_spanner_error (apache_beam.io.gcp.experimental.spannerio_write_it_test.SpannerWriteIntegrationTest)
... ok
test_spanner_update (apache_beam.io.gcp.experimental.spannerio_write_it_test.SpannerWriteIntegrationTest)
... ok
test_write_batches (apache_beam.io.gcp.experimental.spannerio_write_it_test.SpannerWriteIntegrationTest)
... ok
test_iobase_source (apache_beam.io.gcp.bigquery_read_it_test.ReadNewTypesTests) ... ok
test_native_source (apache_beam.io.gcp.bigquery_read_it_test.ReadNewTypesTests) ... ok
test_multiple_destinations_transform (apache_beam.io.gcp.bigquery_test.BigQueryStreamingInsertTransformIntegrationTests)
... ok
test_iobase_source (apache_beam.io.gcp.bigquery_read_it_test.ReadTests) ... ok
test_native_source (apache_beam.io.gcp.bigquery_read_it_test.ReadTests) ... ok
test_copy (apache_beam.io.gcp.gcsio_integration_test.GcsIOIntegrationTest) ... ok
test_copy_batch (apache_beam.io.gcp.gcsio_integration_test.GcsIOIntegrationTest) ... ok
test_copy_batch_kms (apache_beam.io.gcp.gcsio_integration_test.GcsIOIntegrationTest) ... ok
test_copy_batch_rewrite_token (apache_beam.io.gcp.gcsio_integration_test.GcsIOIntegrationTest)
... ok
test_copy_kms (apache_beam.io.gcp.gcsio_integration_test.GcsIOIntegrationTest) ... ok
test_copy_rewrite_token (apache_beam.io.gcp.gcsio_integration_test.GcsIOIntegrationTest) ...
ok
test_value_provider_transform (apache_beam.io.gcp.bigquery_test.BigQueryStreamingInsertTransformIntegrationTests)
... ok
test_datastore_write_limit (apache_beam.io.gcp.datastore.v1new.datastore_write_it_test.DatastoreWriteIT)
... ok
test_transform_on_gcs (apache_beam.io.fileio_test.MatchIntegrationTest) ... ok
test_parquetio_it (apache_beam.io.parquetio_it_test.TestParquetIT) ... ok
test_streaming_data_only (apache_beam.io.gcp.pubsub_integration_test.PubSubIntegrationTest)
... ok
test_streaming_with_attributes (apache_beam.io.gcp.pubsub_integration_test.PubSubIntegrationTest)
... ok
test_dicom_search_instances (apache_beam.io.gcp.dicomio_integration_test.DICOMIoIntegrationTest)
... ok
test_dicom_store_instance_from_gcs (apache_beam.io.gcp.dicomio_integration_test.DICOMIoIntegrationTest)
... ok
test_analyzing_syntax (apache_beam.ml.gcp.naturallanguageml_test_it.NaturalLanguageMlTestIT)
... ok
test_big_query_write (apache_beam.io.gcp.bigquery_write_it_test.BigQueryWriteIntegrationTests)
... ok
test_big_query_write_new_types (apache_beam.io.gcp.bigquery_write_it_test.BigQueryWriteIntegrationTests)
... ok
test_big_query_write_schema_autodetect (apache_beam.io.gcp.bigquery_write_it_test.BigQueryWriteIntegrationTests)
... SKIP: DataflowRunner does not support schema autodetection
test_big_query_write_without_schema (apache_beam.io.gcp.bigquery_write_it_test.BigQueryWriteIntegrationTests)
... ok
test_label_detection_with_video_context (apache_beam.ml.gcp.videointelligenceml_test_it.VideoIntelligenceMlTestIT)
... ok
test_basic_execution (apache_beam.testing.test_stream_it_test.TestStreamIntegrationTests)
... SKIP: The "TestDataflowRunner", does not support the TestStream transform. Supported runners:
['DirectRunner', 'SwitchingDirectRunner']
Tests that the TestStream supports emitting to multiple PCollections. ... SKIP: The "TestDataflowRunner",
does not support the TestStream transform. Supported runners: ['DirectRunner', 'SwitchingDirectRunner']
Tests that the TestStream can independently control output watermarks. ... SKIP: The "TestDataflowRunner",
does not support the TestStream transform. Supported runners: ['DirectRunner', 'SwitchingDirectRunner']
test_text_detection_with_language_hint (apache_beam.ml.gcp.visionml_test_it.VisionMlTestIT)
... ok
test_deidentification (apache_beam.ml.gcp.cloud_dlp_it_test.CloudDLPIT) ... ok
test_inspection (apache_beam.ml.gcp.cloud_dlp_it_test.CloudDLPIT) ... ok
test_big_query_legacy_sql (apache_beam.io.gcp.big_query_query_to_table_it_test.BigQueryQueryToTableIT)
... ok
test_big_query_new_types (apache_beam.io.gcp.big_query_query_to_table_it_test.BigQueryQueryToTableIT)
... ok
test_big_query_new_types_avro (apache_beam.io.gcp.big_query_query_to_table_it_test.BigQueryQueryToTableIT)
... ok
test_big_query_new_types_native (apache_beam.io.gcp.big_query_query_to_table_it_test.BigQueryQueryToTableIT)
... ok
test_big_query_standard_sql (apache_beam.io.gcp.big_query_query_to_table_it_test.BigQueryQueryToTableIT)
... ok
test_big_query_standard_sql_kms_key_native (apache_beam.io.gcp.big_query_query_to_table_it_test.BigQueryQueryToTableIT)
... ok
Runs streaming Dataflow job and verifies that user metrics are reported ... ok
test_job_python_from_python_it (apache_beam.transforms.external_it_test.ExternalTransformIT)
... ok
test_file_loads (apache_beam.io.gcp.bigquery_test.PubSubBigQueryIT) ... ok
test_streaming_inserts (apache_beam.io.gcp.bigquery_test.PubSubBigQueryIT) ... ok
test_metrics_fnapi_it (apache_beam.runners.dataflow.dataflow_exercise_metrics_pipeline_test.ExerciseMetricsPipelineTest)
... ok
test_metrics_it (apache_beam.runners.dataflow.dataflow_exercise_metrics_pipeline_test.ExerciseMetricsPipelineTest)
... ok

----------------------------------------------------------------------
XML: nosetests-postCommitIT-df-py37.xml
----------------------------------------------------------------------
XML: <https://ci-beam.apache.org/job/beam_PostCommit_Python37/ws/src/sdks/python/nosetests.xml>
----------------------------------------------------------------------
Ran 68 tests in 4459.274s

OK (SKIP=6)

FAILURE: Build failed with an exception.

* Where:
Script '<https://ci-beam.apache.org/job/beam_PostCommit_Python37/ws/src/sdks/python/test-suites/portable/common.gradle'>
line: 197

* What went wrong:
Execution failed for task ':sdks:python:test-suites:portable:py37:postCommitPy37IT'.
> Process 'command 'sh'' finished with non-zero exit value 1

* Try:
Run with --stacktrace option to get the stack trace. Run with --info or --debug option to
get more log output. Run with --scan to get full insights.

* Get more help at https://help.gradle.org

Deprecated Gradle features were used in this build, making it incompatible with Gradle 7.0.
Use '--warning-mode all' to show the individual deprecation warnings.
See https://docs.gradle.org/6.8/userguide/command_line_interface.html#sec:command_line_warnings

BUILD FAILED in 1h 17m 47s
216 actionable tasks: 154 executed, 58 from cache, 4 up-to-date
Gradle was unable to watch the file system for changes. The inotify watches limit is too low.

Publishing build scan...
https://gradle.com/s/droqsgit6ihi2

Build step 'Invoke Gradle script' changed build result to FAILURE
Build step 'Invoke Gradle script' marked build as failure

---------------------------------------------------------------------
To unsubscribe, e-mail: builds-unsubscribe@beam.apache.org
For additional commands, e-mail: builds-help@beam.apache.org


Mime
View raw message