beam-builds mailing list archives

Site index · List index
Message view « Date » · « Thread »
Top « Date » · « Thread »
From Apache Jenkins Server <jenk...@builds.apache.org>
Subject Build failed in Jenkins: beam_PostCommit_Python36_Pytest #803
Date Thu, 28 Jan 2021 00:00:52 GMT
See <https://ci-beam.apache.org/job/beam_PostCommit_Python36_Pytest/803/display/redirect?page=changes>

Changes:

[sonam.ramchand] Enabled strict dependency on flink runner

[sonam.ramchand] Added new line

[sonam.ramchand] removed checker-qual

[sonam.ramchand] Removed flink-clients dep

[sonam.ramchand] set enableStrictDependencies:true

[sonam.ramchand] made flink-clients runtimeOnly

[noreply] Remove stray colon.

[zyichi] [BEAM-11679] Override PubsubUnboundedSource transform for dataflow

[zyichi] Populate PubsubMessage message id

[zyichi] Enable tests

[zyichi] Exclude failing FhirIO ITs

[zyichi] Include runner v2 IT tests in java post commit

[Ismaël Mejía] [BEAM-11697] Upgrade Flink runner to Flink versions 1.12.1 and 1.11.3

[shehzaad] strict dependency checking on sdks/io/amazon-web-services*

[shehzaad] move amazon-web-services* changes to another PR

[shehzaad] undo previous erroneous commit

[shehzaad] better use of variables

[randomstep] [BEAM-8725] bump snappy-java to 1.1.8.4

[nielm] Add BigDecimal support for SpannerIO

[noreply] [BEAM-11695] Remove translations.pack_combiners from default optimizers

[Kyle Weaver] [BEAM-11689] Add public.nexus.pentaho.org to offline repositories.

[Chamikara Madhusanka Jayalath] Moving to 2.29.0-SNAPSHOT on master branch.

[noreply] [BEAM-11531] Add pd.to_datetime, handle DeferredBase args in

[Andrew Pilloud] [BEAM-11165] Async ZetaSQL Calc

[noreply] [BEAM-11695] Combiner packing in Dataflow (#13763)


------------------------------------------
Started by timer
Running as SYSTEM
[EnvInject] - Loading node environment variables.
Building remotely on apache-beam-jenkins-13 (beam) in workspace <https://ci-beam.apache.org/job/beam_PostCommit_Python36_Pytest/ws/>
No credentials specified
Wiping out workspace first.
Cloning the remote Git repository
Cloning repository https://github.com/apache/beam.git
 > git init <https://ci-beam.apache.org/job/beam_PostCommit_Python36_Pytest/ws/src>
# timeout=10
Fetching upstream changes from https://github.com/apache/beam.git
 > git --version # timeout=10
 > git fetch --tags --progress https://github.com/apache/beam.git +refs/heads/*:refs/remotes/origin/*
# timeout=10
 > git config remote.origin.url https://github.com/apache/beam.git # timeout=10
 > git config --add remote.origin.fetch +refs/heads/*:refs/remotes/origin/* # timeout=10
 > git config remote.origin.url https://github.com/apache/beam.git # timeout=10
Fetching upstream changes from https://github.com/apache/beam.git
 > git fetch --tags --progress https://github.com/apache/beam.git +refs/heads/*:refs/remotes/origin/*
+refs/pull/${ghprbPullId}/*:refs/remotes/origin/pr/${ghprbPullId}/* # timeout=10
 > git rev-parse origin/master^{commit} # timeout=10
Checking out Revision ebc3bc31e1f4185241e4a2cf2212772fd7c1fb66 (origin/master)
 > git config core.sparsecheckout # timeout=10
 > git checkout -f ebc3bc31e1f4185241e4a2cf2212772fd7c1fb66 # timeout=10
Commit message: "Merge pull request #13797 from [BEAM-11679] Override PubsubUnboundedSource
transform for dataflow runner v2"
 > git rev-list --no-walk ed5b11795bdb83d9df61ca0eccb648a1d97a4dc7 # timeout=10
No emails were triggered.
[EnvInject] - Executing scripts and injecting environment variables after the SCM step.
[EnvInject] - Injecting as environment variables the properties content 
SPARK_LOCAL_IP=127.0.0.1

[EnvInject] - Variables injected successfully.
[Gradle] - Launching build.
[src] $ <https://ci-beam.apache.org/job/beam_PostCommit_Python36_Pytest/ws/src/gradlew>
--continue --max-workers=12 -Dorg.gradle.jvmargs=-Xms2g -Dorg.gradle.jvmargs=-Xmx4g :python36PostCommitPytest
Starting a Gradle Daemon, 2 busy Daemons could not be reused, use --status for details
> Task :buildSrc:compileJava NO-SOURCE
> Task :buildSrc:compileGroovy FROM-CACHE
> Task :buildSrc:pluginDescriptors
> Task :buildSrc:processResources
> Task :buildSrc:classes
> Task :buildSrc:jar
> Task :buildSrc:assemble
> Task :buildSrc:spotlessGroovy FROM-CACHE
> Task :buildSrc:spotlessGroovyCheck UP-TO-DATE
> Task :buildSrc:spotlessGroovyGradle FROM-CACHE
> Task :buildSrc:spotlessGroovyGradleCheck UP-TO-DATE
> Task :buildSrc:spotlessCheck UP-TO-DATE
> Task :buildSrc:pluginUnderTestMetadata
> Task :buildSrc:compileTestJava NO-SOURCE
> Task :buildSrc:compileTestGroovy NO-SOURCE
> Task :buildSrc:processTestResources NO-SOURCE
> Task :buildSrc:testClasses UP-TO-DATE
> Task :buildSrc:test NO-SOURCE
> Task :buildSrc:validatePlugins FROM-CACHE
> Task :buildSrc:check UP-TO-DATE
> Task :buildSrc:build
Configuration on demand is an incubating feature.

FAILURE: Build failed with an exception.

* What went wrong:
Task 'python36PostCommitPytest' not found in root project 'beam'.

* Try:
Run gradlew tasks to get a list of available tasks. Run with --stacktrace option to get the
stack trace. Run with --info or --debug option to get more log output. Run with --scan to
get full insights.

* Get more help at https://help.gradle.org

Deprecated Gradle features were used in this build, making it incompatible with Gradle 7.0.
Use '--warning-mode all' to show the individual deprecation warnings.
See https://docs.gradle.org/6.8/userguide/command_line_interface.html#sec:command_line_warnings

BUILD FAILED in 21s

Publishing build scan...
https://gradle.com/s/x6cfeuozdkxku

Build step 'Invoke Gradle script' changed build result to FAILURE
Build step 'Invoke Gradle script' marked build as failure

---------------------------------------------------------------------
To unsubscribe, e-mail: builds-unsubscribe@beam.apache.org
For additional commands, e-mail: builds-help@beam.apache.org


Mime
View raw message