beam-builds mailing list archives

Site index · List index
Message view « Date » · « Thread »
Top « Date » · « Thread »
From Apache Jenkins Server <jenk...@builds.apache.org>
Subject Build failed in Jenkins: beam_PostCommit_Java #7147
Date Sat, 30 Jan 2021 13:44:54 GMT
See <https://ci-beam.apache.org/job/beam_PostCommit_Java/7147/display/redirect>

Changes:


------------------------------------------
[...truncated 90.45 KB...]
> Task :sdks:java:extensions:zetasketch:testClasses UP-TO-DATE
> Task :runners:spark:compileTestJava FROM-CACHE
> Task :runners:spark:testClasses
> Task :sdks:java:container:java8:copyDockerfileDependencies
> Task :runners:google-cloud-dataflow-java:compileJava FROM-CACHE
> Task :runners:google-cloud-dataflow-java:classes
> Task :examples:java:compileJava FROM-CACHE
> Task :examples:java:classes UP-TO-DATE
> Task :runners:google-cloud-dataflow-java:jar
> Task :examples:java:jar
> Task :examples:java:compileTestJava FROM-CACHE
> Task :examples:java:testClasses
> Task :examples:java:testJar
> Task :sdks:java:io:google-cloud-platform:compileTestJava FROM-CACHE
> Task :sdks:java:io:google-cloud-platform:testClasses

> Task :sdks:go:resolveBuildDependencies
Resolving golang.org/x/net: commit='2fb46b16b8dda405028c50f7c7f0f9dd1fa6bfb1', urls=[https://go.googlesource.com/net]

> Task :runners:google-cloud-dataflow-java:worker:legacy-worker:compileJava FROM-CACHE
> Task :runners:google-cloud-dataflow-java:worker:legacy-worker:classes UP-TO-DATE
> Task :sdks:java:io:hadoop-format:compileTestJava FROM-CACHE
> Task :sdks:java:io:hadoop-format:testClasses
> Task :sdks:java:io:google-cloud-platform:testJar
> Task :runners:google-cloud-dataflow-java:worker:legacy-worker:shadowJar FROM-CACHE
> Task :runners:google-cloud-dataflow-java:coreSDKJavaLegacyWorkerIntegrationTest NO-SOURCE

> Task :sdks:go:resolveBuildDependencies
Resolving golang.org/x/oauth2: commit='5d25da1a8d43b66f2898c444f899c7bcfd6a407e', urls=[https://go.googlesource.com/oauth2]
Resolving golang.org/x/sync: commit='fd80eb99c8f653c847d294a001bdf2a3a6f768f5', urls=[https://go.googlesource.com/sync]

> Task :runners:google-cloud-dataflow-java:examplesJavaLegacyWorkerIntegrationTest FROM-CACHE
> Task :runners:spark:hadoopVersion2101Test FROM-CACHE
> Task :runners:spark:hadoopVersion285Test FROM-CACHE

> Task :sdks:go:resolveBuildDependencies
Resolving golang.org/x/sys: commit='fde4db37ae7ad8191b03d30d27f258b5291ae4e3', urls=[https://go.googlesource.com/sys]

> Task :sdks:java:io:hadoop-file-system:hadoopVersion2101Test
> Task :sdks:java:io:kafka:kafkaVersion01103BatchIT
> Task :sdks:java:io:kinesis:integrationTest
> Task :sdks:java:extensions:ml:integrationTest
> Task :sdks:java:io:hadoop-format:runHadoopFormatIO2101ElasticIT
> Task :sdks:java:io:google-cloud-platform:integrationTest
> Task :runners:spark:hadoopVersion292Test FROM-CACHE
> Task :runners:spark:hadoopVersion321Test FROM-CACHE
> Task :runners:spark:hadoopVersionsTest UP-TO-DATE
> Task :runners:google-cloud-dataflow-java:googleCloudPlatformLegacyWorkerIntegrationTest
FROM-CACHE
> Task :runners:google-cloud-dataflow-java:googleCloudPlatformLegacyWorkerKmsIntegrationTest
FROM-CACHE
> Task :runners:google-cloud-dataflow-java:postCommit UP-TO-DATE
> Task :sdks:java:extensions:zetasketch:integrationTest

> Task :release:go-licenses:java:dockerRun
+ go-licenses save github.com/apache/beam/sdks/java/container --save_path=/output/licenses

> Task :sdks:java:extensions:ml:postCommit

> Task :release:go-licenses:java:dockerRun
+ go-licenses csv github.com/apache/beam/sdks/java/container
+ tee /output/licenses/list.csv
golang.org/x/sys,https://go.googlesource.com/sys/+/refs/heads/master/LICENSE,BSD-3-Clause
github.com/apache/beam/sdks/java/container,https://github.com/apache/beam/blob/master/LICENSE,Apache-2.0
github.com/apache/beam/sdks/go/pkg/beam,https://github.com/apache/beam/blob/master/sdks/go/README.md,Apache-2.0
github.com/golang/protobuf,https://github.com/golang/protobuf/blob/master/LICENSE,BSD-3-Clause
google.golang.org/genproto/googleapis/rpc/status,https://github.com/googleapis/go-genproto/blob/master/LICENSE,Apache-2.0
golang.org/x/text,https://go.googlesource.com/text/+/refs/heads/master/LICENSE,BSD-3-Clause
google.golang.org/protobuf,https://go.googlesource.com/protobuf/+/refs/heads/master/LICENSE,BSD-3-Clause
google.golang.org/grpc,https://github.com/grpc/grpc-go/blob/master/LICENSE,Apache-2.0
golang.org/x/net,https://go.googlesource.com/net/+/refs/heads/master/LICENSE,BSD-3-Clause
+ chmod -R a+w /output/licenses

> Task :sdks:go:resolveBuildDependencies
Resolving golang.org/x/text: commit='23ae387dee1f90d29a23c0e87ee0b46038fbed0e', urls=[https://go.googlesource.com/text]
Resolving cached github.com/etcd-io/etcd: commit='11214aa33bf5a47d3d9d8dafe0f6b97237dfe921',
urls=[https://github.com/etcd-io/etcd.git, git@github.com:etcd-io/etcd.git]

> Task :release:go-licenses:java:createLicenses
> Task :sdks:java:container:java8:copyGolangLicenses
> Task :sdks:java:io:kafka:kafkaVersion01103Test
> Task :sdks:java:io:hadoop-file-system:hadoopVersion285Test
> Task :sdks:java:io:hadoop-format:runHadoopFormatIO2101IT
> Task :sdks:java:io:kafka:kafkaVersion100BatchIT
> Task :sdks:java:io:hadoop-file-system:hadoopVersion292Test
> Task :sdks:java:io:hadoop-format:runHadoopFormatIO2101Test
> Task :sdks:java:io:kafka:kafkaVersion100Test

> Task :sdks:go:resolveBuildDependencies
Resolving google.golang.org/api: commit='0324d5e90dc7753607860272666845fad9ceb97e', urls=[https://code.googlesource.com/google-api-go-client]

> Task :sdks:java:io:google-cloud-platform:integrationTest

org.apache.beam.sdk.io.gcp.healthcare.FhirIOWriteIT > testFhirIO_Import[DSTU2] FAILED
    org.apache.beam.sdk.Pipeline$PipelineExecutionException at FhirIOWriteIT.java:139
        Caused by: java.lang.AssertionError at FhirIOWriteIT.java:137
            Caused by: java.lang.AssertionError at MatcherAssert.java:18

> Task :sdks:java:io:kafka:kafkaVersion111BatchIT
> Task :sdks:java:io:hadoop-file-system:hadoopVersion321Test
> Task :sdks:java:io:hadoop-file-system:hadoopVersionsTest
> Task :sdks:java:io:hadoop-format:runHadoopFormatIO285ElasticIT
> Task :sdks:java:io:kafka:kafkaVersion111Test

> Task :sdks:go:resolveBuildDependencies
Resolving google.golang.org/genproto: commit='4d944d34d83c502a5f761500a14d8842648415c3', urls=[https://github.com/google/go-genproto]
Resolving google.golang.org/grpc: commit='5e8f83304c0563d1ba74db05fee83d9c18ab9a58', urls=[https://github.com/grpc/grpc-go]
Resolving google.golang.org/protobuf: commit='d165be301fb1e13390ad453281ded24385fd8ebc', urls=[https://go.googlesource.com/protobuf]
Resolving cached github.com/etcd-io/etcd: commit='11214aa33bf5a47d3d9d8dafe0f6b97237dfe921',
urls=[https://github.com/etcd-io/etcd.git, git@github.com:etcd-io/etcd.git]
Resolving cached github.com/etcd-io/etcd: commit='11214aa33bf5a47d3d9d8dafe0f6b97237dfe921',
urls=[https://github.com/etcd-io/etcd.git, git@github.com:etcd-io/etcd.git]

> Task :sdks:java:io:kafka:kafkaVersion201BatchIT
> Task :sdks:go:installDependencies
> Task :sdks:java:io:hadoop-format:runHadoopFormatIO285IT
> Task :sdks:java:io:kafka:kafkaVersion201Test
> Task :sdks:java:io:hadoop-format:runHadoopFormatIO285Test
> Task :sdks:java:io:kafka:kafkaVersion211BatchIT
> Task :sdks:java:io:kafka:kafkaVersion211Test
> Task :sdks:go:buildLinuxAmd64
> Task :sdks:go:goBuild

> Task :sdks:java:container:resolveBuildDependencies
Resolving ./github.com/apache/beam/sdks/go@<https://ci-beam.apache.org/job/beam_PostCommit_Java/ws/src/sdks/go>

> Task :sdks:java:container:installDependencies

> Task :sdks:java:container:buildLinuxAmd64
Unable to watch the file system for changes. The inotify watches limit is too low.

> Task :sdks:java:container:goBuild
> Task :sdks:java:container:java8:copySdkHarnessLauncher
> Task :sdks:java:io:hadoop-format:runHadoopFormatIO292ElasticIT
> Task :sdks:java:container:java8:dockerPrepare
> Task :sdks:java:io:kafka:kafkaVersion222BatchIT

> Task :sdks:java:io:google-cloud-platform:integrationTest

43 tests completed, 1 failed, 1 skipped

> Task :sdks:java:io:google-cloud-platform:integrationTest FAILED

> Task :sdks:java:container:java8:docker
Removing intermediate container 0122e84bbbbe
 ---> 045fe892182f
Step 16/17 : RUN if [ "${pull_licenses}" = "false" ] ; then     rm -rf /opt/apache/beam/third_party_licenses
;    fi
 ---> Running in 6a31662576ad

> Task :runners:google-cloud-dataflow-java:buildAndPushDockerContainer
WARNING: `gcloud docker` will not be supported for Docker client versions above 18.03.

As an alternative, use `gcloud auth configure-docker` to configure `docker` to
use `gcloud` as a credential helper, then use `docker` as you would for non-GCR
registries, e.g. `docker pull gcr.io/project-id/my-image`. Add
`--verbosity=error` to silence this warning: `gcloud docker
--verbosity=error -- pull gcr.io/project-id/my-image`.

See: https://cloud.google.com/container-registry/docs/support/deprecation-notices#gcloud-docker


> Task :runners:google-cloud-dataflow-java:coreSDKJavaRunnerV2IntegrationTest NO-SOURCE
> Task :sdks:java:io:google-cloud-platform:integrationTestKms
> Task :sdks:java:io:kafka:kafkaVersion222Test
> Task :runners:google-cloud-dataflow-java:examplesJavaRunnerV2IntegrationTest
> Task :sdks:java:io:hadoop-format:runHadoopFormatIO292IT
> Task :sdks:java:io:kafka:kafkaVersion231BatchIT
> Task :sdks:java:io:hadoop-format:runHadoopFormatIO292Test
> Task :sdks:java:io:kafka:kafkaVersion231Test
> Task :sdks:java:io:kafka:kafkaVersion241BatchIT
> Task :sdks:java:io:hadoop-format:runHadoopFormatIO321ElasticIT
> Task :sdks:java:io:kafka:kafkaVersion241Test
> Task :sdks:java:io:kafka:kafkaVersion251BatchIT
> Task :sdks:java:io:hadoop-format:runHadoopFormatIO321IT
> Task :sdks:java:io:kafka:kafkaVersion251Test
> Task :sdks:java:io:kafka:kafkaVersionsCompatibilityTest
> Task :sdks:java:io:hadoop-format:runHadoopFormatIO321Test
> Task :sdks:java:io:hadoop-format:hadoopVersionsTest
> Task :javaHadoopVersionsTest

> Task :runners:google-cloud-dataflow-java:examplesJavaRunnerV2IntegrationTest

***********************************************************
***********************************************************
**********************Set Up Pubsub************************
The Pub/Sub topic has been set up for this example: projects/apache-beam-testing/topics/testpipeline-jenkins-0130121228-13345e56
The Pub/Sub subscription has been set up for this example: projects/apache-beam-testing/subscriptions/testpipeline-jenkins-0130121228-13345e56
******************Set Up Big Query Table*******************
The BigQuery table has been set up for this example: apache-beam-testing:traffic_routes_1612008739941.traffic_routes_table
*************************Tear Down*************************
The Pub/Sub topic has been deleted: projects/apache-beam-testing/topics/testpipeline-jenkins-0130121228-13345e56
The Pub/Sub subscription has been deleted: projects/apache-beam-testing/subscriptions/testpipeline-jenkins-0130121228-13345e56
The BigQuery table might contain the example's output, and it is not deleted automatically:
apache-beam-testing:traffic_routes_1612008739941.traffic_routes_table
Please go to the Developers Console to delete it manually. Otherwise, you may be charged for
its usage.
***********************************************************
***********************************************************

> Task :sdks:java:extensions:zetasketch:postCommit

> Task :runners:google-cloud-dataflow-java:examplesJavaRunnerV2IntegrationTest

***********************************************************
***********************************************************
**********************Set Up Pubsub************************
The Pub/Sub topic has been set up for this example: projects/apache-beam-testing/topics/testpipeline-jenkins-0130123847-5a2a40e6
The Pub/Sub subscription has been set up for this example: projects/apache-beam-testing/subscriptions/testpipeline-jenkins-0130123847-5a2a40e6
******************Set Up Big Query Table*******************
The BigQuery table has been set up for this example: apache-beam-testing:traffic_max_lane_flow_1612010326721.traffic_max_lane_flow_table
*************************Tear Down*************************
The Pub/Sub topic has been deleted: projects/apache-beam-testing/topics/testpipeline-jenkins-0130123847-5a2a40e6
The Pub/Sub subscription has been deleted: projects/apache-beam-testing/subscriptions/testpipeline-jenkins-0130123847-5a2a40e6
The BigQuery table might contain the example's output, and it is not deleted automatically:
apache-beam-testing:traffic_max_lane_flow_1612010326721.traffic_max_lane_flow_table
Please go to the Developers Console to delete it manually. Otherwise, you may be charged for
its usage.
***********************************************************
***********************************************************

> Task :runners:google-cloud-dataflow-java:googleCloudPlatformRunnerV2IntegrationTest

> Task :runners:google-cloud-dataflow-java:cleanUpDockerImages
Digests:
- us.gcr.io/apache-beam-testing/java-postcommit-it/java@sha256:bed3d03d32741d439147027bc92effda3848229d158ee47249c5f7d74029f250
  Associated tags:
 - 20210130120049
Tags:
- us.gcr.io/apache-beam-testing/java-postcommit-it/java:20210130120049
Deleted [us.gcr.io/apache-beam-testing/java-postcommit-it/java:20210130120049].
Deleted [us.gcr.io/apache-beam-testing/java-postcommit-it/java@sha256:bed3d03d32741d439147027bc92effda3848229d158ee47249c5f7d74029f250].

> Task :runners:google-cloud-dataflow-java:postCommitRunnerV2

FAILURE: Build failed with an exception.

* What went wrong:
Execution failed for task ':sdks:java:io:google-cloud-platform:integrationTest'.
> There were failing tests. See the report at: file://<https://ci-beam.apache.org/job/beam_PostCommit_Java/ws/src/sdks/java/io/google-cloud-platform/build/reports/tests/integrationTest/index.html>

* Try:
Run with --stacktrace option to get the stack trace. Run with --info or --debug option to
get more log output. Run with --scan to get full insights.

* Get more help at https://help.gradle.org

Deprecated Gradle features were used in this build, making it incompatible with Gradle 7.0.
Use '--warning-mode all' to show the individual deprecation warnings.
See https://docs.gradle.org/6.8/userguide/command_line_interface.html#sec:command_line_warnings

BUILD FAILED in 1h 44m 30s
248 actionable tasks: 156 executed, 90 from cache, 2 up-to-date
Gradle was unable to watch the file system for changes. The inotify watches limit is too low.

Publishing build scan...
https://gradle.com/s/hey7rnqgngeko

Build step 'Invoke Gradle script' changed build result to FAILURE
Build step 'Invoke Gradle script' marked build as failure

---------------------------------------------------------------------
To unsubscribe, e-mail: builds-unsubscribe@beam.apache.org
For additional commands, e-mail: builds-help@beam.apache.org


Mime
View raw message