beam-builds mailing list archives

Site index · List index
Message view « Date » · « Thread »
Top « Date » · « Thread »
From Apache Jenkins Server <jenk...@builds.apache.org>
Subject Build failed in Jenkins: beam_PostCommit_Py_VR_Dataflow_V2 #1592
Date Fri, 29 Jan 2021 13:23:13 GMT
See <https://ci-beam.apache.org/job/beam_PostCommit_Py_VR_Dataflow_V2/1592/display/redirect>

Changes:


------------------------------------------
[...truncated 6.67 MB...]
              "is_wrapper": true
            },
            "output_name": "None",
            "user_name": "assert_that/Unkey.out"
          }
        ],
        "parallel_input": {
          "@type": "OutputReference",
          "output_name": "None",
          "step_name": "s19"
        },
        "serialized_fn": "ref_AppliedPTransform_assert_that/Unkey_29",
        "user_name": "assert_that/Unkey"
      }
    },
    {
      "kind": "ParallelDo",
      "name": "s21",
      "properties": {
        "display_data": [
          {
            "key": "fn",
            "label": "Transform Function",
            "namespace": "apache_beam.transforms.core.ParDo",
            "shortValue": "CallableWrapperDoFn",
            "type": "STRING",
            "value": "apache_beam.transforms.core.CallableWrapperDoFn"
          },
          {
            "key": "fn",
            "label": "Transform Function",
            "namespace": "apache_beam.transforms.core.CallableWrapperDoFn",
            "type": "STRING",
            "value": "_equal"
          }
        ],
        "non_parallel_inputs": {},
        "output_info": [
          {
            "encoding": {
              "@type": "kind:windowed_value",
              "component_encodings": [
                {
                  "@type": "FastPrimitivesCoder$eNprYJmaxgABPZKJBYnJGanxSamJuXrJ+SmpRcVQakqPsFticUlAUWZuZklmWWqxM0h4yuQpmo1Taqf08MenJebkJCUmZ8eD1U/JYOjhDshMzs5JRVGYVJykBwDOUCqY",
                  "component_encodings": [
                    {
                      "@type": "FastPrimitivesCoder$eNprYJmaxgABPZKJBYnJGanxSamJuXrJ+SmpRcVQakqPsFticUlAUWZuZklmWWqxM0h4yuQpmo1Taqf08MenJebkJCUmZ8eD1U/JYOjhDshMzs5JRVGYVJykBwDOUCqY",
                      "component_encodings": [],
                      "pipeline_proto_coder_id": "ref_Coder_FastPrimitivesCoder_6"
                    },
                    {
                      "@type": "FastPrimitivesCoder$eNprYJmaxgABPZKJBYnJGanxSamJuXrJ+SmpRcVQakqPsFticUlAUWZuZklmWWqxM0h4yuQpmo1Taqf08MenJebkJCUmZ8eD1U/JYOjhDshMzs5JRVGYVJykBwDOUCqY",
                      "component_encodings": [],
                      "pipeline_proto_coder_id": "ref_Coder_FastPrimitivesCoder_6"
                    }
                  ],
                  "is_pair_like": true,
                  "pipeline_proto_coder_id": "ref_Coder_FastPrimitivesCoder_6"
                },
                {
                  "@type": "kind:global_window"
                }
              ],
              "is_wrapper": true
            },
            "output_name": "None",
            "user_name": "assert_that/Match.out"
          }
        ],
        "parallel_input": {
          "@type": "OutputReference",
          "output_name": "None",
          "step_name": "s20"
        },
        "serialized_fn": "ref_AppliedPTransform_assert_that/Match_30",
        "user_name": "assert_that/Match"
      }
    }
  ],
  "type": "JOB_TYPE_STREAMING"
}
INFO:apache_beam.runners.dataflow.internal.apiclient:Create job: <Job
 createTime: '2021-01-29T13:15:08.853672Z'
 currentStateTime: '1970-01-01T00:00:00Z'
 id: '2021-01-29_05_15_07-17131632326069559931'
 location: 'us-central1'
 name: 'beamapp-jenkins-0129131459-717453'
 projectId: 'apache-beam-testing'
 stageStates: []
 startTime: '2021-01-29T13:15:08.853672Z'
 steps: []
 tempFiles: []
 type: TypeValueValuesEnum(JOB_TYPE_STREAMING, 2)>
INFO:apache_beam.runners.dataflow.internal.apiclient:Created job with id: [2021-01-29_05_15_07-17131632326069559931]
INFO:apache_beam.runners.dataflow.internal.apiclient:Submitted job: 2021-01-29_05_15_07-17131632326069559931
INFO:apache_beam.runners.dataflow.internal.apiclient:To access the Dataflow monitoring console,
please navigate to https://console.cloud.google.com/dataflow/jobs/us-central1/2021-01-29_05_15_07-17131632326069559931?project=apache-beam-testing
WARNING:apache_beam.runners.dataflow.test_dataflow_runner:Waiting indefinitely for streaming
job.
INFO:apache_beam.runners.dataflow.dataflow_runner:Job 2021-01-29_05_15_07-17131632326069559931
is in state JOB_STATE_RUNNING
INFO:apache_beam.runners.dataflow.dataflow_runner:2021-01-29T13:15:07.403Z: JOB_MESSAGE_WARNING:
Autoscaling is enabled for Dataflow Streaming Engine. Workers will scale between 1 and 100
unless maxNumWorkers is specified.
INFO:apache_beam.runners.dataflow.dataflow_runner:2021-01-29T13:15:07.403Z: JOB_MESSAGE_DETAILED:
Autoscaling is enabled for job 2021-01-29_05_15_07-17131632326069559931. The number of workers
will be between 1 and 100.
INFO:apache_beam.runners.dataflow.dataflow_runner:2021-01-29T13:15:07.403Z: JOB_MESSAGE_DETAILED:
Autoscaling was automatically enabled for job 2021-01-29_05_15_07-17131632326069559931.
INFO:apache_beam.runners.dataflow.dataflow_runner:2021-01-29T13:15:12.711Z: JOB_MESSAGE_BASIC:
Worker configuration: n1-standard-2 in us-central1-f.
INFO:apache_beam.runners.dataflow.dataflow_runner:2021-01-29T13:15:13.304Z: JOB_MESSAGE_DETAILED:
Expanding SplittableParDo operations into optimizable parts.
INFO:apache_beam.runners.dataflow.dataflow_runner:2021-01-29T13:15:13.339Z: JOB_MESSAGE_DETAILED:
Expanding CollectionToSingleton operations into optimizable parts.
INFO:apache_beam.runners.dataflow.dataflow_runner:2021-01-29T13:15:13.434Z: JOB_MESSAGE_DETAILED:
Expanding CoGroupByKey operations into optimizable parts.
INFO:apache_beam.runners.dataflow.dataflow_runner:2021-01-29T13:15:13.471Z: JOB_MESSAGE_DEBUG:
Combiner lifting skipped for step assert_that/Group/GroupByKey: GroupByKey not followed by
a combiner.
INFO:apache_beam.runners.dataflow.dataflow_runner:2021-01-29T13:15:13.517Z: JOB_MESSAGE_DEBUG:
Combiner lifting skipped for step Create/MaybeReshuffle/Reshuffle/ReshufflePerKey/GroupByKey:
GroupByKey not followed by a combiner.
INFO:apache_beam.runners.dataflow.dataflow_runner:2021-01-29T13:15:13.547Z: JOB_MESSAGE_DETAILED:
Expanding SplittableProcessKeyed operations into optimizable parts.
INFO:apache_beam.runners.dataflow.dataflow_runner:2021-01-29T13:15:13.579Z: JOB_MESSAGE_DETAILED:
Expanding GroupByKey operations into streaming Read/Write steps
INFO:apache_beam.runners.dataflow.dataflow_runner:2021-01-29T13:15:13.745Z: JOB_MESSAGE_DETAILED:
Lifting ValueCombiningMappingFns into MergeBucketsMappingFns
INFO:apache_beam.runners.dataflow.dataflow_runner:2021-01-29T13:15:13.876Z: JOB_MESSAGE_DEBUG:
Annotating graph with Autotuner information.
INFO:apache_beam.runners.dataflow.dataflow_runner:2021-01-29T13:15:13.926Z: JOB_MESSAGE_DETAILED:
Fusing adjacent ParDo, Read, Write, and Flatten operations
INFO:apache_beam.runners.dataflow.dataflow_runner:2021-01-29T13:15:13.962Z: JOB_MESSAGE_DETAILED:
Unzipping flatten s17 for input s15.None
INFO:apache_beam.runners.dataflow.dataflow_runner:2021-01-29T13:15:13.995Z: JOB_MESSAGE_DETAILED:
Fusing unzipped copy of assert_that/Group/GroupByKey/WriteStream, through flatten assert_that/Group/Flatten,
into producer assert_that/Group/pair_with_0
INFO:apache_beam.runners.dataflow.dataflow_runner:2021-01-29T13:15:14.028Z: JOB_MESSAGE_DETAILED:
Fusing consumer assert_that/Group/GroupByKey/WriteStream into assert_that/Group/pair_with_1
INFO:apache_beam.runners.dataflow.dataflow_runner:2021-01-29T13:15:14.056Z: JOB_MESSAGE_DETAILED:
Fusing consumer Create/FlatMap(<lambda at core.py:2957>) into Create/Impulse
INFO:apache_beam.runners.dataflow.dataflow_runner:2021-01-29T13:15:14.104Z: JOB_MESSAGE_DETAILED:
Fusing consumer assert_that/Create/FlatMap(<lambda at core.py:2957>) into assert_that/Create/Impulse
INFO:apache_beam.runners.dataflow.dataflow_runner:2021-01-29T13:15:14.141Z: JOB_MESSAGE_DETAILED:
Fusing consumer assert_that/Create/Map(decode) into assert_that/Create/FlatMap(<lambda
at core.py:2957>)
INFO:apache_beam.runners.dataflow.dataflow_runner:2021-01-29T13:15:14.176Z: JOB_MESSAGE_DETAILED:
Fusing consumer assert_that/Group/pair_with_0 into assert_that/Create/Map(decode)
INFO:apache_beam.runners.dataflow.dataflow_runner:2021-01-29T13:15:14.214Z: JOB_MESSAGE_DETAILED:
Fusing consumer Create/MaybeReshuffle/Reshuffle/AddRandomKeys into Create/FlatMap(<lambda
at core.py:2957>)
INFO:apache_beam.runners.dataflow.dataflow_runner:2021-01-29T13:15:14.251Z: JOB_MESSAGE_DETAILED:
Fusing consumer Create/MaybeReshuffle/Reshuffle/ReshufflePerKey/Map(reify_timestamps) into
Create/MaybeReshuffle/Reshuffle/AddRandomKeys
INFO:apache_beam.runners.dataflow.dataflow_runner:2021-01-29T13:15:14.279Z: JOB_MESSAGE_DETAILED:
Fusing consumer Create/MaybeReshuffle/Reshuffle/ReshufflePerKey/GroupByKey/WriteStream into
Create/MaybeReshuffle/Reshuffle/ReshufflePerKey/Map(reify_timestamps)
INFO:apache_beam.runners.dataflow.dataflow_runner:2021-01-29T13:15:14.319Z: JOB_MESSAGE_DETAILED:
Fusing consumer Create/MaybeReshuffle/Reshuffle/ReshufflePerKey/GroupByKey/MergeBuckets into
Create/MaybeReshuffle/Reshuffle/ReshufflePerKey/GroupByKey/ReadStream
INFO:apache_beam.runners.dataflow.dataflow_runner:2021-01-29T13:15:14.358Z: JOB_MESSAGE_DETAILED:
Fusing consumer Create/MaybeReshuffle/Reshuffle/ReshufflePerKey/FlatMap(restore_timestamps)
into Create/MaybeReshuffle/Reshuffle/ReshufflePerKey/GroupByKey/MergeBuckets
INFO:apache_beam.runners.dataflow.dataflow_runner:2021-01-29T13:15:14.395Z: JOB_MESSAGE_DETAILED:
Fusing consumer Create/MaybeReshuffle/Reshuffle/RemoveRandomKeys into Create/MaybeReshuffle/Reshuffle/ReshufflePerKey/FlatMap(restore_timestamps)
INFO:apache_beam.runners.dataflow.dataflow_runner:2021-01-29T13:15:14.420Z: JOB_MESSAGE_DETAILED:
Fusing consumer Create/Map(decode) into Create/MaybeReshuffle/Reshuffle/RemoveRandomKeys
INFO:apache_beam.runners.dataflow.dataflow_runner:2021-01-29T13:15:14.451Z: JOB_MESSAGE_DETAILED:
Fusing consumer Key param into Create/Map(decode)
INFO:apache_beam.runners.dataflow.dataflow_runner:2021-01-29T13:15:14.512Z: JOB_MESSAGE_DETAILED:
Fusing consumer assert_that/WindowInto(WindowIntoFn) into Key param
INFO:apache_beam.runners.dataflow.dataflow_runner:2021-01-29T13:15:14.532Z: JOB_MESSAGE_DETAILED:
Fusing consumer assert_that/ToVoidKey into assert_that/WindowInto(WindowIntoFn)
INFO:apache_beam.runners.dataflow.dataflow_runner:2021-01-29T13:15:14.568Z: JOB_MESSAGE_DETAILED:
Fusing consumer assert_that/Group/pair_with_1 into assert_that/ToVoidKey
INFO:apache_beam.runners.dataflow.dataflow_runner:2021-01-29T13:15:14.599Z: JOB_MESSAGE_DETAILED:
Fusing consumer assert_that/Group/GroupByKey/MergeBuckets into assert_that/Group/GroupByKey/ReadStream
INFO:apache_beam.runners.dataflow.dataflow_runner:2021-01-29T13:15:14.649Z: JOB_MESSAGE_DETAILED:
Fusing consumer assert_that/Group/Map(_merge_tagged_vals_under_key) into assert_that/Group/GroupByKey/MergeBuckets
INFO:apache_beam.runners.dataflow.dataflow_runner:2021-01-29T13:15:14.695Z: JOB_MESSAGE_DETAILED:
Fusing consumer assert_that/Unkey into assert_that/Group/Map(_merge_tagged_vals_under_key)
INFO:apache_beam.runners.dataflow.dataflow_runner:2021-01-29T13:15:14.748Z: JOB_MESSAGE_DETAILED:
Fusing consumer assert_that/Match into assert_that/Unkey
INFO:apache_beam.runners.dataflow.dataflow_runner:2021-01-29T13:15:14.788Z: JOB_MESSAGE_DEBUG:
Workflow config is missing a default resource spec.
INFO:apache_beam.runners.dataflow.dataflow_runner:2021-01-29T13:15:14.823Z: JOB_MESSAGE_DEBUG:
Adding StepResource setup and teardown to workflow graph.
INFO:apache_beam.runners.dataflow.dataflow_runner:2021-01-29T13:15:14.858Z: JOB_MESSAGE_DEBUG:
Adding workflow start and stop steps.
INFO:apache_beam.runners.dataflow.dataflow_runner:2021-01-29T13:15:14.893Z: JOB_MESSAGE_DEBUG:
Assigning stage ids.
INFO:apache_beam.runners.dataflow.dataflow_runner:2021-01-29T13:15:16.060Z: JOB_MESSAGE_DEBUG:
Starting worker pool setup.
INFO:apache_beam.runners.dataflow.dataflow_runner:2021-01-29T13:15:16.087Z: JOB_MESSAGE_BASIC:
Starting 1 workers in us-central1-f...
INFO:apache_beam.runners.dataflow.dataflow_runner:2021-01-29T13:15:16.127Z: JOB_MESSAGE_DEBUG:
Starting worker pool setup.
INFO:apache_beam.runners.dataflow.dataflow_runner:2021-01-29T13:15:27.446Z: JOB_MESSAGE_BASIC:
Your project already contains 100 Dataflow-created metric descriptors, so new user metrics
of the form custom.googleapis.com/* will not be created. However, all user metrics are also
available in the metric dataflow.googleapis.com/job/user_counter. If you rely on the custom
metrics, you can delete old / unused metric descriptors. See https://developers.google.com/apis-explorer/#p/monitoring/v3/monitoring.projects.metricDescriptors.list
and https://developers.google.com/apis-explorer/#p/monitoring/v3/monitoring.projects.metricDescriptors.delete
INFO:apache_beam.runners.dataflow.dataflow_runner:2021-01-29T13:15:54.535Z: JOB_MESSAGE_DETAILED:
Autoscaling: Raised the number of workers to 1 so that the pipeline can catch up with its
backlog and keep up with its input rate.
INFO:apache_beam.runners.dataflow.dataflow_runner:2021-01-29T13:16:29.871Z: JOB_MESSAGE_DETAILED:
Workers have started successfully.
INFO:apache_beam.runners.dataflow.dataflow_runner:2021-01-29T13:16:29.897Z: JOB_MESSAGE_DETAILED:
Workers have started successfully.
INFO:apache_beam.runners.dataflow.dataflow_runner:2021-01-29T13:22:17.161Z: JOB_MESSAGE_DETAILED:
Cleaning up.
INFO:apache_beam.runners.dataflow.dataflow_runner:2021-01-29T13:22:17.237Z: JOB_MESSAGE_DEBUG:
Starting worker pool teardown.
INFO:apache_beam.runners.dataflow.dataflow_runner:2021-01-29T13:22:17.270Z: JOB_MESSAGE_BASIC:
Stopping worker pool...
INFO:apache_beam.runners.dataflow.dataflow_runner:2021-01-29T13:22:17.386Z: JOB_MESSAGE_DEBUG:
Starting worker pool teardown.
INFO:apache_beam.runners.dataflow.dataflow_runner:2021-01-29T13:22:17.425Z: JOB_MESSAGE_BASIC:
Stopping worker pool...
INFO:apache_beam.runners.dataflow.dataflow_runner:2021-01-29T13:22:58.812Z: JOB_MESSAGE_DETAILED:
Autoscaling: Reduced the number of workers to 0 based on low average worker CPU utilization,
and the pipeline having sufficiently low backlog and keeping up with input rate.
INFO:apache_beam.runners.dataflow.dataflow_runner:2021-01-29T13:22:58.883Z: JOB_MESSAGE_BASIC:
Worker pool stopped.
INFO:apache_beam.runners.dataflow.dataflow_runner:2021-01-29T13:22:58.910Z: JOB_MESSAGE_DEBUG:
Tearing down pending resources...
INFO:apache_beam.runners.dataflow.dataflow_runner:Job 2021-01-29_05_15_07-17131632326069559931
is in state JOB_STATE_DONE
Worker logs: https://console.cloud.google.com/dataflow/jobs/us-central1/2021-01-29_04_41_49-8707297944364576012?project=apache-beam-testing
Worker logs: https://console.cloud.google.com/dataflow/jobs/us-central1/2021-01-29_04_50_05-8782828044982589652?project=apache-beam-testing
Worker logs: https://console.cloud.google.com/dataflow/jobs/us-central1/2021-01-29_04_57_29-16015085516847717241?project=apache-beam-testing
Worker logs: https://console.cloud.google.com/dataflow/jobs/us-central1/2021-01-29_05_05_44-6995568186443875473?project=apache-beam-testing
Worker logs: https://console.cloud.google.com/dataflow/jobs/us-central1/2021-01-29_04_41_49-15027957373652454783?project=apache-beam-testing
Worker logs: https://console.cloud.google.com/dataflow/jobs/us-central1/2021-01-29_04_49_30-4075966387854909396?project=apache-beam-testing
Worker logs: https://console.cloud.google.com/dataflow/jobs/us-central1/2021-01-29_04_58_49-3178659971786946210?project=apache-beam-testing
Worker logs: https://console.cloud.google.com/dataflow/jobs/us-central1/2021-01-29_04_41_47-763914954283908277?project=apache-beam-testing
Worker logs: https://console.cloud.google.com/dataflow/jobs/us-central1/2021-01-29_04_50_13-4106420663359313232?project=apache-beam-testing
Worker logs: https://console.cloud.google.com/dataflow/jobs/us-central1/2021-01-29_05_02_18-15600196390746028686?project=apache-beam-testing
Worker logs: https://console.cloud.google.com/dataflow/jobs/us-central1/2021-01-29_04_41_47-4468306517312395853?project=apache-beam-testing
Worker logs: https://console.cloud.google.com/dataflow/jobs/us-central1/2021-01-29_04_50_06-11290184763918083550?project=apache-beam-testing
Worker logs: https://console.cloud.google.com/dataflow/jobs/us-central1/2021-01-29_04_58_25-4012537305366478929?project=apache-beam-testing
Worker logs: https://console.cloud.google.com/dataflow/jobs/us-central1/2021-01-29_04_41_49-8838391638509837933?project=apache-beam-testing
Worker logs: https://console.cloud.google.com/dataflow/jobs/us-central1/2021-01-29_04_50_04-5278732775278387156?project=apache-beam-testing
Worker logs: https://console.cloud.google.com/dataflow/jobs/us-central1/2021-01-29_05_00_05-15962781305266479326?project=apache-beam-testing
Worker logs: https://console.cloud.google.com/dataflow/jobs/us-central1/2021-01-29_04_41_48-13707887525570390094?project=apache-beam-testing
Worker logs: https://console.cloud.google.com/dataflow/jobs/us-central1/2021-01-29_04_50_08-9293545093082808970?project=apache-beam-testing
Worker logs: https://console.cloud.google.com/dataflow/jobs/us-central1/2021-01-29_04_58_30-18016557046979971043?project=apache-beam-testing
Worker logs: https://console.cloud.google.com/dataflow/jobs/us-central1/2021-01-29_04_41_47-17805627426405123284?project=apache-beam-testing
Worker logs: https://console.cloud.google.com/dataflow/jobs/us-central1/2021-01-29_04_51_56-9065146045195208363?project=apache-beam-testing
Worker logs: https://console.cloud.google.com/dataflow/jobs/us-central1/2021-01-29_05_01_45-5185775050331013232?project=apache-beam-testing
Worker logs: https://console.cloud.google.com/dataflow/jobs/us-central1/2021-01-29_04_41_49-841991466794922490?project=apache-beam-testing
Worker logs: https://console.cloud.google.com/dataflow/jobs/us-central1/2021-01-29_04_50_13-17746653580089870418?project=apache-beam-testing
Worker logs: https://console.cloud.google.com/dataflow/jobs/us-central1/2021-01-29_04_58_33-12297489417473360003?project=apache-beam-testing
Worker logs: https://console.cloud.google.com/dataflow/jobs/us-central1/2021-01-29_05_06_47-13700644247320398586?project=apache-beam-testing
Worker logs: https://console.cloud.google.com/dataflow/jobs/us-central1/2021-01-29_05_15_07-17131632326069559931?project=apache-beam-testing
test_gbk_many_values (apache_beam.runners.portability.fn_api_runner.fn_runner_test.FnApiBasedStateBackedCoderTest)
... ok
Test TimestampCombiner with EARLIEST. ... ok
Test TimestampCombiner with LATEST. ... ok
Runs streaming Dataflow job and verifies that user metrics are reported ... ok
test_flatten_pcollections (apache_beam.transforms.ptransform_test.PTransformTest) ... ok
test_user_counter_using_pardo (apache_beam.metrics.metric_test.MetricsTest) ... ok
test_flatten_a_flattened_pcollection (apache_beam.transforms.ptransform_test.PTransformTest)
... ok
test_flatten_one_single_pcollection (apache_beam.transforms.ptransform_test.PTransformTest)
... ok
test_flatten_multiple_pcollections_having_multiple_consumers (apache_beam.transforms.ptransform_test.PTransformTest)
... ok
test_dofn_lifecycle (apache_beam.transforms.dofn_lifecycle_test.DoFnLifecycleTest) ... ok
test_par_do_with_multiple_outputs_and_using_return (apache_beam.transforms.ptransform_test.PTransformTest)
... ok
test_par_do_with_multiple_outputs_and_using_yield (apache_beam.transforms.ptransform_test.PTransformTest)
... ok
test_as_dict_twice (apache_beam.transforms.sideinputs_test.SideInputsTest) ... ok
test_impulse (apache_beam.transforms.ptransform_test.PTransformTest) ... ok
test_multiple_empty_outputs (apache_beam.transforms.ptransform_test.PTransformTest) ... ok
test_as_list_and_as_dict_side_inputs (apache_beam.transforms.sideinputs_test.SideInputsTest)
... ok
test_undeclared_outputs (apache_beam.transforms.ptransform_test.PTransformTest) ... ok
test_as_list_twice (apache_beam.transforms.sideinputs_test.SideInputsTest) ... ok
test_as_singleton_without_unique_labels (apache_beam.transforms.sideinputs_test.SideInputsTest)
... ok
test_as_singleton_with_different_defaults (apache_beam.transforms.sideinputs_test.SideInputsTest)
... ok
test_default_value_singleton_side_input (apache_beam.transforms.sideinputs_test.SideInputsTest)
... ok
test_combine (apache_beam.transforms.combinefn_lifecycle_test.CombineFnLifecycleTest) ...
ok
test_combining_value_state (apache_beam.transforms.combinefn_lifecycle_test.CombineFnLifecycleTest)
... ok
test_non_liftable_combine (apache_beam.transforms.combinefn_lifecycle_test.CombineFnLifecycleTest)
... ok
test_empty_singleton_side_input (apache_beam.transforms.sideinputs_test.SideInputsTest) ...
ok
test_flattened_side_input (apache_beam.transforms.sideinputs_test.SideInputsTest) ... ok
test_iterable_side_input (apache_beam.transforms.sideinputs_test.SideInputsTest) ... ok
test_reshuffle_preserves_timestamps (apache_beam.transforms.util_test.ReshuffleTest) ... ok
test_element_param (apache_beam.pipeline_test.DoFnTest) ... ok
test_key_param (apache_beam.pipeline_test.DoFnTest) ... ok

----------------------------------------------------------------------
XML: nosetests-validatesRunnerStreamingTests-df-py38.xml
----------------------------------------------------------------------
XML: <https://ci-beam.apache.org/job/beam_PostCommit_Py_VR_Dataflow_V2/ws/src/sdks/python/nosetests.xml>
----------------------------------------------------------------------
Ran 30 tests in 2498.577s

OK

> Task :sdks:python:test-suites:dataflow:validatesRunnerStreamingTestsV2

FAILURE: Build failed with an exception.

* Where:
Script '<https://ci-beam.apache.org/job/beam_PostCommit_Py_VR_Dataflow_V2/ws/src/sdks/python/test-suites/dataflow/common.gradle'>
line: 146

* What went wrong:
Execution failed for task ':sdks:python:test-suites:dataflow:py38:validatesRunnerBatchTests'.
> Process 'command 'sh'' finished with non-zero exit value 1

* Try:
Run with --stacktrace option to get the stack trace. Run with --info or --debug option to
get more log output. Run with --scan to get full insights.

* Get more help at https://help.gradle.org

Deprecated Gradle features were used in this build, making it incompatible with Gradle 7.0.
Use '--warning-mode all' to show the individual deprecation warnings.
See https://docs.gradle.org/6.8/userguide/command_line_interface.html#sec:command_line_warnings

BUILD FAILED in 1h 22m 42s
81 actionable tasks: 51 executed, 30 from cache

Publishing build scan...
https://gradle.com/s/zah7ehsvg3taa

Build step 'Invoke Gradle script' changed build result to FAILURE
Build step 'Invoke Gradle script' marked build as failure

---------------------------------------------------------------------
To unsubscribe, e-mail: builds-unsubscribe@beam.apache.org
For additional commands, e-mail: builds-help@beam.apache.org


Mime
View raw message