beam-builds mailing list archives

Site index · List index
Message view « Date » · « Thread »
Top « Date » · « Thread »
From Apache Jenkins Server <jenk...@builds.apache.org>
Subject Build failed in Jenkins: beam_PreCommit_Python_Cron #3797
Date Sun, 31 Jan 2021 00:39:25 GMT
See <https://ci-beam.apache.org/job/beam_PreCommit_Python_Cron/3797/display/redirect>

Changes:


------------------------------------------
[...truncated 1.60 MB...]
py38-pyarrow-0 run-test: commands[1] | <https://ci-beam.apache.org/job/beam_PreCommit_Python_Cron/ws/src/sdks/python/test-suites/tox/py38/build/srcs/sdks/python/scripts/run_pytest.sh>
py38-pyarrow-0 <https://ci-beam.apache.org/job/beam_PreCommit_Python_Cron/ws/src/sdks/python/test-suites/tox/py38/build/srcs/sdks/python/apache_beam/io/parquetio_test.py>
============================= test session starts ==============================
platform linux -- Python 3.8.5, pytest-4.6.11, py-1.10.0, pluggy-0.13.1
cachedir: target/.tox-py38-pyarrow-0/py38-pyarrow-0/.pytest_cache
rootdir: <https://ci-beam.apache.org/job/beam_PreCommit_Python_Cron/ws/src/sdks/python/test-suites/tox/py38/build/srcs/sdks/python,>
inifile: pytest.ini
plugins: requests-mock-1.8.0, xdist-1.34.0, timeout-1.4.2, forked-1.3.0
timeout: 600.0s
timeout method: signal
timeout func_only: False
gw0 I / gw1 I / gw2 I / gw3 I / gw4 I / gw5 I
gw0 [27] / gw1 [27] / gw2 [27] / gw3 [27] / gw4 [27] / gw5 [27]

...........................                                              [100%]
=============================== warnings summary ===============================
apache_beam/io/parquetio_test.py:418
  <https://ci-beam.apache.org/job/beam_PreCommit_Python_Cron/ws/src/sdks/python/test-suites/tox/py38/build/srcs/sdks/python/apache_beam/io/parquetio_test.py>:418:
FutureWarning: The parameter chunksize is deprecated for pyarrow.Table.to_batches as of 0.15,
please use the parameter max_chunksize instead
    for batch in orig.to_batches(chunksize=20)

apache_beam/io/parquetio_test.py:369
  <https://ci-beam.apache.org/job/beam_PreCommit_Python_Cron/ws/src/sdks/python/test-suites/tox/py38/build/srcs/sdks/python/apache_beam/io/parquetio_test.py>:369:
FutureWarning: The parameter chunksize is deprecated for pyarrow.Table.to_batches as of 0.15,
please use the parameter max_chunksize instead
    pa.Table.from_batches([batch]) for batch in self._records_as_arrow(

apache_beam/io/parquetio_test.py:379
  <https://ci-beam.apache.org/job/beam_PreCommit_Python_Cron/ws/src/sdks/python/test-suites/tox/py38/build/srcs/sdks/python/apache_beam/io/parquetio_test.py>:379:
FutureWarning: The parameter chunksize is deprecated for pyarrow.Table.to_batches as of 0.15,
please use the parameter max_chunksize instead
    pa.Table.from_batches([batch]) for batch in self._records_as_arrow(

-- Docs: https://docs.pytest.org/en/latest/warnings.html
- generated xml file: <https://ci-beam.apache.org/job/beam_PreCommit_Python_Cron/ws/src/sdks/python/test-suites/tox/py38/build/srcs/sdks/python/pytest_py38-pyarrow-0.xml>
-
==================== 27 passed, 3 warnings in 19.33 seconds ====================
============================= test session starts ==============================
platform linux -- Python 3.8.5, pytest-4.6.11, py-1.10.0, pluggy-0.13.1
cachedir: target/.tox-py38-pyarrow-0/py38-pyarrow-0/.pytest_cache
rootdir: <https://ci-beam.apache.org/job/beam_PreCommit_Python_Cron/ws/src/sdks/python/test-suites/tox/py38/build/srcs/sdks/python,>
inifile: pytest.ini
plugins: requests-mock-1.8.0, xdist-1.34.0, timeout-1.4.2, forked-1.3.0
timeout: 600.0s
timeout method: signal
timeout func_only: False
collected 27 items / 27 deselected

- generated xml file: <https://ci-beam.apache.org/job/beam_PreCommit_Python_Cron/ws/src/sdks/python/test-suites/tox/py38/build/srcs/sdks/python/pytest_py38-pyarrow-0_no_xdist.xml>
-
======================== 27 deselected in 0.35 seconds =========================
py38-pyarrow-0 run-test-post: commands[0] | bash <https://ci-beam.apache.org/job/beam_PreCommit_Python_Cron/ws/src/sdks/python/test-suites/tox/py38/build/srcs/sdks/python/scripts/run_tox_cleanup.sh>
___________________________________ summary ____________________________________
  py38-pyarrow-0: commands succeeded
  congratulations :)

> Task :sdks:python:test-suites:tox:py38:testPy38pyarrow-1
GLOB sdist-make: <https://ci-beam.apache.org/job/beam_PreCommit_Python_Cron/ws/src/sdks/python/test-suites/tox/py38/build/srcs/sdks/python/setup.py>
py38-pyarrow-1 create: <https://ci-beam.apache.org/job/beam_PreCommit_Python_Cron/ws/src/sdks/python/test-suites/tox/py38/build/srcs/sdks/python/target/.tox-py38-pyarrow-1/py38-pyarrow-1>
py38-pyarrow-1 installdeps: pyarrow>=1,<2
py38-pyarrow-1 inst: <https://ci-beam.apache.org/job/beam_PreCommit_Python_Cron/ws/src/sdks/python/test-suites/tox/py38/build/srcs/sdks/python/target/.tox-py38-pyarrow-1/.tmp/package/1/apache-beam-2.29.0.dev0.zip>

> Task :sdks:python:test-suites:dataflow:py36:preCommitIT_streaming_V2
Worker logs: https://console.cloud.google.com/dataflow/jobs/us-central1/2021-01-30_16_28_58-9047639761713653439?project=apache-beam-testing
test_streaming_wordcount_it (apache_beam.examples.streaming_wordcount_it_test.StreamingWordCountIT)
... ok

----------------------------------------------------------------------
XML: nosetests-preCommitIT-df-py36.xml
----------------------------------------------------------------------
XML: <https://ci-beam.apache.org/job/beam_PreCommit_Python_Cron/ws/src/sdks/python/nosetests.xml>
----------------------------------------------------------------------
Ran 1 test in 538.320s

OK

> Task :sdks:python:test-suites:dataflow:py37:preCommitIT_streaming_V2
Worker logs: https://console.cloud.google.com/dataflow/jobs/us-central1/2021-01-30_16_29_12-15155249059107218724?project=apache-beam-testing
test_streaming_wordcount_it (apache_beam.examples.streaming_wordcount_it_test.StreamingWordCountIT)
... ok

----------------------------------------------------------------------
XML: nosetests-preCommitIT-df-py37.xml
----------------------------------------------------------------------
XML: <https://ci-beam.apache.org/job/beam_PreCommit_Python_Cron/ws/src/sdks/python/nosetests.xml>
----------------------------------------------------------------------
Ran 1 test in 525.696s

OK

> Task :sdks:python:test-suites:dataflow:preCommitIT_V2

> Task :sdks:python:test-suites:tox:py38:testPy38pyarrow-1
py38-pyarrow-1 installed: apache-beam @ file://<https://ci-beam.apache.org/job/beam_PreCommit_Python_Cron/ws/src/sdks/python/test-suites/tox/py38/build/srcs/sdks/python/target/.tox-py38-pyarrow-1/.tmp/package/1/apache-beam-2.29.0.dev0.zip,apipkg==1.5,atomicwrites==1.4.0,attrs==20.3.0,avro-python3==1.9.2.1,certifi==2020.12.5,chardet==4.0.0,crcmod==1.7,deprecation==2.1.0,dill==0.3.1.1,docker==4.4.1,docopt==0.6.2,execnet==1.8.0,fastavro==1.3.0,freezegun==1.1.0,future==0.18.2,grpcio==1.35.0,hdfs==2.5.8,httplib2==0.17.4,idna==2.10,mock==2.0.0,more-itertools==8.6.0,nose==1.3.7,nose-xunitmp==0.4.1,numpy==1.20.0,oauth2client==4.1.3,packaging==20.9,pandas==1.1.5,parameterized==0.7.5,pbr==5.5.1,pluggy==0.13.1,protobuf==3.14.0,psycopg2-binary==2.8.6,py==1.10.0,pyarrow==1.0.1,pyasn1==0.4.8,pyasn1-modules==0.2.8,pydot==1.4.1,PyHamcrest==1.10.1,pymongo==3.11.2,pyparsing==2.4.7,pytest==4.6.11,pytest-forked==1.3.0,pytest-timeout==1.4.2,pytest-xdist==1.34.0,python-dateutil==2.8.1,pytz==2020.5,PyYAML==5.4.1,requests==2.25.1,requests-mock==1.8.0,rsa==4.7,six==1.15.0,SQLAlchemy==1.3.22,tenacity==5.1.5,testcontainers==3.2.0,typing-extensions==3.7.4.3,urllib3==1.26.3,wcwidth==0.2.5,websocket-client==0.57.0,wrapt==1.12.1>
py38-pyarrow-1 run-test-pre: PYTHONHASHSEED='34041505'
py38-pyarrow-1 run-test-pre: commands[0] | python --version
Python 3.8.5
py38-pyarrow-1 run-test-pre: commands[1] | pip --version
pip 20.3.3 from <https://ci-beam.apache.org/job/beam_PreCommit_Python_Cron/ws/src/sdks/python/test-suites/tox/py38/build/srcs/sdks/python/target/.tox-py38-pyarrow-1/py38-pyarrow-1/lib/python3.8/site-packages/pip>
(python 3.8)
py38-pyarrow-1 run-test-pre: commands[2] | pip check
No broken requirements found.
py38-pyarrow-1 run-test-pre: commands[3] | bash <https://ci-beam.apache.org/job/beam_PreCommit_Python_Cron/ws/src/sdks/python/test-suites/tox/py38/build/srcs/sdks/python/scripts/run_tox_cleanup.sh>
py38-pyarrow-1 run-test: commands[0] | /bin/sh -c 'pip freeze | grep pyarrow==1'
pyarrow==1.0.1
py38-pyarrow-1 run-test: commands[1] | <https://ci-beam.apache.org/job/beam_PreCommit_Python_Cron/ws/src/sdks/python/test-suites/tox/py38/build/srcs/sdks/python/scripts/run_pytest.sh>
py38-pyarrow-1 <https://ci-beam.apache.org/job/beam_PreCommit_Python_Cron/ws/src/sdks/python/test-suites/tox/py38/build/srcs/sdks/python/apache_beam/io/parquetio_test.py>
============================= test session starts ==============================
platform linux -- Python 3.8.5, pytest-4.6.11, py-1.10.0, pluggy-0.13.1
cachedir: target/.tox-py38-pyarrow-1/py38-pyarrow-1/.pytest_cache
rootdir: <https://ci-beam.apache.org/job/beam_PreCommit_Python_Cron/ws/src/sdks/python/test-suites/tox/py38/build/srcs/sdks/python,>
inifile: pytest.ini
plugins: requests-mock-1.8.0, xdist-1.34.0, timeout-1.4.2, forked-1.3.0
timeout: 600.0s
timeout method: signal
timeout func_only: False
gw0 I / gw1 I / gw2 I / gw3 I / gw4 I / gw5 I
gw0 [27] / gw1 [27] / gw2 [27] / gw3 [27] / gw4 [27] / gw5 [27]

...........................                                              [100%]
=============================== warnings summary ===============================
apache_beam/io/parquetio_test.py:418
  <https://ci-beam.apache.org/job/beam_PreCommit_Python_Cron/ws/src/sdks/python/test-suites/tox/py38/build/srcs/sdks/python/apache_beam/io/parquetio_test.py>:418:
FutureWarning: The parameter chunksize is deprecated for pyarrow.Table.to_batches as of 0.15,
please use the parameter max_chunksize instead
    for batch in orig.to_batches(chunksize=20)

apache_beam/io/parquetio_test.py:369
  <https://ci-beam.apache.org/job/beam_PreCommit_Python_Cron/ws/src/sdks/python/test-suites/tox/py38/build/srcs/sdks/python/apache_beam/io/parquetio_test.py>:369:
FutureWarning: The parameter chunksize is deprecated for pyarrow.Table.to_batches as of 0.15,
please use the parameter max_chunksize instead
    pa.Table.from_batches([batch]) for batch in self._records_as_arrow(

apache_beam/io/parquetio_test.py:379
  <https://ci-beam.apache.org/job/beam_PreCommit_Python_Cron/ws/src/sdks/python/test-suites/tox/py38/build/srcs/sdks/python/apache_beam/io/parquetio_test.py>:379:
FutureWarning: The parameter chunksize is deprecated for pyarrow.Table.to_batches as of 0.15,
please use the parameter max_chunksize instead
    pa.Table.from_batches([batch]) for batch in self._records_as_arrow(

-- Docs: https://docs.pytest.org/en/latest/warnings.html
- generated xml file: <https://ci-beam.apache.org/job/beam_PreCommit_Python_Cron/ws/src/sdks/python/test-suites/tox/py38/build/srcs/sdks/python/pytest_py38-pyarrow-1.xml>
-
==================== 27 passed, 3 warnings in 20.43 seconds ====================
============================= test session starts ==============================
platform linux -- Python 3.8.5, pytest-4.6.11, py-1.10.0, pluggy-0.13.1
cachedir: target/.tox-py38-pyarrow-1/py38-pyarrow-1/.pytest_cache
rootdir: <https://ci-beam.apache.org/job/beam_PreCommit_Python_Cron/ws/src/sdks/python/test-suites/tox/py38/build/srcs/sdks/python,>
inifile: pytest.ini
plugins: requests-mock-1.8.0, xdist-1.34.0, timeout-1.4.2, forked-1.3.0
timeout: 600.0s
timeout method: signal
timeout func_only: False
collected 27 items / 27 deselected

- generated xml file: <https://ci-beam.apache.org/job/beam_PreCommit_Python_Cron/ws/src/sdks/python/test-suites/tox/py38/build/srcs/sdks/python/pytest_py38-pyarrow-1_no_xdist.xml>
-
======================== 27 deselected in 0.31 seconds =========================
py38-pyarrow-1 run-test-post: commands[0] | bash <https://ci-beam.apache.org/job/beam_PreCommit_Python_Cron/ws/src/sdks/python/test-suites/tox/py38/build/srcs/sdks/python/scripts/run_tox_cleanup.sh>
___________________________________ summary ____________________________________
  py38-pyarrow-1: commands succeeded
  congratulations :)

> Task :sdks:python:test-suites:tox:py38:testPy38pyarrow-2
GLOB sdist-make: <https://ci-beam.apache.org/job/beam_PreCommit_Python_Cron/ws/src/sdks/python/test-suites/tox/py38/build/srcs/sdks/python/setup.py>
py38-pyarrow-2 create: <https://ci-beam.apache.org/job/beam_PreCommit_Python_Cron/ws/src/sdks/python/test-suites/tox/py38/build/srcs/sdks/python/target/.tox-py38-pyarrow-2/py38-pyarrow-2>
py38-pyarrow-2 installdeps: pyarrow>=2,<3
py38-pyarrow-2 inst: <https://ci-beam.apache.org/job/beam_PreCommit_Python_Cron/ws/src/sdks/python/test-suites/tox/py38/build/srcs/sdks/python/target/.tox-py38-pyarrow-2/.tmp/package/1/apache-beam-2.29.0.dev0.zip>
py38-pyarrow-2 installed: apache-beam @ file://<https://ci-beam.apache.org/job/beam_PreCommit_Python_Cron/ws/src/sdks/python/test-suites/tox/py38/build/srcs/sdks/python/target/.tox-py38-pyarrow-2/.tmp/package/1/apache-beam-2.29.0.dev0.zip,apipkg==1.5,atomicwrites==1.4.0,attrs==20.3.0,avro-python3==1.9.2.1,certifi==2020.12.5,chardet==4.0.0,crcmod==1.7,deprecation==2.1.0,dill==0.3.1.1,docker==4.4.1,docopt==0.6.2,execnet==1.8.0,fastavro==1.3.0,freezegun==1.1.0,future==0.18.2,grpcio==1.35.0,hdfs==2.5.8,httplib2==0.17.4,idna==2.10,mock==2.0.0,more-itertools==8.6.0,nose==1.3.7,nose-xunitmp==0.4.1,numpy==1.20.0,oauth2client==4.1.3,packaging==20.9,pandas==1.1.5,parameterized==0.7.5,pbr==5.5.1,pluggy==0.13.1,protobuf==3.14.0,psycopg2-binary==2.8.6,py==1.10.0,pyarrow==2.0.0,pyasn1==0.4.8,pyasn1-modules==0.2.8,pydot==1.4.1,PyHamcrest==1.10.1,pymongo==3.11.2,pyparsing==2.4.7,pytest==4.6.11,pytest-forked==1.3.0,pytest-timeout==1.4.2,pytest-xdist==1.34.0,python-dateutil==2.8.1,pytz==2020.5,PyYAML==5.4.1,requests==2.25.1,requests-mock==1.8.0,rsa==4.7,six==1.15.0,SQLAlchemy==1.3.22,tenacity==5.1.5,testcontainers==3.2.0,typing-extensions==3.7.4.3,urllib3==1.26.3,wcwidth==0.2.5,websocket-client==0.57.0,wrapt==1.12.1>
py38-pyarrow-2 run-test-pre: PYTHONHASHSEED='2399904781'
py38-pyarrow-2 run-test-pre: commands[0] | python --version
Python 3.8.5
py38-pyarrow-2 run-test-pre: commands[1] | pip --version
pip 20.3.3 from <https://ci-beam.apache.org/job/beam_PreCommit_Python_Cron/ws/src/sdks/python/test-suites/tox/py38/build/srcs/sdks/python/target/.tox-py38-pyarrow-2/py38-pyarrow-2/lib/python3.8/site-packages/pip>
(python 3.8)
py38-pyarrow-2 run-test-pre: commands[2] | pip check
No broken requirements found.
py38-pyarrow-2 run-test-pre: commands[3] | bash <https://ci-beam.apache.org/job/beam_PreCommit_Python_Cron/ws/src/sdks/python/test-suites/tox/py38/build/srcs/sdks/python/scripts/run_tox_cleanup.sh>
py38-pyarrow-2 run-test: commands[0] | /bin/sh -c 'pip freeze | grep pyarrow==2'
pyarrow==2.0.0
py38-pyarrow-2 run-test: commands[1] | <https://ci-beam.apache.org/job/beam_PreCommit_Python_Cron/ws/src/sdks/python/test-suites/tox/py38/build/srcs/sdks/python/scripts/run_pytest.sh>
py38-pyarrow-2 <https://ci-beam.apache.org/job/beam_PreCommit_Python_Cron/ws/src/sdks/python/test-suites/tox/py38/build/srcs/sdks/python/apache_beam/io/parquetio_test.py>
============================= test session starts ==============================
platform linux -- Python 3.8.5, pytest-4.6.11, py-1.10.0, pluggy-0.13.1
cachedir: target/.tox-py38-pyarrow-2/py38-pyarrow-2/.pytest_cache
rootdir: <https://ci-beam.apache.org/job/beam_PreCommit_Python_Cron/ws/src/sdks/python/test-suites/tox/py38/build/srcs/sdks/python,>
inifile: pytest.ini
plugins: requests-mock-1.8.0, xdist-1.34.0, timeout-1.4.2, forked-1.3.0
timeout: 600.0s
timeout method: signal
timeout func_only: False
gw0 I / gw1 I / gw2 I / gw3 I / gw4 I / gw5 I
gw0 [27] / gw1 [27] / gw2 [27] / gw3 [27] / gw4 [27] / gw5 [27]

...........................                                              [100%]
=============================== warnings summary ===============================
target/.tox-py38-pyarrow-2/py38-pyarrow-2/lib/python3.8/site-packages/pyarrow/pandas_compat.py:1027
target/.tox-py38-pyarrow-2/py38-pyarrow-2/lib/python3.8/site-packages/pyarrow/pandas_compat.py:1027
target/.tox-py38-pyarrow-2/py38-pyarrow-2/lib/python3.8/site-packages/pyarrow/pandas_compat.py:1027
target/.tox-py38-pyarrow-2/py38-pyarrow-2/lib/python3.8/site-packages/pyarrow/pandas_compat.py:1027
target/.tox-py38-pyarrow-2/py38-pyarrow-2/lib/python3.8/site-packages/pyarrow/pandas_compat.py:1027
target/.tox-py38-pyarrow-2/py38-pyarrow-2/lib/python3.8/site-packages/pyarrow/pandas_compat.py:1027
  <https://ci-beam.apache.org/job/beam_PreCommit_Python_Cron/ws/src/sdks/python/test-suites/tox/py38/build/srcs/sdks/python/target/.tox-py38-pyarrow-2/py38-pyarrow-2/lib/python3.8/site-packages/pyarrow/pandas_compat.py>:1027:
DeprecationWarning: `np.float` is a deprecated alias for the builtin `float`. To silence this
warning, use `float` by itself. Doing this will not modify any behavior and is safe. If you
specifically wanted the numpy scalar type, use `np.float64` here.
  Deprecated in NumPy 1.20; for more details and guidance: https://numpy.org/devdocs/release/1.20.0-notes.html#deprecations
    'floating': np.float,

apache_beam/io/parquetio_test.py:418
  <https://ci-beam.apache.org/job/beam_PreCommit_Python_Cron/ws/src/sdks/python/test-suites/tox/py38/build/srcs/sdks/python/apache_beam/io/parquetio_test.py>:418:
FutureWarning: The parameter chunksize is deprecated for pyarrow.Table.to_batches as of 0.15,
please use the parameter max_chunksize instead
    for batch in orig.to_batches(chunksize=20)

apache_beam/io/parquetio_test.py:369
  <https://ci-beam.apache.org/job/beam_PreCommit_Python_Cron/ws/src/sdks/python/test-suites/tox/py38/build/srcs/sdks/python/apache_beam/io/parquetio_test.py>:369:
FutureWarning: The parameter chunksize is deprecated for pyarrow.Table.to_batches as of 0.15,
please use the parameter max_chunksize instead
    pa.Table.from_batches([batch]) for batch in self._records_as_arrow(

apache_beam/io/parquetio_test.py:379
  <https://ci-beam.apache.org/job/beam_PreCommit_Python_Cron/ws/src/sdks/python/test-suites/tox/py38/build/srcs/sdks/python/apache_beam/io/parquetio_test.py>:379:
FutureWarning: The parameter chunksize is deprecated for pyarrow.Table.to_batches as of 0.15,
please use the parameter max_chunksize instead
    pa.Table.from_batches([batch]) for batch in self._records_as_arrow(

-- Docs: https://docs.pytest.org/en/latest/warnings.html
- generated xml file: <https://ci-beam.apache.org/job/beam_PreCommit_Python_Cron/ws/src/sdks/python/test-suites/tox/py38/build/srcs/sdks/python/pytest_py38-pyarrow-2.xml>
-
==================== 27 passed, 9 warnings in 20.86 seconds ====================
============================= test session starts ==============================
platform linux -- Python 3.8.5, pytest-4.6.11, py-1.10.0, pluggy-0.13.1
cachedir: target/.tox-py38-pyarrow-2/py38-pyarrow-2/.pytest_cache
rootdir: <https://ci-beam.apache.org/job/beam_PreCommit_Python_Cron/ws/src/sdks/python/test-suites/tox/py38/build/srcs/sdks/python,>
inifile: pytest.ini
plugins: requests-mock-1.8.0, xdist-1.34.0, timeout-1.4.2, forked-1.3.0
timeout: 600.0s
timeout method: signal
timeout func_only: False
collected 27 items / 27 deselected

- generated xml file: <https://ci-beam.apache.org/job/beam_PreCommit_Python_Cron/ws/src/sdks/python/test-suites/tox/py38/build/srcs/sdks/python/pytest_py38-pyarrow-2_no_xdist.xml>
-
======================== 27 deselected in 0.35 seconds =========================
py38-pyarrow-2 run-test-post: commands[0] | bash <https://ci-beam.apache.org/job/beam_PreCommit_Python_Cron/ws/src/sdks/python/test-suites/tox/py38/build/srcs/sdks/python/scripts/run_tox_cleanup.sh>
___________________________________ summary ____________________________________
  py38-pyarrow-2: commands succeeded
  congratulations :)

> Task :sdks:python:test-suites:tox:py38:preCommitPy38

FAILURE: Build completed with 2 failures.

1: Task failed with an exception.
-----------
* What went wrong:
Execution failed for task ':sdks:python:test-suites:tox:py37:testPy37Cloud'.
> Process 'command 'sh'' finished with non-zero exit value 1

* Try:
Run with --stacktrace option to get the stack trace. Run with --info or --debug option to
get more log output. Run with --scan to get full insights.
==============================================================================

2: Task failed with an exception.
-----------
* What went wrong:
Execution failed for task ':sdks:python:test-suites:tox:py37:testPy37Cython'.
> Process 'command 'sh'' finished with non-zero exit value 1

* Try:
Run with --stacktrace option to get the stack trace. Run with --info or --debug option to
get more log output. Run with --scan to get full insights.
==============================================================================

* Get more help at https://help.gradle.org

Deprecated Gradle features were used in this build, making it incompatible with Gradle 7.0.
Use '--warning-mode all' to show the individual deprecation warnings.
See https://docs.gradle.org/6.8/userguide/command_line_interface.html#sec:command_line_warnings

BUILD FAILED in 38m 10s
101 actionable tasks: 71 executed, 30 from cache
Gradle was unable to watch the file system for changes. The inotify watches limit is too low.

Publishing build scan...
https://gradle.com/s/ui7do72b2ozaa

Build step 'Invoke Gradle script' changed build result to FAILURE
Build step 'Invoke Gradle script' marked build as failure

---------------------------------------------------------------------
To unsubscribe, e-mail: builds-unsubscribe@beam.apache.org
For additional commands, e-mail: builds-help@beam.apache.org


Mime
View raw message