beam-builds mailing list archives

Site index · List index
Message view « Date » · « Thread »
Top « Date » · « Thread »
From Apache Jenkins Server <jenk...@builds.apache.org>
Subject Build failed in Jenkins: beam_PerformanceTests_Kafka_IO #1867
Date Thu, 28 Jan 2021 01:29:53 GMT
See <https://ci-beam.apache.org/job/beam_PerformanceTests_Kafka_IO/1867/display/redirect?page=changes>

Changes:

[sonam.ramchand] Enabled strict dependency on flink runner

[sonam.ramchand] Added new line

[sonam.ramchand] removed checker-qual

[sonam.ramchand] Removed flink-clients dep

[sonam.ramchand] set enableStrictDependencies:true

[sonam.ramchand] made flink-clients runtimeOnly

[noreply] Remove stray colon.

[zyichi] [BEAM-11679] Override PubsubUnboundedSource transform for dataflow

[zyichi] Populate PubsubMessage message id

[zyichi] Enable tests

[zyichi] Exclude failing FhirIO ITs

[zyichi] Include runner v2 IT tests in java post commit

[Ismaël Mejía] [BEAM-11697] Upgrade Flink runner to Flink versions 1.12.1 and 1.11.3

[shehzaad] strict dependency checking on sdks/io/amazon-web-services*

[shehzaad] move amazon-web-services* changes to another PR

[shehzaad] undo previous erroneous commit

[shehzaad] better use of variables

[randomstep] [BEAM-8725] bump snappy-java to 1.1.8.4

[nielm] Add BigDecimal support for SpannerIO

[Kyle Weaver] [BEAM-11689] Add public.nexus.pentaho.org to offline repositories.

[Chamikara Madhusanka Jayalath] Moving to 2.29.0-SNAPSHOT on master branch.

[noreply] [BEAM-11531] Add pd.to_datetime, handle DeferredBase args in

[Andrew Pilloud] [BEAM-11165] Async ZetaSQL Calc

[noreply] [BEAM-11695] Combiner packing in Dataflow (#13763)


------------------------------------------
[...truncated 1.01 MB...]
> Task :sdks:go:resolveBuildDependencies
Resolving golang.org/x/sys: commit='fde4db37ae7ad8191b03d30d27f258b5291ae4e3', urls=[https://go.googlesource.com/sys]
Skip updating golang.org/x/text: commit='23ae387dee1f90d29a23c0e87ee0b46038fbed0e', urls=[https://go.googlesource.com/text]
in /home/jenkins/.gradle/go/repo/golang.org/x/text/200349d30742977d7197074f990dbeb9.
Resolving golang.org/x/text: commit='23ae387dee1f90d29a23c0e87ee0b46038fbed0e', urls=[https://go.googlesource.com/text]
Resolving cached github.com/etcd-io/etcd: commit='11214aa33bf5a47d3d9d8dafe0f6b97237dfe921',
urls=[https://github.com/etcd-io/etcd.git, git@github.com:etcd-io/etcd.git]
Skip updating google.golang.org/api: commit='0324d5e90dc7753607860272666845fad9ceb97e', urls=[https://code.googlesource.com/google-api-go-client]
in /home/jenkins/.gradle/go/repo/google.golang.org/api/e28049fb85a1109eef37826e4bbdd908.
Resolving google.golang.org/api: commit='0324d5e90dc7753607860272666845fad9ceb97e', urls=[https://code.googlesource.com/google-api-go-client]
Skip updating google.golang.org/genproto: commit='4d944d34d83c502a5f761500a14d8842648415c3',
urls=[https://github.com/google/go-genproto] in /home/jenkins/.gradle/go/repo/google.golang.org/genproto/d671e773e8f05b7375b87bbe0b61b2ce.
Resolving google.golang.org/genproto: commit='4d944d34d83c502a5f761500a14d8842648415c3', urls=[https://github.com/google/go-genproto]
Skip updating google.golang.org/grpc: commit='5e8f83304c0563d1ba74db05fee83d9c18ab9a58', urls=[https://github.com/grpc/grpc-go]
in /home/jenkins/.gradle/go/repo/google.golang.org/grpc/f8a4497e5e07f775c7d9e343b98b7521.
Resolving google.golang.org/grpc: commit='5e8f83304c0563d1ba74db05fee83d9c18ab9a58', urls=[https://github.com/grpc/grpc-go]
Skip updating google.golang.org/protobuf: commit='d165be301fb1e13390ad453281ded24385fd8ebc',
urls=[https://go.googlesource.com/protobuf] in /home/jenkins/.gradle/go/repo/google.golang.org/protobuf/61ae196259c623d1bac9339f33b7fb02.
Resolving google.golang.org/protobuf: commit='d165be301fb1e13390ad453281ded24385fd8ebc', urls=[https://go.googlesource.com/protobuf]
Resolving cached github.com/etcd-io/etcd: commit='11214aa33bf5a47d3d9d8dafe0f6b97237dfe921',
urls=[https://github.com/etcd-io/etcd.git, git@github.com:etcd-io/etcd.git]
Resolving cached github.com/etcd-io/etcd: commit='11214aa33bf5a47d3d9d8dafe0f6b97237dfe921',
urls=[https://github.com/etcd-io/etcd.git, git@github.com:etcd-io/etcd.git]
Watching 2395 directories to track changes
:sdks:go:resolveBuildDependencies (Thread[Execution **** for ':' Thread 8,5,main]) completed.
Took 17 mins 29.467 secs.
:sdks:go:installDependencies (Thread[Execution **** for ':' Thread 8,5,main]) started.

> Task :sdks:go:installDependencies
Caching disabled for task ':sdks:go:installDependencies' because:
  Caching has not been enabled for the task
Task ':sdks:go:installDependencies' is not up-to-date because:
  Task has not declared any outputs despite executing actions.
Cache <https://ci-beam.apache.org/job/beam_PerformanceTests_Kafka_IO/ws/src/sdks/go/.gogradle/cache/VendorSnapshot-0.10.bin>
not found, skip.
Skip updating cloud.google.com/go#03869a08dc16b35ad4968e92d34c5a2a2961b205 in /home/jenkins/.gradle/go/repo/cloud.google.com/go/625660c387d9403fde4d73cacaf2d2ac.
Skip updating github.com/Shopify/sarama#541689b9f4212043471eb537fa72da507025d3ea in /home/jenkins/.gradle/go/repo/github.com/Shopify/sarama/7336385073f137bd7c8024a1cb2f8fec.
Skip updating github.com/armon/consul-api#eb2c6b5be1b66bab83016e0b05f01b8d5496ffbd in /home/jenkins/.gradle/go/repo/github.com/armon/consul-api/6699c6c5a593d66cb984f84ff9b5dd81.
Skip updating github.com/etcd-io/etcd#11214aa33bf5a47d3d9d8dafe0f6b97237dfe921 in /home/jenkins/.gradle/go/repo/github.com/etcd-io/etcd/b9d5cfe72873ef37d0a722b1dba96aeb.
Skip updating github.com/etcd-io/etcd#11214aa33bf5a47d3d9d8dafe0f6b97237dfe921 in /home/jenkins/.gradle/go/repo/github.com/etcd-io/etcd/b9d5cfe72873ef37d0a722b1dba96aeb.
Skip updating github.com/etcd-io/etcd#11214aa33bf5a47d3d9d8dafe0f6b97237dfe921 in /home/jenkins/.gradle/go/repo/github.com/etcd-io/etcd/b9d5cfe72873ef37d0a722b1dba96aeb.
Skip updating github.com/etcd-io/etcd#11214aa33bf5a47d3d9d8dafe0f6b97237dfe921 in /home/jenkins/.gradle/go/repo/github.com/etcd-io/etcd/b9d5cfe72873ef37d0a722b1dba96aeb.
Skip updating github.com/etcd-io/etcd#11214aa33bf5a47d3d9d8dafe0f6b97237dfe921 in /home/jenkins/.gradle/go/repo/github.com/etcd-io/etcd/b9d5cfe72873ef37d0a722b1dba96aeb.
Skip updating github.com/etcd-io/etcd#11214aa33bf5a47d3d9d8dafe0f6b97237dfe921 in /home/jenkins/.gradle/go/repo/github.com/etcd-io/etcd/b9d5cfe72873ef37d0a722b1dba96aeb.
Skip updating github.com/cpuguy83/go-md2man#dc9f53734905c233adfc09fd4f063dce63ce3daf in /home/jenkins/.gradle/go/repo/github.com/cpuguy83/go-md2man/12e5b04f5fe32bdd05573f005036f2c6.
Skip updating github.com/davecgh/go-spew#87df7c60d5820d0f8ae11afede5aa52325c09717 in /home/jenkins/.gradle/go/repo/github.com/davecgh/go-spew/dc7a7e75773510b5a0d478397f61513b.
Skip updating github.com/etcd-io/etcd#11214aa33bf5a47d3d9d8dafe0f6b97237dfe921 in /home/jenkins/.gradle/go/repo/github.com/etcd-io/etcd/b9d5cfe72873ef37d0a722b1dba96aeb.
Skip updating github.com/etcd-io/etcd#11214aa33bf5a47d3d9d8dafe0f6b97237dfe921 in /home/jenkins/.gradle/go/repo/github.com/etcd-io/etcd/b9d5cfe72873ef37d0a722b1dba96aeb.
Skip updating github.com/eapache/go-resiliency#ef9aaa7ea8bd2448429af1a77cf41b2b3b34bdd6 in
/home/jenkins/.gradle/go/repo/github.com/eapache/go-resiliency/cc8793056d7f271a549d69e70047ea4a.
Skip updating github.com/eapache/go-xerial-snappy#bb955e01b9346ac19dc29eb16586c90ded99a98c
in /home/jenkins/.gradle/go/repo/github.com/eapache/go-xerial-snappy/f52f47f5cb2601626dc0aa72fc11554a.
Skip updating github.com/eapache/queue#44cc805cf13205b55f69e14bcb69867d1ae92f98 in /home/jenkins/.gradle/go/repo/github.com/eapache/queue/ce6b67da091d976a2973a2423a8383c8.
Skip updating github.com/etcd-io/etcd#11214aa33bf5a47d3d9d8dafe0f6b97237dfe921 in /home/jenkins/.gradle/go/repo/github.com/etcd-io/etcd/b9d5cfe72873ef37d0a722b1dba96aeb.
Skip updating github.com/fsnotify/fsnotify#c2828203cd70a50dcccfb2761f8b1f8ceef9a8e9 in /home/jenkins/.gradle/go/repo/github.com/fsnotify/fsnotify/19efc65ffbc0ec17575ab18d504e8c91.
Skip updating github.com/etcd-io/etcd#11214aa33bf5a47d3d9d8dafe0f6b97237dfe921 in /home/jenkins/.gradle/go/repo/github.com/etcd-io/etcd/b9d5cfe72873ef37d0a722b1dba96aeb.
Skip updating github.com/etcd-io/etcd#11214aa33bf5a47d3d9d8dafe0f6b97237dfe921 in /home/jenkins/.gradle/go/repo/github.com/etcd-io/etcd/b9d5cfe72873ef37d0a722b1dba96aeb.
Skip updating github.com/golang/glog#23def4e6c14b4da8ac2ed8007337bc5eb5007998 in /home/jenkins/.gradle/go/repo/github.com/golang/glog/c359ae0c52cbded42897d83346c85981.
Skip updating github.com/etcd-io/etcd#11214aa33bf5a47d3d9d8dafe0f6b97237dfe921 in /home/jenkins/.gradle/go/repo/github.com/etcd-io/etcd/b9d5cfe72873ef37d0a722b1dba96aeb.
Skip updating github.com/golang/mock#b3e60bcdc577185fce3cf625fc96b62857ce5574 in /home/jenkins/.gradle/go/repo/github.com/golang/mock/a5aba77edff874e2e3d9ad331994556c.
Skip updating github.com/golang/protobuf#d04d7b157bb510b1e0c10132224b616ac0e26b17 in /home/jenkins/.gradle/go/repo/github.com/golang/protobuf/76cd502133aa2c5520c2b3e1debe630b.
Skip updating github.com/golang/snappy#553a641470496b2327abcac10b36396bd98e45c9 in /home/jenkins/.gradle/go/repo/github.com/golang/snappy/96c568bbd0eca3e3f6a41e15a438261a.
Skip updating github.com/etcd-io/etcd#11214aa33bf5a47d3d9d8dafe0f6b97237dfe921 in /home/jenkins/.gradle/go/repo/github.com/etcd-io/etcd/b9d5cfe72873ef37d0a722b1dba96aeb.
Skip updating github.com/google/go-cmp#9680bfaf28748393e28e00238d94070fb9972fd8 in /home/jenkins/.gradle/go/repo/github.com/google/go-cmp/0e30ce638fec37a4c0a4040d380290b4.
Skip updating github.com/google/pprof#a8f279b7952b27edbcb72e5a6c69ee9be4c8ad93 in /home/jenkins/.gradle/go/repo/github.com/google/pprof/580224cd7b76319263fe32ca011a0650.
Skip updating github.com/googleapis/gax-go#bd5b16380fd03dc758d11cef74ba2e3bc8b0e8c2 in /home/jenkins/.gradle/go/repo/github.com/googleapis/gax-go/cfbdb0eaeda3f1ea6b48e4ebedd6b7ac.
Skip updating github.com/etcd-io/etcd#11214aa33bf5a47d3d9d8dafe0f6b97237dfe921 in /home/jenkins/.gradle/go/repo/github.com/etcd-io/etcd/b9d5cfe72873ef37d0a722b1dba96aeb.
Skip updating github.com/etcd-io/etcd#11214aa33bf5a47d3d9d8dafe0f6b97237dfe921 in /home/jenkins/.gradle/go/repo/github.com/etcd-io/etcd/b9d5cfe72873ef37d0a722b1dba96aeb.
Skip updating github.com/etcd-io/etcd#11214aa33bf5a47d3d9d8dafe0f6b97237dfe921 in /home/jenkins/.gradle/go/repo/github.com/etcd-io/etcd/b9d5cfe72873ef37d0a722b1dba96aeb.
Skip updating github.com/hashicorp/hcl#23c074d0eceb2b8a5bfdbb271ab780cde70f05a8 in /home/jenkins/.gradle/go/repo/github.com/hashicorp/hcl/37e0bb8b36d14da77f9f8c5babf91e48.
Skip updating github.com/ianlancetaylor/demangle#4883227f66371e02c4948937d3e2be1664d9be38
in /home/jenkins/.gradle/go/repo/github.com/ianlancetaylor/demangle/da9250878eadca7fe1a997f2c1e465b3.
Skip updating github.com/etcd-io/etcd#11214aa33bf5a47d3d9d8dafe0f6b97237dfe921 in /home/jenkins/.gradle/go/repo/github.com/etcd-io/etcd/b9d5cfe72873ef37d0a722b1dba96aeb.
Skip updating github.com/etcd-io/etcd#11214aa33bf5a47d3d9d8dafe0f6b97237dfe921 in /home/jenkins/.gradle/go/repo/github.com/etcd-io/etcd/b9d5cfe72873ef37d0a722b1dba96aeb.
Skip updating github.com/kr/fs#2788f0dbd16903de03cb8186e5c7d97b69ad387b in /home/jenkins/.gradle/go/repo/github.com/kr/fs/ef69c46d4366e9d326896066a4b027d4.
Skip updating github.com/etcd-io/etcd#11214aa33bf5a47d3d9d8dafe0f6b97237dfe921 in /home/jenkins/.gradle/go/repo/github.com/etcd-io/etcd/b9d5cfe72873ef37d0a722b1dba96aeb.
Skip updating github.com/linkedin/goavro#94a7a9db615f35a39dd2b82089398b92fabad2ba in /home/jenkins/.gradle/go/repo/github.com/linkedin/goavro/34059d704d29ee688444475e7bb592a8.
Skip updating github.com/magiconair/properties#49d762b9817ba1c2e9d0c69183c2b4a8b8f1d934 in
/home/jenkins/.gradle/go/repo/github.com/magiconair/properties/34883f6c3f37cca1c4582d137f9fc020.
Skip updating github.com/etcd-io/etcd#11214aa33bf5a47d3d9d8dafe0f6b97237dfe921 in /home/jenkins/.gradle/go/repo/github.com/etcd-io/etcd/b9d5cfe72873ef37d0a722b1dba96aeb.
Skip updating github.com/etcd-io/etcd#11214aa33bf5a47d3d9d8dafe0f6b97237dfe921 in /home/jenkins/.gradle/go/repo/github.com/etcd-io/etcd/b9d5cfe72873ef37d0a722b1dba96aeb.
Skip updating github.com/mitchellh/go-homedir#b8bc1bf767474819792c23f32d8286a45736f1c6 in
/home/jenkins/.gradle/go/repo/github.com/mitchellh/go-homedir/11e21d791561444efcbd8f83f3617926.
Skip updating github.com/mitchellh/mapstructure#a4e142e9c047c904fa2f1e144d9a84e6133024bc in
/home/jenkins/.gradle/go/repo/github.com/mitchellh/mapstructure/8f497225aea52894fde79ad66bc0eb05.
Skip updating github.com/nightlyone/lockfile#0ad87eef1443f64d3d8c50da647e2b1552851124 in /home/jenkins/.gradle/go/repo/github.com/nightlyone/lockfile/fc943cff3ad7c27ca1784e15ff72e9b7.
Skip updating github.com/etcd-io/etcd#11214aa33bf5a47d3d9d8dafe0f6b97237dfe921 in /home/jenkins/.gradle/go/repo/github.com/etcd-io/etcd/b9d5cfe72873ef37d0a722b1dba96aeb.
Skip updating github.com/openzipkin/zipkin-go#3741243b287094fda649c7f0fa74bd51f37dc122 in
/home/jenkins/.gradle/go/repo/github.com/openzipkin/zipkin-go/e53ea28b1632f7d2624f50816a45fa4e.
Skip updating github.com/pelletier/go-toml#acdc4509485b587f5e675510c4f2c63e90ff68a8 in /home/jenkins/.gradle/go/repo/github.com/pelletier/go-toml/fcb4bcb69fca9eab0a7b3cb341106167.
Skip updating github.com/etcd-io/etcd#11214aa33bf5a47d3d9d8dafe0f6b97237dfe921 in /home/jenkins/.gradle/go/repo/github.com/etcd-io/etcd/b9d5cfe72873ef37d0a722b1dba96aeb.
Skip updating github.com/pierrec/lz4#ed8d4cc3b461464e69798080a0092bd028910298 in /home/jenkins/.gradle/go/repo/github.com/pierrec/lz4/83deb6b4d9e1d60342f2e0141ef3372c.
Skip updating github.com/pierrec/xxHash#a0006b13c722f7f12368c00a3d3c2ae8a999a0c6 in /home/jenkins/.gradle/go/repo/github.com/pierrec/xxHash/0aff276981c744f632693880472ff35f.
Skip updating github.com/pkg/errors#30136e27e2ac8d167177e8a583aa4c3fea5be833 in /home/jenkins/.gradle/go/repo/github.com/pkg/errors/2e4e7e2f9086007efa2e7bd2b4aac96d.
Skip updating github.com/pkg/sftp#22e9c1ccc02fc1b9fa3264572e49109b68a86947 in /home/jenkins/.gradle/go/repo/github.com/pkg/sftp/a97d32b473b1b771dd73590d425c6efa.
Skip updating github.com/prometheus/client_golang#9bb6ab929dcbe1c8393cd9ef70387cb69811bd1c
in /home/jenkins/.gradle/go/repo/github.com/prometheus/client_golang/e47e9fc2682ee532aab4f916e0ba7067.
Skip updating github.com/etcd-io/etcd#11214aa33bf5a47d3d9d8dafe0f6b97237dfe921 in /home/jenkins/.gradle/go/repo/github.com/etcd-io/etcd/b9d5cfe72873ef37d0a722b1dba96aeb.
Skip updating github.com/etcd-io/etcd#11214aa33bf5a47d3d9d8dafe0f6b97237dfe921 in /home/jenkins/.gradle/go/repo/github.com/etcd-io/etcd/b9d5cfe72873ef37d0a722b1dba96aeb.
Skip updating github.com/prometheus/procfs#cb4147076ac75738c9a7d279075a253c0cc5acbd in /home/jenkins/.gradle/go/repo/github.com/prometheus/procfs/520728c921fed5d680688350f35d5741.
Skip updating github.com/rcrowley/go-metrics#8732c616f52954686704c8645fe1a9d59e9df7c1 in /home/jenkins/.gradle/go/repo/github.com/rcrowley/go-metrics/f0d8dabece2ef254f6ec08366c62d08e.
Skip updating github.com/cpuguy83/go-md2man#dc9f53734905c233adfc09fd4f063dce63ce3daf in /home/jenkins/.gradle/go/repo/github.com/cpuguy83/go-md2man/12e5b04f5fe32bdd05573f005036f2c6.
Skip updating github.com/cpuguy83/go-md2man#dc9f53734905c233adfc09fd4f063dce63ce3daf in /home/jenkins/.gradle/go/repo/github.com/cpuguy83/go-md2man/12e5b04f5fe32bdd05573f005036f2c6.
Skip updating github.com/etcd-io/etcd#11214aa33bf5a47d3d9d8dafe0f6b97237dfe921 in /home/jenkins/.gradle/go/repo/github.com/etcd-io/etcd/b9d5cfe72873ef37d0a722b1dba96aeb.
Skip updating github.com/etcd-io/etcd#11214aa33bf5a47d3d9d8dafe0f6b97237dfe921 in /home/jenkins/.gradle/go/repo/github.com/etcd-io/etcd/b9d5cfe72873ef37d0a722b1dba96aeb.
Skip updating github.com/spf13/afero#bb8f1927f2a9d3ab41c9340aa034f6b803f4359c in /home/jenkins/.gradle/go/repo/github.com/spf13/afero/0d5b43f5d5a0d64c660c5f7f85c69eba.
Skip updating github.com/spf13/cast#acbeb36b902d72a7a4c18e8f3241075e7ab763e4 in /home/jenkins/.gradle/go/repo/github.com/spf13/cast/517542251c45d58331ec1dd452bb121b.
Skip updating github.com/spf13/cobra#93959269ad99e80983c9ba742a7e01203a4c0e4f in /home/jenkins/.gradle/go/repo/github.com/spf13/cobra/e71e66962e88c28e97f1d24435dc7be4.
Skip updating github.com/spf13/jwalterweatherman#7c0cea34c8ece3fbeb2b27ab9b59511d360fb394
in /home/jenkins/.gradle/go/repo/github.com/spf13/jwalterweatherman/330c1f6608327a4a7166e17f6e499144.
Skip updating github.com/etcd-io/etcd#11214aa33bf5a47d3d9d8dafe0f6b97237dfe921 in /home/jenkins/.gradle/go/repo/github.com/etcd-io/etcd/b9d5cfe72873ef37d0a722b1dba96aeb.
Skip updating github.com/spf13/viper#aafc9e6bc7b7bb53ddaa75a5ef49a17d6e654be5 in /home/jenkins/.gradle/go/repo/github.com/spf13/viper/0646b428d96e964862ed970f8f3b1b0d.
Skip updating github.com/stathat/go#74669b9f388d9d788c97399a0824adbfee78400e in /home/jenkins/.gradle/go/repo/github.com/stathat/go/50bfc833dbb8ee4dc51ab0c7cc9cdadc.
Skip updating github.com/etcd-io/etcd#11214aa33bf5a47d3d9d8dafe0f6b97237dfe921 in /home/jenkins/.gradle/go/repo/github.com/etcd-io/etcd/b9d5cfe72873ef37d0a722b1dba96aeb.
Skip updating github.com/etcd-io/etcd#11214aa33bf5a47d3d9d8dafe0f6b97237dfe921 in /home/jenkins/.gradle/go/repo/github.com/etcd-io/etcd/b9d5cfe72873ef37d0a722b1dba96aeb.
Skip updating github.com/etcd-io/etcd#11214aa33bf5a47d3d9d8dafe0f6b97237dfe921 in /home/jenkins/.gradle/go/repo/github.com/etcd-io/etcd/b9d5cfe72873ef37d0a722b1dba96aeb.
Skip updating github.com/etcd-io/etcd#11214aa33bf5a47d3d9d8dafe0f6b97237dfe921 in /home/jenkins/.gradle/go/repo/github.com/etcd-io/etcd/b9d5cfe72873ef37d0a722b1dba96aeb.
Skip updating github.com/xordataexchange/crypt#b2862e3d0a775f18c7cfe02273500ae307b61218 in
/home/jenkins/.gradle/go/repo/github.com/xordataexchange/crypt/8e109341273400bea10f5f0413dcdd9f.
Skip updating go.opencensus.io#3fb168f674736c026e623310bfccb0691e6dec8a in /home/jenkins/.gradle/go/repo/go.opencensus.io/fec515add58c7d1c6457c89d887bb2cd.
Skip updating golang.org/x/crypto#d9133f5469342136e669e85192a26056b587f503 in /home/jenkins/.gradle/go/repo/golang.org/x/crypto/2aba65426fb5ce67509b4db7a8dec732.
Skip updating golang.org/x/debug#95515998a8a4bd7448134b2cb5971dbeb12e0b77 in /home/jenkins/.gradle/go/repo/golang.org/x/debug/9043712fb350d6971269000e35dcbfbe.
Skip updating golang.org/x/net#2fb46b16b8dda405028c50f7c7f0f9dd1fa6bfb1 in /home/jenkins/.gradle/go/repo/golang.org/x/net/f47324d5ea8156d76c2bbb6ec5ebfdb6.
Skip updating golang.org/x/oauth2#5d25da1a8d43b66f2898c444f899c7bcfd6a407e in /home/jenkins/.gradle/go/repo/golang.org/x/oauth2/b0090736c2a63258c64df39f8d8a4b28.
Skip updating golang.org/x/sync#fd80eb99c8f653c847d294a001bdf2a3a6f768f5 in /home/jenkins/.gradle/go/repo/golang.org/x/sync/bb244395f28c52df3e99060750ebb26d.
Skip updating golang.org/x/sys#fde4db37ae7ad8191b03d30d27f258b5291ae4e3 in /home/jenkins/.gradle/go/repo/golang.org/x/sys/c019fea3f060e6ac3a7ba229face9b20.
Skip updating golang.org/x/text#23ae387dee1f90d29a23c0e87ee0b46038fbed0e in /home/jenkins/.gradle/go/repo/golang.org/x/text/200349d30742977d7197074f990dbeb9.
Skip updating github.com/etcd-io/etcd#11214aa33bf5a47d3d9d8dafe0f6b97237dfe921 in /home/jenkins/.gradle/go/repo/github.com/etcd-io/etcd/b9d5cfe72873ef37d0a722b1dba96aeb.
Skip updating google.golang.org/api#0324d5e90dc7753607860272666845fad9ceb97e in /home/jenkins/.gradle/go/repo/google.golang.org/api/e28049fb85a1109eef37826e4bbdd908.
Skip updating google.golang.org/genproto#4d944d34d83c502a5f761500a14d8842648415c3 in /home/jenkins/.gradle/go/repo/google.golang.org/genproto/d671e773e8f05b7375b87bbe0b61b2ce.
Skip updating google.golang.org/grpc#5e8f83304c0563d1ba74db05fee83d9c18ab9a58 in /home/jenkins/.gradle/go/repo/google.golang.org/grpc/f8a4497e5e07f775c7d9e343b98b7521.
Skip updating google.golang.org/protobuf#d165be301fb1e13390ad453281ded24385fd8ebc in /home/jenkins/.gradle/go/repo/google.golang.org/protobuf/61ae196259c623d1bac9339f33b7fb02.
Skip updating github.com/etcd-io/etcd#11214aa33bf5a47d3d9d8dafe0f6b97237dfe921 in /home/jenkins/.gradle/go/repo/github.com/etcd-io/etcd/b9d5cfe72873ef37d0a722b1dba96aeb.
Skip updating github.com/etcd-io/etcd#11214aa33bf5a47d3d9d8dafe0f6b97237dfe921 in /home/jenkins/.gradle/go/repo/github.com/etcd-io/etcd/b9d5cfe72873ef37d0a722b1dba96aeb.
:sdks:go:installDependencies (Thread[Execution **** for ':' Thread 8,5,main]) completed. Took
23.777 secs.
:sdks:go:buildLinuxAmd64 (Thread[Execution **** for ':' Thread 8,5,main]) started.

> Task :sdks:go:buildLinuxAmd64
Caching disabled for task ':sdks:go:buildLinuxAmd64' because:
  Caching has not been enabled for the task
Task ':sdks:go:buildLinuxAmd64' is not up-to-date because:
  Task has not declared any outputs despite executing actions.
:sdks:go:buildLinuxAmd64 (Thread[Execution **** for ':' Thread 8,5,main]) completed. Took
1 mins 34.902 secs.
:sdks:go:goBuild (Thread[Execution **** for ':' Thread 8,5,main]) started.

> Task :sdks:go:goBuild
Caching disabled for task ':sdks:go:goBuild' because:
  Caching has not been enabled for the task
Task ':sdks:go:goBuild' is not up-to-date because:
  Task has not declared any outputs despite executing actions.
:sdks:go:goBuild (Thread[Execution **** for ':' Thread 8,5,main]) completed. Took 0.002 secs.
:sdks:java:container:resolveBuildDependencies (Thread[Execution **** for ':' Thread 8,5,main])
started.

> Task :sdks:java:container:resolveBuildDependencies
Watching 2396 directories to track changes
Watching 2397 directories to track changes
Watching 2397 directories to track changes
Watching 4800 directories to track changes
Caching disabled for task ':sdks:java:container:resolveBuildDependencies' because:
  Caching has not been enabled for the task
Task ':sdks:java:container:resolveBuildDependencies' is not up-to-date because:
  No history is available.
Watching 4799 directories to track changes
Cache <https://ci-beam.apache.org/job/beam_PerformanceTests_Kafka_IO/ws/src/sdks/java/container/.gogradle/cache/PersistenceNotationToResolvedCache-0.10.bin>
not found, skip.
Cache <https://ci-beam.apache.org/job/beam_PerformanceTests_Kafka_IO/ws/src/sdks/java/container/.gogradle/cache/PersistenceResolvedToDependenciesCache-0.10.bin>
not found, skip.
Resolving ./github.com/apache/beam/sdks/go@<https://ci-beam.apache.org/job/beam_PerformanceTests_Kafka_IO/ws/src/sdks/go>
Watching 4800 directories to track changes
:sdks:java:container:resolveBuildDependencies (Thread[Execution **** for ':' Thread 8,5,main])
completed. Took 14.037 secs.
:sdks:java:container:installDependencies (Thread[Execution **** for ':' Thread 8,5,main])
started.

> Task :sdks:java:container:installDependencies
Caching disabled for task ':sdks:java:container:installDependencies' because:
  Caching has not been enabled for the task
Task ':sdks:java:container:installDependencies' is not up-to-date because:
  Task has not declared any outputs despite executing actions.
Cache <https://ci-beam.apache.org/job/beam_PerformanceTests_Kafka_IO/ws/src/sdks/java/container/.gogradle/cache/VendorSnapshot-0.10.bin>
not found, skip.
:sdks:java:container:installDependencies (Thread[Execution **** for ':' Thread 8,5,main])
completed. Took 8.258 secs.
:sdks:java:container:buildLinuxAmd64 (Thread[Execution **** for ':' Thread 8,5,main]) started.

> Task :sdks:java:container:buildLinuxAmd64
Watching 4800 directories to track changes
Watching 4801 directories to track changes
Watching 4802 directories to track changes
Watching 4803 directories to track changes
Watching 4804 directories to track changes
Watching 4805 directories to track changes
Watching 4806 directories to track changes
Watching 4807 directories to track changes
Watching 4808 directories to track changes
Watching 4809 directories to track changes
Watching 4810 directories to track changes
Watching 4811 directories to track changes
Watching 4812 directories to track changes
Watching 4813 directories to track changes
Watching 4814 directories to track changes
Watching 4815 directories to track changes
Watching 4816 directories to track changes
Watching 4817 directories to track changes
Watching 4818 directories to track changes
Watching 4818 directories to track changes
Watching 4819 directories to track changes
Watching 4820 directories to track changes
Watching 4821 directories to track changes
Watching 4822 directories to track changes
Watching 4823 directories to track changes
Watching 4824 directories to track changes
Watching 4824 directories to track changes
Watching 4825 directories to track changes
Watching 4826 directories to track changes
Watching 4827 directories to track changes
Watching 4827 directories to track changes
Watching 4828 directories to track changes
Watching 4828 directories to track changes
Watching 4829 directories to track changes
Watching 4830 directories to track changes
Watching 4831 directories to track changes
Watching 4832 directories to track changes
Watching 4833 directories to track changes
Watching 4834 directories to track changes
Watching 4835 directories to track changes
Watching 4836 directories to track changes
Watching 4837 directories to track changes
Unable to watch the file system for changes. The inotify watches limit is too low.
Caching disabled for task ':sdks:java:container:buildLinuxAmd64' because:
  Caching has not been enabled for the task
Task ':sdks:java:container:buildLinuxAmd64' is not up-to-date because:
  No history is available.
:sdks:java:container:buildLinuxAmd64 (Thread[Execution **** for ':' Thread 8,5,main]) completed.
Took 43.926 secs.
:sdks:java:container:goBuild (Thread[Execution **** for ':' Thread 8,5,main]) started.

> Task :sdks:java:container:goBuild
Caching disabled for task ':sdks:java:container:goBuild' because:
  Caching has not been enabled for the task
Task ':sdks:java:container:goBuild' is not up-to-date because:
  Task has not declared any outputs despite executing actions.
:sdks:java:container:goBuild (Thread[Execution **** for ':' Thread 8,5,main]) completed. Took
0.017 secs.
:sdks:java:container:java8:copySdkHarnessLauncher (Thread[Execution **** for ':' Thread 8,5,main])
started.

> Task :sdks:java:container:java8:copySdkHarnessLauncher
Caching disabled for task ':sdks:java:container:java8:copySdkHarnessLauncher' because:
  Caching has not been enabled for the task
Task ':sdks:java:container:java8:copySdkHarnessLauncher' is not up-to-date because:
  No history is available.
:sdks:java:container:java8:copySdkHarnessLauncher (Thread[Execution **** for ':' Thread 8,5,main])
completed. Took 3.509 secs.

FAILURE: Build failed with an exception.

* What went wrong:
Execution failed for task ':release:go-licenses:java:dockerRun'.
> Process 'command 'docker'' finished with non-zero exit value 1

* Try:
Run with --stacktrace option to get the stack trace. Run with --debug option to get more log
output. Run with --scan to get full insights.

* Get more help at https://help.gradle.org

Deprecated Gradle features were used in this build, making it incompatible with Gradle 7.0.
Use '--warning-mode all' to show the individual deprecation warnings.
See https://docs.gradle.org/6.8/userguide/command_line_interface.html#sec:command_line_warnings

BUILD FAILED in 21m 19s
131 actionable tasks: 20 executed, 111 up-to-date
Gradle was unable to watch the file system for changes. The inotify watches limit is too low.

Publishing build scan...
https://gradle.com/s/7veuplpv44bjq

Build step 'Invoke Gradle script' changed build result to FAILURE
Build step 'Invoke Gradle script' marked build as failure

---------------------------------------------------------------------
To unsubscribe, e-mail: builds-unsubscribe@beam.apache.org
For additional commands, e-mail: builds-help@beam.apache.org


Mime
View raw message