beam-builds mailing list archives

Site index · List index
Message view « Date » · « Thread »
Top « Date » · « Thread »
From Apache Jenkins Server <jenk...@builds.apache.org>
Subject Build failed in Jenkins: beam_PostCommit_Java #7148
Date Sat, 30 Jan 2021 19:46:05 GMT
See <https://ci-beam.apache.org/job/beam_PostCommit_Java/7148/display/redirect?page=changes>

Changes:

[Ismaël Mejía] [website] Clarify JIRA priority for security issues (CVEs)


------------------------------------------
[...truncated 104.81 KB...]
golang.org/x/text,https://go.googlesource.com/text/+/refs/heads/master/LICENSE,BSD-3-Clause
google.golang.org/protobuf,https://go.googlesource.com/protobuf/+/refs/heads/master/LICENSE,BSD-3-Clause
google.golang.org/genproto/googleapis/rpc/status,https://github.com/googleapis/go-genproto/blob/master/LICENSE,Apache-2.0
golang.org/x/sys,https://go.googlesource.com/sys/+/refs/heads/master/LICENSE,BSD-3-Clause
+ chmod -R a+w /output/licenses

> Task :release:go-licenses:java:createLicenses
> Task :sdks:java:container:java8:copyGolangLicenses
> Task :sdks:java:io:kafka:kafkaVersion01103Test

> Task :sdks:go:resolveBuildDependencies
Resolving golang.org/x/text: commit='23ae387dee1f90d29a23c0e87ee0b46038fbed0e', urls=[https://go.googlesource.com/text]
Resolving cached github.com/etcd-io/etcd: commit='11214aa33bf5a47d3d9d8dafe0f6b97237dfe921',
urls=[https://github.com/etcd-io/etcd.git, git@github.com:etcd-io/etcd.git]

> Task :sdks:java:io:hadoop-file-system:hadoopVersion285Test
> Task :sdks:java:io:hadoop-format:runHadoopFormatIO2101IT
> Task :sdks:java:io:kafka:kafkaVersion100BatchIT
> Task :sdks:java:io:hadoop-format:runHadoopFormatIO2101Test
> Task :sdks:java:io:kafka:kafkaVersion100Test
> Task :sdks:java:io:hadoop-file-system:hadoopVersion292Test
> Task :sdks:java:io:kafka:kafkaVersion111BatchIT
> Task :sdks:java:io:hadoop-file-system:hadoopVersion321Test
> Task :sdks:java:io:hadoop-format:runHadoopFormatIO285ElasticIT
> Task :sdks:java:io:hadoop-file-system:hadoopVersionsTest
> Task :sdks:java:io:kafka:kafkaVersion111Test

> Task :sdks:go:resolveBuildDependencies
Resolving google.golang.org/api: commit='0324d5e90dc7753607860272666845fad9ceb97e', urls=[https://code.googlesource.com/google-api-go-client]

> Task :sdks:java:io:kafka:kafkaVersion201BatchIT
> Task :sdks:java:io:hadoop-format:runHadoopFormatIO285IT
> Task :sdks:java:io:kafka:kafkaVersion201Test
> Task :sdks:java:io:hadoop-format:runHadoopFormatIO285Test
> Task :sdks:java:io:kafka:kafkaVersion211BatchIT

> Task :sdks:go:resolveBuildDependencies
Resolving google.golang.org/genproto: commit='4d944d34d83c502a5f761500a14d8842648415c3', urls=[https://github.com/google/go-genproto]
Resolving google.golang.org/grpc: commit='5e8f83304c0563d1ba74db05fee83d9c18ab9a58', urls=[https://github.com/grpc/grpc-go]
Resolving google.golang.org/protobuf: commit='d165be301fb1e13390ad453281ded24385fd8ebc', urls=[https://go.googlesource.com/protobuf]
Resolving cached github.com/etcd-io/etcd: commit='11214aa33bf5a47d3d9d8dafe0f6b97237dfe921',
urls=[https://github.com/etcd-io/etcd.git, git@github.com:etcd-io/etcd.git]
Resolving cached github.com/etcd-io/etcd: commit='11214aa33bf5a47d3d9d8dafe0f6b97237dfe921',
urls=[https://github.com/etcd-io/etcd.git, git@github.com:etcd-io/etcd.git]

> Task :sdks:java:io:kafka:kafkaVersion211Test
> Task :sdks:java:io:hadoop-format:runHadoopFormatIO292ElasticIT
> Task :sdks:go:installDependencies
> Task :sdks:java:io:kafka:kafkaVersion222BatchIT

> Task :sdks:java:io:google-cloud-platform:integrationTest

org.apache.beam.sdk.io.gcp.healthcare.FhirIOWriteIT > testFhirIO_Import[STU3] FAILED
    org.apache.beam.sdk.Pipeline$PipelineExecutionException at FhirIOWriteIT.java:139
        Caused by: java.lang.AssertionError at FhirIOWriteIT.java:137
            Caused by: java.lang.AssertionError at MatcherAssert.java:18

> Task :sdks:java:io:kafka:kafkaVersion222Test
> Task :sdks:java:io:hadoop-format:runHadoopFormatIO292IT
> Task :sdks:java:io:kafka:kafkaVersion231BatchIT
> Task :sdks:java:io:hadoop-format:runHadoopFormatIO292Test
> Task :sdks:go:buildLinuxAmd64
> Task :sdks:go:goBuild
> Task :sdks:java:io:kafka:kafkaVersion231Test

> Task :sdks:java:container:resolveBuildDependencies
Resolving ./github.com/apache/beam/sdks/go@<https://ci-beam.apache.org/job/beam_PostCommit_Java/ws/src/sdks/go>

> Task :sdks:java:container:installDependencies
> Task :sdks:java:container:buildLinuxAmd64
> Task :sdks:java:container:goBuild
> Task :sdks:java:container:java8:copySdkHarnessLauncher

> Task :sdks:java:container:java8:dockerPrepare
Unable to watch the file system for changes. The inotify watches limit is too low.

> Task :sdks:java:io:kafka:kafkaVersion241BatchIT
> Task :sdks:java:io:hadoop-format:runHadoopFormatIO321ElasticIT
> Task :sdks:java:container:java8:docker

> Task :runners:google-cloud-dataflow-java:buildAndPushDockerContainer
WARNING: `gcloud docker` will not be supported for Docker client versions above 18.03.

As an alternative, use `gcloud auth configure-docker` to configure `docker` to
use `gcloud` as a credential helper, then use `docker` as you would for non-GCR
registries, e.g. `docker pull gcr.io/project-id/my-image`. Add
`--verbosity=error` to silence this warning: `gcloud docker
--verbosity=error -- pull gcr.io/project-id/my-image`.

See: https://cloud.google.com/container-registry/docs/support/deprecation-notices#gcloud-docker

The push refers to repository [us.gcr.io/apache-beam-testing/java-postcommit-it/java]
42ff3f030f33: Preparing
bdde3fb49206: Preparing
75b580aaba25: Preparing
babdb1831535: Preparing
088379167cd5: Preparing
b3b100537c85: Preparing
be0d5590bfb1: Preparing
56dd282ad322: Preparing
8c2786d1cdf8: Preparing
1a149ba432fd: Preparing
ff09eb6c643e: Preparing
25b2e6cfc187: Preparing
7df6dd475950: Preparing
7496c5e8691b: Preparing
aa7af8a465c6: Preparing
ef9a7b8862f4: Preparing
a1f2f42922b1: Preparing
4762552ad7d8: Preparing
b3b100537c85: Waiting
be0d5590bfb1: Waiting
56dd282ad322: Waiting
8c2786d1cdf8: Waiting
1a149ba432fd: Waiting
ef9a7b8862f4: Waiting
ff09eb6c643e: Waiting
7df6dd475950: Waiting
a1f2f42922b1: Waiting
25b2e6cfc187: Waiting
7496c5e8691b: Waiting
aa7af8a465c6: Waiting
4762552ad7d8: Waiting
42ff3f030f33: Pushed
babdb1831535: Pushed
088379167cd5: Pushed
bdde3fb49206: Pushed
75b580aaba25: Pushed
56dd282ad322: Pushed
1a149ba432fd: Pushed
25b2e6cfc187: Layer already exists
be0d5590bfb1: Pushed
7df6dd475950: Layer already exists
7496c5e8691b: Layer already exists
aa7af8a465c6: Layer already exists
ef9a7b8862f4: Layer already exists
a1f2f42922b1: Layer already exists
4762552ad7d8: Layer already exists
ff09eb6c643e: Pushed
b3b100537c85: Pushed
8c2786d1cdf8: Pushed
20210130180047: digest: sha256:b353495ef0490df8ecbcd1273ad8b1833d977bf8a34179170e3b9fb7701cc67a
size: 4098

> Task :runners:google-cloud-dataflow-java:coreSDKJavaRunnerV2IntegrationTest NO-SOURCE
> Task :sdks:java:io:kafka:kafkaVersion241Test
> Task :runners:google-cloud-dataflow-java:examplesJavaRunnerV2IntegrationTest

> Task :sdks:java:io:google-cloud-platform:integrationTest

43 tests completed, 1 failed, 1 skipped

> Task :sdks:java:io:google-cloud-platform:integrationTest FAILED
> Task :sdks:java:io:google-cloud-platform:integrationTestKms
> Task :sdks:java:io:hadoop-format:runHadoopFormatIO321IT
> Task :sdks:java:io:kafka:kafkaVersion251BatchIT
> Task :sdks:java:io:kafka:kafkaVersion251Test
> Task :sdks:java:io:hadoop-format:runHadoopFormatIO321Test
> Task :sdks:java:io:kafka:kafkaVersionsCompatibilityTest
> Task :sdks:java:io:hadoop-format:hadoopVersionsTest
> Task :javaHadoopVersionsTest

> Task :runners:google-cloud-dataflow-java:examplesJavaRunnerV2IntegrationTest

***********************************************************
***********************************************************
**********************Set Up Pubsub************************
The Pub/Sub topic has been set up for this example: projects/apache-beam-testing/topics/testpipeline-jenkins-0130181434-63b76c27
The Pub/Sub subscription has been set up for this example: projects/apache-beam-testing/subscriptions/testpipeline-jenkins-0130181434-63b76c27
******************Set Up Big Query Table*******************
The BigQuery table has been set up for this example: apache-beam-testing:traffic_routes_1612030464757.traffic_routes_table
*************************Tear Down*************************
The Pub/Sub topic has been deleted: projects/apache-beam-testing/topics/testpipeline-jenkins-0130181434-63b76c27
The Pub/Sub subscription has been deleted: projects/apache-beam-testing/subscriptions/testpipeline-jenkins-0130181434-63b76c27
The BigQuery table might contain the example's output, and it is not deleted automatically:
apache-beam-testing:traffic_routes_1612030464757.traffic_routes_table
Please go to the Developers Console to delete it manually. Otherwise, you may be charged for
its usage.
***********************************************************
***********************************************************

> Task :sdks:java:extensions:zetasketch:postCommit

> Task :runners:google-cloud-dataflow-java:examplesJavaRunnerV2IntegrationTest

***********************************************************
***********************************************************
**********************Set Up Pubsub************************
The Pub/Sub topic has been set up for this example: projects/apache-beam-testing/topics/testpipeline-jenkins-0130184029-a77f11f0
The Pub/Sub subscription has been set up for this example: projects/apache-beam-testing/subscriptions/testpipeline-jenkins-0130184029-a77f11f0
******************Set Up Big Query Table*******************
The BigQuery table has been set up for this example: apache-beam-testing:traffic_max_lane_flow_1612032029108.traffic_max_lane_flow_table
*************************Tear Down*************************
The Pub/Sub topic has been deleted: projects/apache-beam-testing/topics/testpipeline-jenkins-0130184029-a77f11f0
The Pub/Sub subscription has been deleted: projects/apache-beam-testing/subscriptions/testpipeline-jenkins-0130184029-a77f11f0
The BigQuery table might contain the example's output, and it is not deleted automatically:
apache-beam-testing:traffic_max_lane_flow_1612032029108.traffic_max_lane_flow_table
Please go to the Developers Console to delete it manually. Otherwise, you may be charged for
its usage.
***********************************************************
***********************************************************

> Task :runners:google-cloud-dataflow-java:googleCloudPlatformRunnerV2IntegrationTest

> Task :runners:google-cloud-dataflow-java:cleanUpDockerImages
Untagged: us.gcr.io/apache-beam-testing/java-postcommit-it/java:20210130180047
Untagged: us.gcr.io/apache-beam-testing/java-postcommit-it/java@sha256:b353495ef0490df8ecbcd1273ad8b1833d977bf8a34179170e3b9fb7701cc67a
Deleted: sha256:a471981b7c04a2a6ade4b4b2a21e5fae6c134052f73c973ec08429d8156e99d3
Deleted: sha256:bcad9486bbe24af2f9711c3bc2f6b19b3c0c2194afb11028d23896fe9b45fa20
Deleted: sha256:0c9a121f495f8beff6452ba7569d347e1a70443a5b30688bf222ab95b79da7bf
Deleted: sha256:b6fcc78c9503c794ea013f4767101deedb6c21719c01e88d1a6bd6b658357ff4
Deleted: sha256:3303c73bcfa88c920f287b8bac42d795cadad26f20712f5f750fded45ce85ab3
Deleted: sha256:3ddfc02866b716e818a785a3587dcaca56057414ecc687bc3f2d70ab1dd9706f
Deleted: sha256:73561955d5ec72c3ad904b41c098c6287237028437c6e9248ac7e9340fd468a0
Deleted: sha256:4c35c9827bfe67a0758a794e1fa2836e23291cd7b1999fcfb4ee0ad691e28e62
Deleted: sha256:191503de3b1576412377abfc380194dfbfde33a444e8fbe6fbc48ef5cb96c79c
Deleted: sha256:ce644843e38c69fb2396f36f6f6e4682f877cf468d5abea6a7cd1c84e10ff854
Deleted: sha256:542191f24290f4223c2476014a8e88eef4a8bac74545bc9cc1766a22828d4752
Deleted: sha256:cc26aa92931ff340cfc818a03b54ef1b09d5638aca5197ed5efb2a30033f3b21
Deleted: sha256:534731450b3373187e40af04f05c41260607cf7d2d3344b430fdbbca4067b86b
Deleted: sha256:eb170d5c34b2b547b9d3072bc3c9270dbeb687e1f41cf03cf8711134ff8540f2
Deleted: sha256:86eb4af649c470b56606c15399f4fc905415938efee393609601767da06b62aa
Digests:
- us.gcr.io/apache-beam-testing/java-postcommit-it/java@sha256:b353495ef0490df8ecbcd1273ad8b1833d977bf8a34179170e3b9fb7701cc67a
  Associated tags:
 - 20210130180047
Tags:
- us.gcr.io/apache-beam-testing/java-postcommit-it/java:20210130180047
Deleted [us.gcr.io/apache-beam-testing/java-postcommit-it/java:20210130180047].
Deleted [us.gcr.io/apache-beam-testing/java-postcommit-it/java@sha256:b353495ef0490df8ecbcd1273ad8b1833d977bf8a34179170e3b9fb7701cc67a].

> Task :runners:google-cloud-dataflow-java:postCommitRunnerV2

FAILURE: Build failed with an exception.

* What went wrong:
Execution failed for task ':sdks:java:io:google-cloud-platform:integrationTest'.
> There were failing tests. See the report at: file://<https://ci-beam.apache.org/job/beam_PostCommit_Java/ws/src/sdks/java/io/google-cloud-platform/build/reports/tests/integrationTest/index.html>

* Try:
Run with --stacktrace option to get the stack trace. Run with --info or --debug option to
get more log output. Run with --scan to get full insights.

* Get more help at https://help.gradle.org

Deprecated Gradle features were used in this build, making it incompatible with Gradle 7.0.
Use '--warning-mode all' to show the individual deprecation warnings.
See https://docs.gradle.org/6.8/userguide/command_line_interface.html#sec:command_line_warnings

BUILD FAILED in 1h 45m 41s
248 actionable tasks: 156 executed, 90 from cache, 2 up-to-date
Gradle was unable to watch the file system for changes. The inotify watches limit is too low.

Publishing build scan...
https://gradle.com/s/phujcpyb5qi6q

Build step 'Invoke Gradle script' changed build result to FAILURE
Build step 'Invoke Gradle script' marked build as failure

---------------------------------------------------------------------
To unsubscribe, e-mail: builds-unsubscribe@beam.apache.org
For additional commands, e-mail: builds-help@beam.apache.org


Mime
View raw message