beam-builds mailing list archives

Site index · List index
Message view « Date » · « Thread »
Top « Date » · « Thread »
From Apache Jenkins Server <jenk...@builds.apache.org>
Subject Build failed in Jenkins: beam_PostCommit_Go_VR_Flink #4233
Date Thu, 07 Jan 2021 12:29:27 GMT
See <https://ci-beam.apache.org/job/beam_PostCommit_Go_VR_Flink/4233/display/redirect>

Changes:


------------------------------------------
[...truncated 269.75 KB...]
      >
      component_coder_ids: "c13"
    >
  >
  coders: <
    key: "c15"
    value: <
      spec: <
        urn: "beam:coder:iterable:v1"
      >
      component_coder_ids: "c14"
    >
  >
  coders: <
    key: "c16"
    value: <
      spec: <
        urn: "beam:coder:kv:v1"
      >
      component_coder_ids: "c7"
      component_coder_ids: "c15"
    >
  >
  coders: <
    key: "c17"
    value: <
      spec: <
        urn: "beam:coder:kv:v1"
      >
      component_coder_ids: "c3"
      component_coder_ids: "c3"
    >
  >
  coders: <
    key: "c18"
    value: <
      spec: <
        urn: "beam:coder:iterable:v1"
      >
      component_coder_ids: "c3"
    >
  >
  coders: <
    key: "c19"
    value: <
      spec: <
        urn: "beam:coder:kv:v1"
      >
      component_coder_ids: "c3"
      component_coder_ids: "c18"
    >
  >
  coders: <
    key: "c2"
    value: <
      spec: <
        urn: "beam:go:coder:custom:v1"
        payload: "Cgd2YXJpbnR6EgIIAhqFAQpxZ2l0aHViLmNvbS9hcGFjaGUvYmVhbS9zZGtzL2dvL3Rlc3QvdmVuZG9yL2dpdGh1Yi5jb20vYXBhY2hlL2JlYW0vc2Rrcy9nby9wa2cvYmVhbS9jb3JlL3J1bnRpbWUvY29kZXJ4LmVuY1ZhckludFoSEAgWIgQIGUAPKgYIFBICCAgikQEKcWdpdGh1Yi5jb20vYXBhY2hlL2JlYW0vc2Rrcy9nby90ZXN0L3ZlbmRvci9naXRodWIuY29tL2FwYWNoZS9iZWFtL3Nka3MvZ28vcGtnL2JlYW0vY29yZS9ydW50aW1lL2NvZGVyeC5kZWNWYXJJbnRaEhwIFiIECBlAAyIGCBQSAggIKgQIGUAPKgQIGUAB"
      >
    >
  >
  coders: <
    key: "c3"
    value: <
      spec: <
        urn: "beam:coder:length_prefix:v1"
      >
      component_coder_ids: "c2"
    >
  >
  coders: <
    key: "c4"
    value: <
      spec: <
        urn: "beam:coder:kv:v1"
      >
      component_coder_ids: "c3"
      component_coder_ids: "c0"
    >
  >
  coders: <
    key: "c5"
    value: <
      spec: <
        urn: "beam:coder:iterable:v1"
      >
      component_coder_ids: "c0"
    >
  >
  coders: <
    key: "c6"
    value: <
      spec: <
        urn: "beam:coder:kv:v1"
      >
      component_coder_ids: "c3"
      component_coder_ids: "c5"
    >
  >
  coders: <
    key: "c7"
    value: <
      spec: <
        urn: "beam:coder:string_utf8:v1"
      >
    >
  >
  coders: <
    key: "c8"
    value: <
      spec: <
        urn: "beam:coder:kv:v1"
      >
      component_coder_ids: "c7"
      component_coder_ids: "c3"
    >
  >
  coders: <
    key: "c9"
    value: <
      spec: <
        urn: "beam:coder:kv:v1"
      >
      component_coder_ids: "c7"
      component_coder_ids: "c7"
    >
  >
  environments: <
    key: "go"
    value: <
      urn: "beam:env:docker:v1"
      payload: "\nAus.gcr.io/apache-beam-testing/jenkins/beam_go_sdk:20210107-120619"
      capabilities: "beam:protocol:progress_reporting:v0"
      capabilities: "beam:protocol:multi_core_bundle_processing:v1"
      capabilities: "beam:version:sdk_base:go"
      capabilities: "beam:coder:bytes:v1"
      capabilities: "beam:coder:bool:v1"
      capabilities: "beam:coder:varint:v1"
      capabilities: "beam:coder:double:v1"
      capabilities: "beam:coder:string_utf8:v1"
      capabilities: "beam:coder:length_prefix:v1"
      capabilities: "beam:coder:kv:v1"
      capabilities: "beam:coder:iterable:v1"
      capabilities: "beam:coder:state_backed_iterable:v1"
      capabilities: "beam:coder:windowed_value:v1"
      capabilities: "beam:coder:global_window:v1"
      capabilities: "beam:coder:interval_window:v1"
      dependencies: <
        type_urn: "beam:artifact:type:go_worker_binary:v1"
        role_urn: "beam:artifact:role:staging_to:v1"
        role_payload: "\n\006worker"
      >
    >
  >
>
root_transform_ids: "e3"
root_transform_ids: "e1"
root_transform_ids: "e5"
root_transform_ids: "s1"
root_transform_ids: "e11_reshuffle"
root_transform_ids: "e12"
root_transform_ids: "s5"
root_transform_ids: "s4"
root_transform_ids: "s3"
root_transform_ids: "s2"
2021/01/07 12:29:22 Test reshuffle:reshufflekv failed: 	connecting to job service
failed to dial server at localhost:44805
	caused by:
context deadline exceeded
2021/01/07 12:29:22 Result: 11 tests failed

if [[ ! -z "$JOB_PORT" ]]; then
  # Shut down the job server
  kill %1 || echo "Failed to shut down job server"
fi

if [[ "$PUSH_CONTAINER_TO_GCR" = 'yes' ]]; then
  # Delete the container locally and remotely
  docker rmi $CONTAINER:$TAG || echo "Failed to remove container"
  gcloud --quiet container images delete $CONTAINER:$TAG || echo "Failed to delete container"

  # Clean up tempdir
  rm -rf $TMPDIR
fi
Untagged: us.gcr.io/apache-beam-testing/jenkins/beam_go_sdk:20210107-120619
Untagged: us.gcr.io/apache-beam-testing/jenkins/beam_go_sdk@sha256:989dfe25b8c10997cd2ca761a924b69dbf7b09b4b1d3cf7c9eec88479c2dc4ba
Deleted: sha256:4da6c837f5ecabdd05adb727844ee7c82d24f3904653900177025cda22e7c11a
Deleted: sha256:1c1f74b7d252fa574b9d6b391f45e4158d2b9530ad20141045ef050de5928ad1
Deleted: sha256:63f79a3fa32759728f623e925fb2ff327f04eb9535cb29b1e79dbc4dca39a7bf
Deleted: sha256:07d97a418c2f0fa4f1af0d0a755076c07ee700ee230279334948c09827c75628
Deleted: sha256:120213625d9bf00cd10ad5f7aedeadd2ada3903eec04c80c448dd395a12adf85
Deleted: sha256:c59335bb67908cf9e2d0bda1b92ae995338e611bac0c6ee0057fe918f9992e8f
Deleted: sha256:ce825dc5d64e0bd7c63bbc2f695b82bdd1e0b1209231adb2a3ad6835d7b96a1c
Deleted: sha256:9bb70638bc02351cd6b0240e3ef70010d912a82be30ef4af5de6a41e4400cef5
Deleted: sha256:59941de883042154f080d10360a5cc4c3d5f8d849c6429cf25aea888fab64cb2
Deleted: sha256:9f5ca51f6a692171784e6e308619694825a496e9d5f48639d2d2e5f409196394
Deleted: sha256:f8af810aec5d4c16cd428d2015d1eefb39fa18e47eee706adef487e2a56336ae
Deleted: sha256:f04fa4dbb59dd32d9711c13ddf314ee1eab37acf6fcd5d10593817f85e471a51
Deleted: sha256:bb3524aa8ad44016fc5a39ef9964afd418bc19736f2fe3a9c87eb013676fb63f
Deleted: sha256:ff19e6214e0bf05cd97d74539918ec5a010d4db99b1b7fa17f396a9536ee9039
Deleted: sha256:64a9826ed4c722c45bf477fe47ca10ca25b96edaf23ccb528a1aa33b6a58a04d
Deleted: sha256:13c70da16868b60e526d82b77cb1e25855b9ecf6df6daeddff04474f98fa8470
Deleted: sha256:f9e0390f940393b465e2a1e8d545309f007c13cdf7e9ada3cdb4d5315bbd7393
Digests:
- us.gcr.io/apache-beam-testing/jenkins/beam_go_sdk@sha256:989dfe25b8c10997cd2ca761a924b69dbf7b09b4b1d3cf7c9eec88479c2dc4ba
  Associated tags:
 - 20210107-120619
Tags:
- us.gcr.io/apache-beam-testing/jenkins/beam_go_sdk:20210107-120619
Deleted [us.gcr.io/apache-beam-testing/jenkins/beam_go_sdk:20210107-120619].
Deleted [us.gcr.io/apache-beam-testing/jenkins/beam_go_sdk@sha256:989dfe25b8c10997cd2ca761a924b69dbf7b09b4b1d3cf7c9eec88479c2dc4ba].

if [[ "$TEST_EXIT_CODE" -eq 0 ]]; then
>>> FAILURE
  echo ">>> SUCCESS"
else
  echo ">>> FAILURE"
fi
exit $TEST_EXIT_CODE

> Task :sdks:go:test:flinkValidatesRunner FAILED

FAILURE: Build failed with an exception.

* Where:
Build file '<https://ci-beam.apache.org/job/beam_PostCommit_Go_VR_Flink/ws/src/sdks/go/test/build.gradle'>
line: 150

* What went wrong:
Execution failed for task ':sdks:go:test:flinkValidatesRunner'.
> Process 'command 'sh'' finished with non-zero exit value 1

* Try:
Run with --stacktrace option to get the stack trace. Run with --info or --debug option to
get more log output. Run with --scan to get full insights.

* Get more help at https://help.gradle.org

Deprecated Gradle features were used in this build, making it incompatible with Gradle 7.0.
Use '--warning-mode all' to show the individual deprecation warnings.
See https://docs.gradle.org/6.7.1/userguide/command_line_interface.html#sec:command_line_warnings

BUILD FAILED in 29m 4s
130 actionable tasks: 88 executed, 42 from cache
Gradle was unable to watch the file system for changes. The inotify watches limit is too low.

Publishing build scan...
https://gradle.com/s/tora6yr6jwxba

Build step 'Invoke Gradle script' changed build result to FAILURE
Build step 'Invoke Gradle script' marked build as failure

---------------------------------------------------------------------
To unsubscribe, e-mail: builds-unsubscribe@beam.apache.org
For additional commands, e-mail: builds-help@beam.apache.org


Mime
View raw message