beam-builds mailing list archives

Site index · List index
Message view « Date » · « Thread »
Top « Date » · « Thread »
From Apache Jenkins Server <jenk...@builds.apache.org>
Subject Build failed in Jenkins: beam_SQLBigQueryIO_Batch_Performance_Test_Java #1481
Date Thu, 14 Jan 2021 07:01:04 GMT
See <https://ci-beam.apache.org/job/beam_SQLBigQueryIO_Batch_Performance_Test_Java/1481/display/redirect?page=changes>

Changes:

[noreply] [BEAM-11624] Add hash functions in beam sql  (#13733)

[noreply] [BEAM-11533] PubSub support Beam DATETIME (SQL TIMESTAMP) type (#13731)


------------------------------------------
[...truncated 428.41 KB...]
Task ':sdks:java:extensions:sql:perf-tests:integrationTest' is not up-to-date because:
  Task.upToDateWhen is false.
Watching 2232 directories to track changes
Watching 2232 directories to track changes
Starting process 'Gradle Test Executor 12'. Working directory: <https://ci-beam.apache.org/job/beam_SQLBigQueryIO_Batch_Performance_Test_Java/ws/src/sdks/java/extensions/sql/perf-tests>
Command: /usr/lib/jvm/java-8-openjdk-amd64/bin/java -DbeamTestPipelineOptions=["--project=apache-beam-testing","--tempLocation=gs://temp-storage-for-perf-tests/loadtests","--tempRoot=gs://temp-storage-for-perf-tests/loadtests","--metricsBigQueryDataset=beam_performance","--metricsBigQueryTable=sql_bqio_read_java_batch","--runner=DataflowRunner","--maxNumWorkers=5","--numWorkers=5","--autoscalingAlgorithm=NONE","--workerHarnessContainerImage=","--dataflowWorkerJar=<https://ci-beam.apache.org/job/beam_SQLBigQueryIO_Batch_Performance_Test_Java/ws/src/runners/google-cloud-dataflow-java/worker/legacy-worker/build/libs/beam-runners-google-cloud-dataflow-java-legacy-worker-2.28.0-SNAPSHOT.jar","--region=us-central1"]>
-Djava.security.manager=worker.org.gradle.process.internal.worker.child.BootstrapSecurityManager
-Dorg.gradle.native=false -Xmx2g -Dfile.encoding=UTF-8 -Duser.country=US -Duser.language=en
-Duser.variant -ea -cp /home/jenkins/.gradle/caches/6.7.1/workerMain/gradle-worker.jar worker.org.gradle.process.internal.worker.GradleWorkerMain
'Gradle Test Executor 12'
Successfully started process 'Gradle Test Executor 12'

org.apache.beam.sdk.extensions.sql.meta.provider.bigquery.BigQueryIOPushDownIT STANDARD_ERROR
    SLF4J: Class path contains multiple SLF4J bindings.
    SLF4J: Found binding in [jar:<https://ci-beam.apache.org/job/beam_SQLBigQueryIO_Batch_Performance_Test_Java/ws/src/runners/google-cloud-dataflow-java/worker/legacy-worker/build/libs/beam-runners-google-cloud-dataflow-java-legacy-worker-2.28.0-SNAPSHOT.jar!/org/slf4j/impl/StaticLoggerBinder.class]>
    SLF4J: Found binding in [jar:file:/home/jenkins/.gradle/caches/modules-2/files-2.1/org.slf4j/slf4j-jdk14/1.7.30/d35953dd2fe54ebe39fdf18cfd82fe6eb35b25ed/slf4j-jdk14-1.7.30.jar!/org/slf4j/impl/StaticLoggerBinder.class]
    SLF4J: See http://www.slf4j.org/codes.html#multiple_bindings for an explanation.
    SLF4J: Actual binding is of type [org.slf4j.impl.JDK14LoggerFactory]

org.apache.beam.sdk.extensions.sql.meta.provider.bigquery.BigQueryIOPushDownIT > readUsingDirectReadMethod
STANDARD_ERROR
    Jan 14, 2021 6:58:00 AM org.apache.beam.runners.dataflow.options.DataflowPipelineOptions$StagingLocationFactory
create
    INFO: No stagingLocation provided, falling back to gcpTempLocation
    Jan 14, 2021 6:58:00 AM org.apache.beam.runners.dataflow.DataflowRunner fromOptions
    INFO: PipelineOptions.filesToStage was not specified. Defaulting to files from the classpath:
will stage 228 files. Enable logging at DEBUG level to see which files will be staged.
    Jan 14, 2021 6:58:02 AM org.apache.beam.sdk.extensions.sql.meta.provider.bigquery.BigQueryTable
<init>
    INFO: BigQuery method is set to: DIRECT_READ
    Jan 14, 2021 6:58:02 AM org.apache.beam.sdk.extensions.sql.meta.provider.bigquery.BigQueryTable
<init>
    INFO: BigQuery writeDisposition is set to: WRITE_EMPTY
    Jan 14, 2021 6:58:02 AM org.apache.beam.sdk.extensions.sql.impl.CalciteQueryPlanner convertToBeamRel
    INFO: SQL:
    SELECT `HACKER_NEWS`.`by` AS `author`, `HACKER_NEWS`.`type`, `HACKER_NEWS`.`title`, `HACKER_NEWS`.`score`
    FROM `beam`.`HACKER_NEWS` AS `HACKER_NEWS`
    WHERE (`HACKER_NEWS`.`type` = 'story' OR `HACKER_NEWS`.`type` = 'job') AND `HACKER_NEWS`.`score`
> 2
    Jan 14, 2021 6:58:02 AM org.apache.beam.sdk.extensions.sql.meta.provider.bigquery.BigQueryTable
<init>
    INFO: BigQuery method is set to: DIRECT_READ
    Jan 14, 2021 6:58:02 AM org.apache.beam.sdk.extensions.sql.meta.provider.bigquery.BigQueryTable
<init>
    INFO: BigQuery writeDisposition is set to: WRITE_EMPTY
    Jan 14, 2021 6:58:03 AM org.apache.beam.sdk.extensions.sql.impl.CalciteQueryPlanner convertToBeamRel
    INFO: SQLPlan>
    LogicalProject(author=[$4], type=[$8], title=[$0], score=[$5])
      LogicalFilter(condition=[AND(OR(=($8, 'story'), =($8, 'job')), >($5, 2))])
        BeamIOSourceRel(table=[[beam, HACKER_NEWS]])

    Jan 14, 2021 6:58:03 AM org.apache.beam.sdk.extensions.sql.impl.CalciteQueryPlanner convertToBeamRel
    INFO: BEAMPlan>
    BeamCalcRel(expr#0..13=[{inputs}], expr#14=['story':VARCHAR], expr#15=[=($t8, $t14)],
expr#16=['job':VARCHAR], expr#17=[=($t8, $t16)], expr#18=[OR($t15, $t17)], expr#19=[2], expr#20=[>($t5,
$t19)], expr#21=[AND($t18, $t20)], author=[$t4], type=[$t8], title=[$t0], score=[$t5], $condition=[$t21])
      BeamIOSourceRel(table=[[beam, HACKER_NEWS]])


org.apache.beam.sdk.extensions.sql.meta.provider.bigquery.BigQueryIOPushDownIT > readUsingDirectReadMethod
FAILED
    java.lang.IllegalStateException: Unable to return a default Coder for BeamIOSourceRel_3/ParDo(RowMonitor)/ParMultiDo(RowMonitor).output
[PCollection@807479454]. Correct one of the following root causes:
      No Coder has been manually specified;  you may do so using .setCoder().
      Inferring a Coder from the CoderRegistry failed: Cannot provide a coder for a Beam Row.
Please provide a schema instead using PCollection.setRowSchema.
      Using the default output Coder from the producing PTransform failed: PTransform.getOutputCoder
called.
        at org.apache.beam.vendor.guava.v26_0_jre.com.google.common.base.Preconditions.checkState(Preconditions.java:507)
        at org.apache.beam.sdk.values.PCollection.getCoder(PCollection.java:280)
        at org.apache.beam.sdk.values.PCollection.finishSpecifying(PCollection.java:117)
        at org.apache.beam.sdk.runners.TransformHierarchy.finishSpecifyingInput(TransformHierarchy.java:153)
        at org.apache.beam.sdk.Pipeline.applyInternal(Pipeline.java:546)
        at org.apache.beam.sdk.Pipeline.applyTransform(Pipeline.java:498)
        at org.apache.beam.sdk.extensions.sql.impl.rel.BeamSqlRelUtils.toPCollection(BeamSqlRelUtils.java:72)
        at org.apache.beam.sdk.extensions.sql.impl.rel.BeamSqlRelUtils.toPCollection(BeamSqlRelUtils.java:42)
        at org.apache.beam.sdk.extensions.sql.meta.provider.bigquery.BigQueryIOPushDownIT.readUsingDirectReadMethod(BigQueryIOPushDownIT.java:162)

org.apache.beam.sdk.extensions.sql.meta.provider.bigquery.BigQueryIOPushDownIT > readUsingDefaultMethod
STANDARD_ERROR
    Jan 14, 2021 6:58:03 AM org.apache.beam.sdk.extensions.sql.meta.provider.bigquery.BigQueryTable
<init>
    INFO: BigQuery method is set to: DEFAULT
    Jan 14, 2021 6:58:03 AM org.apache.beam.sdk.extensions.sql.meta.provider.bigquery.BigQueryTable
<init>
    INFO: BigQuery writeDisposition is set to: WRITE_EMPTY
    Jan 14, 2021 6:58:03 AM org.apache.beam.sdk.extensions.sql.impl.CalciteQueryPlanner convertToBeamRel
    INFO: SQL:
    SELECT `HACKER_NEWS`.`by` AS `author`, `HACKER_NEWS`.`type`, `HACKER_NEWS`.`title`, `HACKER_NEWS`.`score`
    FROM `beam`.`HACKER_NEWS` AS `HACKER_NEWS`
    WHERE (`HACKER_NEWS`.`type` = 'story' OR `HACKER_NEWS`.`type` = 'job') AND `HACKER_NEWS`.`score`
> 2
    Jan 14, 2021 6:58:03 AM org.apache.beam.sdk.extensions.sql.meta.provider.bigquery.BigQueryTable
<init>
    INFO: BigQuery method is set to: DEFAULT
    Jan 14, 2021 6:58:03 AM org.apache.beam.sdk.extensions.sql.meta.provider.bigquery.BigQueryTable
<init>
    INFO: BigQuery writeDisposition is set to: WRITE_EMPTY
    Jan 14, 2021 6:58:03 AM org.apache.beam.sdk.extensions.sql.impl.CalciteQueryPlanner convertToBeamRel
    INFO: SQLPlan>
    LogicalProject(author=[$4], type=[$8], title=[$0], score=[$5])
      LogicalFilter(condition=[AND(OR(=($8, 'story'), =($8, 'job')), >($5, 2))])
        BeamIOSourceRel(table=[[beam, HACKER_NEWS]])

    Jan 14, 2021 6:58:04 AM org.apache.beam.sdk.extensions.sql.impl.CalciteQueryPlanner convertToBeamRel
    INFO: BEAMPlan>
    BeamCalcRel(expr#0..13=[{inputs}], expr#14=['story':VARCHAR], expr#15=[=($t8, $t14)],
expr#16=['job':VARCHAR], expr#17=[=($t8, $t16)], expr#18=[OR($t15, $t17)], expr#19=[2], expr#20=[>($t5,
$t19)], expr#21=[AND($t18, $t20)], author=[$t4], type=[$t8], title=[$t0], score=[$t5], $condition=[$t21])
      BeamIOSourceRel(table=[[beam, HACKER_NEWS]])


org.apache.beam.sdk.extensions.sql.meta.provider.bigquery.BigQueryIOPushDownIT > readUsingDefaultMethod
FAILED
    java.lang.IllegalStateException: Unable to return a default Coder for BeamIOSourceRel_95/ParDo(RowMonitor)/ParMultiDo(RowMonitor).output
[PCollection@1659624560]. Correct one of the following root causes:
      No Coder has been manually specified;  you may do so using .setCoder().
      Inferring a Coder from the CoderRegistry failed: Cannot provide a coder for a Beam Row.
Please provide a schema instead using PCollection.setRowSchema.
      Using the default output Coder from the producing PTransform failed: PTransform.getOutputCoder
called.
        at org.apache.beam.vendor.guava.v26_0_jre.com.google.common.base.Preconditions.checkState(Preconditions.java:507)
        at org.apache.beam.sdk.values.PCollection.getCoder(PCollection.java:280)
        at org.apache.beam.sdk.values.PCollection.finishSpecifying(PCollection.java:117)
        at org.apache.beam.sdk.runners.TransformHierarchy.finishSpecifyingInput(TransformHierarchy.java:153)
        at org.apache.beam.sdk.Pipeline.applyInternal(Pipeline.java:546)
        at org.apache.beam.sdk.Pipeline.applyTransform(Pipeline.java:498)
        at org.apache.beam.sdk.extensions.sql.impl.rel.BeamSqlRelUtils.toPCollection(BeamSqlRelUtils.java:72)
        at org.apache.beam.sdk.extensions.sql.impl.rel.BeamSqlRelUtils.toPCollection(BeamSqlRelUtils.java:42)
        at org.apache.beam.sdk.extensions.sql.meta.provider.bigquery.BigQueryIOPushDownIT.readUsingDefaultMethod(BigQueryIOPushDownIT.java:176)

org.apache.beam.sdk.extensions.sql.meta.provider.bigquery.BigQueryIOPushDownIT > readUsingDirectReadMethodPushDown
STANDARD_ERROR
    Jan 14, 2021 6:58:04 AM org.apache.beam.sdk.extensions.sql.meta.provider.bigquery.BigQueryTable
<init>
    INFO: BigQuery method is set to: DIRECT_READ
    Jan 14, 2021 6:58:04 AM org.apache.beam.sdk.extensions.sql.meta.provider.bigquery.BigQueryTable
<init>
    INFO: BigQuery writeDisposition is set to: WRITE_EMPTY
    Jan 14, 2021 6:58:04 AM org.apache.beam.sdk.extensions.sql.impl.CalciteQueryPlanner convertToBeamRel
    INFO: SQL:
    SELECT `HACKER_NEWS`.`by` AS `author`, `HACKER_NEWS`.`type`, `HACKER_NEWS`.`title`, `HACKER_NEWS`.`score`
    FROM `beam`.`HACKER_NEWS` AS `HACKER_NEWS`
    WHERE (`HACKER_NEWS`.`type` = 'story' OR `HACKER_NEWS`.`type` = 'job') AND `HACKER_NEWS`.`score`
> 2
    Jan 14, 2021 6:58:04 AM org.apache.beam.sdk.extensions.sql.meta.provider.bigquery.BigQueryTable
<init>
    INFO: BigQuery method is set to: DIRECT_READ
    Jan 14, 2021 6:58:04 AM org.apache.beam.sdk.extensions.sql.meta.provider.bigquery.BigQueryTable
<init>
    INFO: BigQuery writeDisposition is set to: WRITE_EMPTY
    Jan 14, 2021 6:58:04 AM org.apache.beam.sdk.extensions.sql.impl.CalciteQueryPlanner convertToBeamRel
    INFO: SQLPlan>
    LogicalProject(author=[$4], type=[$8], title=[$0], score=[$5])
      LogicalFilter(condition=[AND(OR(=($8, 'story'), =($8, 'job')), >($5, 2))])
        BeamIOSourceRel(table=[[beam, HACKER_NEWS]])

    Jan 14, 2021 6:58:04 AM org.apache.beam.sdk.extensions.sql.impl.CalciteQueryPlanner convertToBeamRel
    INFO: BEAMPlan>
    BeamCalcRel(expr#0..3=[{inputs}], proj#0..3=[{exprs}])
      BeamPushDownIOSourceRel(table=[[beam, HACKER_NEWS]], usedFields=[[by, type, title, score]],
BigQueryFilter=[[supported{OR(=($8, 'story'), =($8, 'job'))>($5, 2)}, unsupported{}]])

    Jan 14, 2021 6:58:04 AM org.apache.beam.sdk.extensions.sql.meta.provider.bigquery.BigQueryTable
buildIOReader
    INFO: Pushing down the following filter: (`type` = 'story' OR `type` = 'job') AND `score`
> 2
    Jan 14, 2021 6:58:06 AM org.apache.beam.runners.dataflow.DataflowRunner run
    INFO: Executing pipeline on the Dataflow Service, which will have billing implications
related to Google Compute Engine usage and other Google Cloud Services.
    Jan 14, 2021 6:58:08 AM org.apache.beam.runners.dataflow.util.PackageUtil stageClasspathElements
    INFO: Uploading 229 files from PipelineOptions.filesToStage to staging location to prepare
for execution.
    Jan 14, 2021 6:58:08 AM org.apache.beam.runners.dataflow.util.PackageUtil$PackageAttributes
forFileToStage
    INFO: Staging custom dataflow-worker.jar as beam-runners-google-cloud-dataflow-java-legacy-worker-2.28.0-SNAPSHOT-bSv2aVFlWa9IKbDZkwwxiECwGYpmCf-j0hDigz4zXIQ.jar
    Jan 14, 2021 6:58:08 AM org.apache.beam.runners.dataflow.util.PackageUtil tryStagePackage
    INFO: Uploading /tmp/test5362107554621174124.zip to gs://temp-storage-for-perf-tests/loadtests/staging/test-6fMpikl5TMbeZmqYw6BkwTePpCeXLFo6o1NiLwPhUnk.jar
    Jan 14, 2021 6:58:08 AM org.apache.beam.runners.dataflow.util.PackageUtil stageClasspathElements
    INFO: Staging files complete: 228 files cached, 1 files newly uploaded in 0 seconds
    Jan 14, 2021 6:58:08 AM org.apache.beam.runners.dataflow.DataflowPipelineTranslator$Translator
addStep
    INFO: Adding BeamPushDownIOSourceRel_229/Read Input BQ Rows with push-down/Read(BigQueryStorageTableSource)
as step s1
    Jan 14, 2021 6:58:08 AM org.apache.beam.runners.dataflow.DataflowPipelineTranslator$Translator
addStep
    INFO: Adding BeamPushDownIOSourceRel_229/ParDo(RowMonitor) as step s2
    Jan 14, 2021 6:58:08 AM org.apache.beam.runners.dataflow.DataflowPipelineTranslator$Translator
addStep
    INFO: Adding BeamCalcRel_285/ParDo(Calc) as step s3
    Jan 14, 2021 6:58:08 AM org.apache.beam.runners.dataflow.DataflowPipelineTranslator$Translator
addStep
    INFO: Adding ParDo(TimeMonitor) as step s4
    Jan 14, 2021 6:58:08 AM org.apache.beam.runners.dataflow.DataflowRunner run
    INFO: Staging pipeline description to gs://temp-storage-for-perf-tests/loadtests/staging/
    Jan 14, 2021 6:58:08 AM org.apache.beam.runners.dataflow.util.PackageUtil tryStagePackage
    INFO: Uploading <100160 bytes, hash ec549a0106e9868a044a618f26d0d382bd338f0cfc5240fdf017c197f1daac21>
to gs://temp-storage-for-perf-tests/loadtests/staging/pipeline-7FSaAQbphooESmGPJtDTgr0zjwz8UkD98BfBl_HarCE.pb
    Jan 14, 2021 6:58:09 AM org.apache.beam.runners.dataflow.DataflowRunner run
    INFO: Dataflow SDK version: 2.28.0-SNAPSHOT
    Jan 14, 2021 6:58:10 AM org.apache.beam.runners.dataflow.DataflowRunner run
    INFO: To access the Dataflow monitoring console, please navigate to https://console.cloud.google.com/dataflow/jobs/us-central1/2021-01-13_22_58_09-1525635847374650899?project=apache-beam-testing
    Jan 14, 2021 6:58:10 AM org.apache.beam.runners.dataflow.DataflowRunner run
    INFO: Submitted job: 2021-01-13_22_58_09-1525635847374650899
    Jan 14, 2021 6:58:10 AM org.apache.beam.runners.dataflow.DataflowRunner run
    INFO: To cancel the job using the 'gcloud' tool, run:
    > gcloud dataflow jobs --project=apache-beam-testing cancel --region=us-central1 2021-01-13_22_58_09-1525635847374650899
    Jan 14, 2021 6:58:11 AM org.apache.beam.runners.dataflow.util.MonitoringUtil$LoggingHandler
process
    WARNING: 2021-01-14T06:58:09.286Z: The requested max number of workers (5) is ignored
as autoscaling is explicitly disabled (autoscalingAlgorithm=NONE).
    Jan 14, 2021 6:58:19 AM org.apache.beam.runners.dataflow.util.MonitoringUtil$LoggingHandler
process
    INFO: 2021-01-14T06:58:18.691Z: Worker configuration: n1-standard-1 in us-central1-f.
    Jan 14, 2021 6:58:21 AM org.apache.beam.runners.dataflow.util.MonitoringUtil$LoggingHandler
process
    INFO: 2021-01-14T06:58:19.478Z: Expanding CoGroupByKey operations into optimizable parts.
    Jan 14, 2021 6:58:21 AM org.apache.beam.runners.dataflow.util.MonitoringUtil$LoggingHandler
process
    INFO: 2021-01-14T06:58:19.521Z: Expanding GroupByKey operations into optimizable parts.
    Jan 14, 2021 6:58:21 AM org.apache.beam.runners.dataflow.util.MonitoringUtil$LoggingHandler
process
    INFO: 2021-01-14T06:58:19.631Z: Lifting ValueCombiningMappingFns into MergeBucketsMappingFns
    Jan 14, 2021 6:58:21 AM org.apache.beam.runners.dataflow.util.MonitoringUtil$LoggingHandler
process
    INFO: 2021-01-14T06:58:19.698Z: Fusing adjacent ParDo, Read, Write, and Flatten operations
    Jan 14, 2021 6:58:21 AM org.apache.beam.runners.dataflow.util.MonitoringUtil$LoggingHandler
process
    INFO: 2021-01-14T06:58:19.729Z: Fusing consumer BeamPushDownIOSourceRel_229/ParDo(RowMonitor)
into BeamPushDownIOSourceRel_229/Read Input BQ Rows with push-down/Read(BigQueryStorageTableSource)
    Jan 14, 2021 6:58:21 AM org.apache.beam.runners.dataflow.util.MonitoringUtil$LoggingHandler
process
    INFO: 2021-01-14T06:58:19.761Z: Fusing consumer BeamCalcRel_285/ParDo(Calc) into BeamPushDownIOSourceRel_229/ParDo(RowMonitor)
    Jan 14, 2021 6:58:21 AM org.apache.beam.runners.dataflow.util.MonitoringUtil$LoggingHandler
process
    INFO: 2021-01-14T06:58:19.790Z: Fusing consumer ParDo(TimeMonitor) into BeamCalcRel_285/ParDo(Calc)
    Jan 14, 2021 6:58:21 AM org.apache.beam.runners.dataflow.util.MonitoringUtil$LoggingHandler
process
    INFO: 2021-01-14T06:58:20.220Z: Executing operation BeamPushDownIOSourceRel_229/Read Input
BQ Rows with push-down/Read(BigQueryStorageTableSource)+BeamPushDownIOSourceRel_229/ParDo(RowMonitor)+BeamCalcRel_285/ParDo(Calc)+ParDo(TimeMonitor)
    Jan 14, 2021 6:58:21 AM org.apache.beam.runners.dataflow.util.MonitoringUtil$LoggingHandler
process
    INFO: 2021-01-14T06:58:20.302Z: Starting 5 workers in us-central1-f...
    Jan 14, 2021 6:58:31 AM org.apache.beam.runners.dataflow.util.MonitoringUtil$LoggingHandler
process
    INFO: 2021-01-14T06:58:28.778Z: Your project already contains 100 Dataflow-created metric
descriptors, so new user metrics of the form custom.googleapis.com/* will not be created.
However, all user metrics are also available in the metric dataflow.googleapis.com/job/user_counter.
If you rely on the custom metrics, you can delete old / unused metric descriptors. See https://developers.google.com/apis-explorer/#p/monitoring/v3/monitoring.projects.metricDescriptors.list
and https://developers.google.com/apis-explorer/#p/monitoring/v3/monitoring.projects.metricDescriptors.delete
    Jan 14, 2021 6:58:58 AM org.apache.beam.runners.dataflow.util.MonitoringUtil$LoggingHandler
process
    INFO: 2021-01-14T06:58:57.858Z: Autoscaling: Raised the number of workers to 5 based on
the rate of progress in the currently running stage(s).
    Jan 14, 2021 6:59:14 AM org.apache.beam.runners.dataflow.util.MonitoringUtil$LoggingHandler
process
    INFO: 2021-01-14T06:59:14.578Z: Workers have started successfully.
    Jan 14, 2021 6:59:14 AM org.apache.beam.runners.dataflow.util.MonitoringUtil$LoggingHandler
process
    INFO: 2021-01-14T06:59:14.607Z: Workers have started successfully.
    Jan 14, 2021 6:59:58 AM org.apache.beam.runners.dataflow.util.MonitoringUtil$LoggingHandler
process
    INFO: 2021-01-14T06:59:56.664Z: Finished operation BeamPushDownIOSourceRel_229/Read Input
BQ Rows with push-down/Read(BigQueryStorageTableSource)+BeamPushDownIOSourceRel_229/ParDo(RowMonitor)+BeamCalcRel_285/ParDo(Calc)+ParDo(TimeMonitor)
    Jan 14, 2021 6:59:58 AM org.apache.beam.runners.dataflow.util.MonitoringUtil$LoggingHandler
process
    INFO: 2021-01-14T06:59:56.831Z: Cleaning up.
    Jan 14, 2021 6:59:58 AM org.apache.beam.runners.dataflow.util.MonitoringUtil$LoggingHandler
process
    INFO: 2021-01-14T06:59:56.937Z: Stopping worker pool...
    Jan 14, 2021 7:00:48 AM org.apache.beam.runners.dataflow.util.MonitoringUtil$LoggingHandler
process
    INFO: 2021-01-14T07:00:47.870Z: Autoscaling: Resized worker pool from 5 to 0.
    Jan 14, 2021 7:00:48 AM org.apache.beam.runners.dataflow.util.MonitoringUtil$LoggingHandler
process
    INFO: 2021-01-14T07:00:47.912Z: Worker pool stopped.
    Jan 14, 2021 7:01:00 AM org.apache.beam.runners.dataflow.DataflowPipelineJob logTerminalState
    INFO: Job 2021-01-13_22_58_09-1525635847374650899 finished with status DONE.

org.apache.beam.sdk.extensions.sql.meta.provider.bigquery.BigQueryIOPushDownIT > readUsingDirectReadMethodPushDown
STANDARD_OUT
    Load test results for test (ID): 3f10289c-b7cd-4552-aa4b-56152f4b1696 and timestamp: 2021-01-14T07:01:00.517000000Z:
                     Metric:                    Value:
                   read_time                    20.687
                 fields_read                 4375276.0

org.apache.beam.sdk.extensions.sql.meta.provider.bigquery.BigQueryIOPushDownIT > readUsingDirectReadMethodPushDown
STANDARD_ERROR
    Jan 14, 2021 7:01:01 AM org.apache.beam.sdk.testutils.publishing.InfluxDBPublisher publishWithCheck
    WARNING: Missing property -- measurement/database. Metrics won't be published.

Gradle Test Executor 12 finished executing tests.

> Task :sdks:java:extensions:sql:perf-tests:integrationTest FAILED

3 tests completed, 2 failed
Finished generating test XML results (0.018 secs) into: <https://ci-beam.apache.org/job/beam_SQLBigQueryIO_Batch_Performance_Test_Java/ws/src/sdks/java/extensions/sql/perf-tests/build/test-results/integrationTest>
Generating HTML test report...
Finished generating test html results (0.028 secs) into: <https://ci-beam.apache.org/job/beam_SQLBigQueryIO_Batch_Performance_Test_Java/ws/src/sdks/java/extensions/sql/perf-tests/build/reports/tests/integrationTest>
Watching 2234 directories to track changes
Watching 2240 directories to track changes
Watching 2241 directories to track changes
:sdks:java:extensions:sql:perf-tests:integrationTest (Thread[Execution worker for ':' Thread
9,5,main]) completed. Took 3 mins 4.96 secs.

FAILURE: Build failed with an exception.

* What went wrong:
Execution failed for task ':sdks:java:extensions:sql:perf-tests:integrationTest'.
> There were failing tests. See the report at: file://<https://ci-beam.apache.org/job/beam_SQLBigQueryIO_Batch_Performance_Test_Java/ws/src/sdks/java/extensions/sql/perf-tests/build/reports/tests/integrationTest/index.html>

* Try:
Run with --stacktrace option to get the stack trace. Run with --debug option to get more log
output. Run with --scan to get full insights.

* Get more help at https://help.gradle.org

Deprecated Gradle features were used in this build, making it incompatible with Gradle 7.0.
Use '--warning-mode all' to show the individual deprecation warnings.
See https://docs.gradle.org/6.7.1/userguide/command_line_interface.html#sec:command_line_warnings

BUILD FAILED in 16m 44s
145 actionable tasks: 131 executed, 14 from cache
Watching 2241 directories to track changes

Publishing build scan...
https://gradle.com/s/ck5dvmzg7p6f4

Stopped 11 worker daemon(s).
Build step 'Invoke Gradle script' changed build result to FAILURE
Build step 'Invoke Gradle script' marked build as failure

---------------------------------------------------------------------
To unsubscribe, e-mail: builds-unsubscribe@beam.apache.org
For additional commands, e-mail: builds-help@beam.apache.org


Mime
View raw message