beam-builds mailing list archives

Site index · List index
Message view « Date » · « Thread »
Top « Date » · « Thread »
From Apache Jenkins Server <jenk...@builds.apache.org>
Subject Build failed in Jenkins: beam_PreCommit_Python_Cron #3761
Date Fri, 22 Jan 2021 00:38:31 GMT
See <https://ci-beam.apache.org/job/beam_PreCommit_Python_Cron/3761/display/redirect?page=changes>

Changes:

[Boyuan Zhang] [BEAM-11325] ReadFromKafkaDoFn should stop reading when topic/partition

[noreply] [BEAM-11092][Go SDK] Ack Harness monitoring requests (#13788)

[noreply] [BEAM-10961] Enabled strict dependencies on samza (#13667)

[noreply] [BEAM-11200] Update Go SDK version on release. (#13789)


------------------------------------------
[...truncated 1.57 MB...]
target/.tox-py38-cython/py38-cython/lib/python3.8/site-packages/avro/schema.py:1249
target/.tox-py38-cython/py38-cython/lib/python3.8/site-packages/avro/schema.py:1249
target/.tox-py38-cython/py38-cython/lib/python3.8/site-packages/avro/schema.py:1249
target/.tox-py38-cython/py38-cython/lib/python3.8/site-packages/avro/schema.py:1249
target/.tox-py38-cython/py38-cython/lib/python3.8/site-packages/avro/schema.py:1249
target/.tox-py38-cython/py38-cython/lib/python3.8/site-packages/avro/schema.py:1249
target/.tox-py38-cython/py38-cython/lib/python3.8/site-packages/avro/schema.py:1249
target/.tox-py38-cython/py38-cython/lib/python3.8/site-packages/avro/schema.py:1249
target/.tox-py38-cython/py38-cython/lib/python3.8/site-packages/avro/schema.py:1249
target/.tox-py38-cython/py38-cython/lib/python3.8/site-packages/avro/schema.py:1249
target/.tox-py38-cython/py38-cython/lib/python3.8/site-packages/avro/schema.py:1249
target/.tox-py38-cython/py38-cython/lib/python3.8/site-packages/avro/schema.py:1249
target/.tox-py38-cython/py38-cython/lib/python3.8/site-packages/avro/schema.py:1249
target/.tox-py38-cython/py38-cython/lib/python3.8/site-packages/avro/schema.py:1249
target/.tox-py38-cython/py38-cython/lib/python3.8/site-packages/avro/schema.py:1249
  <https://ci-beam.apache.org/job/beam_PreCommit_Python_Cron/ws/src/sdks/python/test-suites/tox/py38/build/srcs/sdks/python/target/.tox-py38-cython/py38-cython/lib/python3.8/site-packages/avro/schema.py>:1249:
DeprecationWarning: `Parse` is deprecated in avro 1.9.2. Please use `parse` (lowercase) instead.
    warnings.warn("`Parse` is deprecated in avro 1.9.2. "

apache_beam/io/fileio_test.py:585
  <https://ci-beam.apache.org/job/beam_PreCommit_Python_Cron/ws/src/sdks/python/test-suites/tox/py38/build/srcs/sdks/python/apache_beam/io/fileio_test.py>:585:
FutureWarning: WriteToFiles is experimental.
    | beam.io.fileio.WriteToFiles(

apache_beam/io/parquetio_test.py:418
  <https://ci-beam.apache.org/job/beam_PreCommit_Python_Cron/ws/src/sdks/python/test-suites/tox/py38/build/srcs/sdks/python/apache_beam/io/parquetio_test.py>:418:
FutureWarning: The parameter chunksize is deprecated for pyarrow.Table.to_batches as of 0.15,
please use the parameter max_chunksize instead
    for batch in orig.to_batches(chunksize=20)

apache_beam/io/fileio_test.py:453
  <https://ci-beam.apache.org/job/beam_PreCommit_Python_Cron/ws/src/sdks/python/test-suites/tox/py38/build/srcs/sdks/python/apache_beam/io/fileio_test.py>:453:
FutureWarning: WriteToFiles is experimental.
    write_transform = beam.io.fileio.WriteToFiles(path=dir)

apache_beam/io/mongodbio_test.py:571
  <https://ci-beam.apache.org/job/beam_PreCommit_Python_Cron/ws/src/sdks/python/test-suites/tox/py38/build/srcs/sdks/python/apache_beam/io/mongodbio_test.py>:571:
FutureWarning: WriteToMongoDB is experimental.
    | "Write" >> WriteToMongoDB(db='test', coll='test'))

apache_beam/io/fileio_test.py:640
  <https://ci-beam.apache.org/job/beam_PreCommit_Python_Cron/ws/src/sdks/python/test-suites/tox/py38/build/srcs/sdks/python/apache_beam/io/fileio_test.py>:640:
FutureWarning: WriteToFiles is experimental.
    | beam.io.fileio.WriteToFiles(

apache_beam/io/fileio_test.py:390
  <https://ci-beam.apache.org/job/beam_PreCommit_Python_Cron/ws/src/sdks/python/test-suites/tox/py38/build/srcs/sdks/python/apache_beam/io/fileio_test.py>:390:
FutureWarning: WriteToFiles is experimental.
    | beam.io.fileio.WriteToFiles(path=dir))

apache_beam/io/mongodbio_test.py:476
apache_beam/io/mongodbio_test.py:476
  <https://ci-beam.apache.org/job/beam_PreCommit_Python_Cron/ws/src/sdks/python/test-suites/tox/py38/build/srcs/sdks/python/apache_beam/io/mongodbio_test.py>:476:
FutureWarning: ReadFromMongoDB is experimental.
    docs = p | 'ReadFromMongoDB' >> ReadFromMongoDB(

apache_beam/io/mongodbio_test.py:555
  <https://ci-beam.apache.org/job/beam_PreCommit_Python_Cron/ws/src/sdks/python/test-suites/tox/py38/build/srcs/sdks/python/apache_beam/io/mongodbio_test.py>:555:
FutureWarning: WriteToMongoDB is experimental.
    | "Write" >> WriteToMongoDB(db='test', coll='test'))

apache_beam/io/fileio_test.py:495
  <https://ci-beam.apache.org/job/beam_PreCommit_Python_Cron/ws/src/sdks/python/test-suites/tox/py38/build/srcs/sdks/python/apache_beam/io/fileio_test.py>:495:
FutureWarning: WriteToFiles is experimental.
    | beam.io.fileio.WriteToFiles(

apache_beam/io/parquetio_test.py:369
  <https://ci-beam.apache.org/job/beam_PreCommit_Python_Cron/ws/src/sdks/python/test-suites/tox/py38/build/srcs/sdks/python/apache_beam/io/parquetio_test.py>:369:
FutureWarning: The parameter chunksize is deprecated for pyarrow.Table.to_batches as of 0.15,
please use the parameter max_chunksize instead
    pa.Table.from_batches([batch]) for batch in self._records_as_arrow(

apache_beam/io/fileio_test.py:410
  <https://ci-beam.apache.org/job/beam_PreCommit_Python_Cron/ws/src/sdks/python/test-suites/tox/py38/build/srcs/sdks/python/apache_beam/io/fileio_test.py>:410:
FutureWarning: WriteToFiles is experimental.
    | beam.io.fileio.WriteToFiles(

/usr/lib/python3.8/unittest/case.py:1215
/usr/lib/python3.8/unittest/case.py:1215
/usr/lib/python3.8/unittest/case.py:1215
/usr/lib/python3.8/unittest/case.py:1215
/usr/lib/python3.8/unittest/case.py:1215
/usr/lib/python3.8/unittest/case.py:1215
/usr/lib/python3.8/unittest/case.py:1215
/usr/lib/python3.8/unittest/case.py:1215
/usr/lib/python3.8/unittest/case.py:1215
/usr/lib/python3.8/unittest/case.py:1215
/usr/lib/python3.8/unittest/case.py:1215
/usr/lib/python3.8/unittest/case.py:1215
/usr/lib/python3.8/unittest/case.py:1215
/usr/lib/python3.8/unittest/case.py:1215
/usr/lib/python3.8/unittest/case.py:1215
/usr/lib/python3.8/unittest/case.py:1215
/usr/lib/python3.8/unittest/case.py:1215
/usr/lib/python3.8/unittest/case.py:1215
/usr/lib/python3.8/unittest/case.py:1215
/usr/lib/python3.8/unittest/case.py:1215
/usr/lib/python3.8/unittest/case.py:1215
/usr/lib/python3.8/unittest/case.py:1215
/usr/lib/python3.8/unittest/case.py:1215
/usr/lib/python3.8/unittest/case.py:1215
/usr/lib/python3.8/unittest/case.py:1215
  /usr/lib/python3.8/unittest/case.py:1215: DeprecationWarning: assertDictContainsSubset is
deprecated
    warnings.warn('assertDictContainsSubset is deprecated',

apache_beam/io/parquetio_test.py:379
  <https://ci-beam.apache.org/job/beam_PreCommit_Python_Cron/ws/src/sdks/python/test-suites/tox/py38/build/srcs/sdks/python/apache_beam/io/parquetio_test.py>:379:
FutureWarning: The parameter chunksize is deprecated for pyarrow.Table.to_batches as of 0.15,
please use the parameter max_chunksize instead
    pa.Table.from_batches([batch]) for batch in self._records_as_arrow(

apache_beam/runners/interactive/recording_manager.py:394
apache_beam/runners/interactive/recording_manager.py:394
apache_beam/runners/interactive/recording_manager.py:394
apache_beam/runners/interactive/recording_manager.py:394
apache_beam/runners/interactive/recording_manager.py:394
apache_beam/runners/interactive/recording_manager.py:394
apache_beam/runners/interactive/recording_manager.py:394
apache_beam/runners/interactive/recording_manager.py:394
apache_beam/runners/interactive/recording_manager.py:394
apache_beam/runners/interactive/recording_manager.py:394
apache_beam/runners/interactive/recording_manager.py:394
apache_beam/runners/interactive/recording_manager.py:394
apache_beam/runners/interactive/recording_manager.py:394
apache_beam/runners/interactive/recording_manager.py:394
  <https://ci-beam.apache.org/job/beam_PreCommit_Python_Cron/ws/src/sdks/python/test-suites/tox/py38/build/srcs/sdks/python/apache_beam/runners/interactive/recording_manager.py>:394:
BeamDeprecationWarning: options is deprecated since First stable release. References to <pipeline>.options
will not be supported
    options=self.user_pipeline.options,

target/.tox-py38-cython/py38-cython/lib/python3.8/site-packages/hamcrest/library/collection/issequence_containinginorder.py:95
  <https://ci-beam.apache.org/job/beam_PreCommit_Python_Cron/ws/src/sdks/python/test-suites/tox/py38/build/srcs/sdks/python/target/.tox-py38-cython/py38-cython/lib/python3.8/site-packages/hamcrest/library/collection/issequence_containinginorder.py>:95:
DeprecationWarning: deprecated - use contains_exactly(*items)
    warnings.warn("deprecated - use contains_exactly(*items)", DeprecationWarning)

apache_beam/transforms/util_test.py:718
  <https://ci-beam.apache.org/job/beam_PreCommit_Python_Cron/ws/src/sdks/python/test-suites/tox/py38/build/srcs/sdks/python/apache_beam/transforms/util_test.py>:718:
FutureWarning: GroupIntoBatches is experimental.
    | util.GroupIntoBatches(

apache_beam/transforms/util_test.py:772
  <https://ci-beam.apache.org/job/beam_PreCommit_Python_Cron/ws/src/sdks/python/test-suites/tox/py38/build/srcs/sdks/python/apache_beam/transforms/util_test.py>:772:
FutureWarning: GroupIntoBatches is experimental.
    | util.GroupIntoBatches(

apache_beam/transforms/util_test.py:668
  <https://ci-beam.apache.org/job/beam_PreCommit_Python_Cron/ws/src/sdks/python/test-suites/tox/py38/build/srcs/sdks/python/apache_beam/transforms/util_test.py>:668:
FutureWarning: GroupIntoBatches is experimental.
    | util.GroupIntoBatches(GroupIntoBatchesTest.BATCH_SIZE)

apache_beam/transforms/util.py:838
apache_beam/transforms/util.py:838
  <https://ci-beam.apache.org/job/beam_PreCommit_Python_Cron/ws/src/sdks/python/test-suites/tox/py38/build/srcs/sdks/python/apache_beam/transforms/util.py>:838:
FutureWarning: GroupIntoBatches is experimental.
    | GroupIntoBatches(

apache_beam/transforms/util_test.py:827
  <https://ci-beam.apache.org/job/beam_PreCommit_Python_Cron/ws/src/sdks/python/test-suites/tox/py38/build/srcs/sdks/python/apache_beam/transforms/util_test.py>:827:
FutureWarning: GroupIntoBatches is experimental.
    util.GroupIntoBatches(batch_size, duration),

apache_beam/transforms/util_test.py:830
  <https://ci-beam.apache.org/job/beam_PreCommit_Python_Cron/ws/src/sdks/python/test-suites/tox/py38/build/srcs/sdks/python/apache_beam/transforms/util_test.py>:830:
FutureWarning: GroupIntoBatches is experimental.
    util.GroupIntoBatches(batch_size),

-- Docs: https://docs.pytest.org/en/latest/warnings.html
- generated xml file: <https://ci-beam.apache.org/job/beam_PreCommit_Python_Cron/ws/src/sdks/python/test-suites/tox/py38/build/srcs/sdks/python/pytest_py38-cython.xml>
-
=========== 3156 passed, 937 skipped, 698 warnings in 365.48 seconds ===========
============================= test session starts ==============================
platform linux -- Python 3.8.5, pytest-4.6.11, py-1.10.0, pluggy-0.13.1
cachedir: target/.tox-py38-cython/py38-cython/.pytest_cache
rootdir: <https://ci-beam.apache.org/job/beam_PreCommit_Python_Cron/ws/src/sdks/python/test-suites/tox/py38/build/srcs/sdks/python,>
inifile: pytest.ini
plugins: requests-mock-1.8.0, xdist-1.34.0, timeout-1.4.2, forked-1.3.0
timeout: 600.0s
timeout method: signal
timeout func_only: False
collected 4156 items / 4092 deselected / 3 skipped / 61 selected

apache_beam/coders/fast_coders_test.py ...............................   [ 48%]
apache_beam/coders/slow_coders_test.py ...............................   [ 96%]
apache_beam/io/gcp/tests/bigquery_matcher_test.py s                      [ 98%]
apache_beam/runners/portability/stager_test.py .                         [100%]

=============================== warnings summary ===============================
apache_beam/io/vcfio.py:49
  <https://ci-beam.apache.org/job/beam_PreCommit_Python_Cron/ws/src/sdks/python/test-suites/tox/py38/build/srcs/sdks/python/apache_beam/io/vcfio.py>:49:
UserWarning: VCF IO will support Python 3 after migration to Nucleus, see: BEAM-5628.
    warnings.warn(

target/.tox-py38-cython/py38-cython/lib/python3.8/site-packages/tenacity/_asyncio.py:42
  <https://ci-beam.apache.org/job/beam_PreCommit_Python_Cron/ws/src/sdks/python/test-suites/tox/py38/build/srcs/sdks/python/target/.tox-py38-cython/py38-cython/lib/python3.8/site-packages/tenacity/_asyncio.py>:42:
DeprecationWarning: "@coroutine" decorator is deprecated since Python 3.8, use "async def"
instead
    def call(self, fn, *args, **kwargs):

-- Docs: https://docs.pytest.org/en/latest/warnings.html
- generated xml file: <https://ci-beam.apache.org/job/beam_PreCommit_Python_Cron/ws/src/sdks/python/test-suites/tox/py38/build/srcs/sdks/python/pytest_py38-cython_no_xdist.xml>
-
====== 63 passed, 4 skipped, 4092 deselected, 2 warnings in 10.15 seconds ======
py38-cython run-test-post: commands[0] | bash <https://ci-beam.apache.org/job/beam_PreCommit_Python_Cron/ws/src/sdks/python/test-suites/tox/py38/build/srcs/sdks/python/scripts/run_tox_cleanup.sh>
___________________________________ summary ____________________________________
  py38-cython: commands succeeded
  congratulations :)

> Task :sdks:python:test-suites:tox:py38:testPy38pyarrow-0
GLOB sdist-make: <https://ci-beam.apache.org/job/beam_PreCommit_Python_Cron/ws/src/sdks/python/test-suites/tox/py38/build/srcs/sdks/python/setup.py>
py38-pyarrow-0 create: <https://ci-beam.apache.org/job/beam_PreCommit_Python_Cron/ws/src/sdks/python/test-suites/tox/py38/build/srcs/sdks/python/target/.tox-py38-pyarrow-0/py38-pyarrow-0>
py38-pyarrow-0 installdeps: pyarrow>=0.15.1,<0.18.0

> Task :sdks:python:test-suites:dataflow:py37:preCommitIT_streaming_V2
WARNING:apache_beam.runners.dataflow.dataflow_runner:Timing out on waiting for job 2021-01-21_16_31_55-6000156630259604534
after 360 seconds
DEBUG:google.auth._default:Checking None for explicit credentials as part of auth process...
DEBUG:google.auth._default:Checking Cloud SDK credentials as part of auth process...
DEBUG:google.auth._default:Cloud SDK credentials not found on disk; not using them
DEBUG:google.auth._default:Checking for App Engine runtime as part of auth process...
DEBUG:google.auth._default:No App Engine library was found so cannot authentication via App
Engine Identity Credentials.
DEBUG:google.auth.transport._http_client:Making request: GET http://169.254.169.254
DEBUG:google.auth.transport._http_client:Making request: GET http://metadata.google.internal/computeMetadata/v1/project/project-id
DEBUG:google.auth.transport.requests:Making request: GET http://metadata.google.internal/computeMetadata/v1/instance/service-accounts/default/?recursive=true
DEBUG:urllib3.connectionpool:Starting new HTTP connection (1): metadata.google.internal:80
DEBUG:urllib3.connectionpool:http://metadata.google.internal:80 "GET /computeMetadata/v1/instance/service-accounts/default/?recursive=true
HTTP/1.1" 200 144
DEBUG:google.auth.transport.requests:Making request: GET http://metadata.google.internal/computeMetadata/v1/instance/service-accounts/844138762903-compute@developer.gserviceaccount.com/token?scopes=https%3A%2F%2Fwww.googleapis.com%2Fauth%2Fcloud-platform%2Chttps%3A%2F%2Fwww.googleapis.com%2Fauth%2Fpubsub
DEBUG:urllib3.connectionpool:http://metadata.google.internal:80 "GET /computeMetadata/v1/instance/service-accounts/844138762903-compute@developer.gserviceaccount.com/token?scopes=https%3A%2F%2Fwww.googleapis.com%2Fauth%2Fcloud-platform%2Chttps%3A%2F%2Fwww.googleapis.com%2Fauth%2Fpubsub
HTTP/1.1" 200 241

> Task :sdks:python:test-suites:tox:py38:testPy38pyarrow-0
py38-pyarrow-0 inst: <https://ci-beam.apache.org/job/beam_PreCommit_Python_Cron/ws/src/sdks/python/test-suites/tox/py38/build/srcs/sdks/python/target/.tox-py38-pyarrow-0/.tmp/package/1/apache-beam-2.28.0.dev0.zip>

> Task :sdks:python:test-suites:dataflow:py36:preCommitIT_streaming_V2 FAILED
<https://ci-beam.apache.org/job/beam_PreCommit_Python_Cron/ws/src/sdks/python/scripts/run_integration_test.sh>:
line 278: 23780 Terminated              python setup.py nosetests --test-pipeline-options="$PIPELINE_OPTS"
--with-xunitmp --xunitmp-file=$XUNIT_FILE --ignore-files '.*py3\d?\.py$' $TEST_OPTS

> Task :sdks:python:test-suites:dataflow:py37:preCommitIT_streaming_V2 FAILED
<https://ci-beam.apache.org/job/beam_PreCommit_Python_Cron/ws/src/sdks/python/scripts/run_integration_test.sh>:
line 278:  7126 Terminated              python setup.py nosetests --test-pipeline-options="$PIPELINE_OPTS"
--with-xunitmp --xunitmp-file=$XUNIT_FILE --ignore-files '.*py3\d?\.py$' $TEST_OPTS

> Task :sdks:python:test-suites:tox:py38:testPy38pyarrow-0 FAILED
scripts/run_tox.sh: line 62: 20978 Terminated              tox -c tox.ini --recreate -e "$TOX_ENVIRONMENT"
The message received from the daemon indicates that the daemon has disappeared.
Build request sent: Build{id=df471702-c8b7-4c2a-acbb-57e85c0c25dd, currentDir=<https://ci-beam.apache.org/job/beam_PreCommit_Python_Cron/ws/src}>
Attempting to read last messages from the daemon log...
Daemon pid: 15415
  log file: /home/jenkins/.gradle/daemon/6.8/daemon-15415.out.log
----- Last  20 lines from daemon log file - daemon-15415.out.log -----
py38-pyarrow-0 create: <https://ci-beam.apache.org/job/beam_PreCommit_Python_Cron/ws/src/sdks/python/test-suites/tox/py38/build/srcs/sdks/python/target/.tox-py38-pyarrow-0/py38-pyarrow-0>
py38-pyarrow-0 installdeps: pyarrow>=0.15.1,<0.18.0
WARNING:apache_beam.runners.dataflow.dataflow_runner:Timing out on waiting for job 2021-01-21_16_31_55-6000156630259604534
after 360 seconds
DEBUG:google.auth._default:Checking None for explicit credentials as part of auth process...
DEBUG:google.auth._default:Checking Cloud SDK credentials as part of auth process...
DEBUG:google.auth._default:Cloud SDK credentials not found on disk; not using them
DEBUG:google.auth._default:Checking for App Engine runtime as part of auth process...
DEBUG:google.auth._default:No App Engine library was found so cannot authentication via App
Engine Identity Credentials.
DEBUG:google.auth.transport._http_client:Making request: GET http://169.254.169.254
DEBUG:google.auth.transport._http_client:Making request: GET http://metadata.google.internal/computeMetadata/v1/project/project-id
DEBUG:google.auth.transport.requests:Making request: GET http://metadata.google.internal/computeMetadata/v1/instance/service-accounts/default/?recursive=true
DEBUG:urllib3.connectionpool:Starting new HTTP connection (1): metadata.google.internal:80
DEBUG:urllib3.connectionpool:http://metadata.google.internal:80 "GET /computeMetadata/v1/instance/service-accounts/default/?recursive=true
HTTP/1.1" 200 144
DEBUG:google.auth.transport.requests:Making request: GET http://metadata.google.internal/computeMetadata/v1/instance/service-accounts/844138762903-compute@developer.gserviceaccount.com/token?scopes=https%3A%2F%2Fwww.googleapis.com%2Fauth%2Fcloud-platform%2Chttps%3A%2F%2Fwww.googleapis.com%2Fauth%2Fpubsub
DEBUG:urllib3.connectionpool:http://metadata.google.internal:80 "GET /computeMetadata/v1/instance/service-accounts/844138762903-compute@developer.gserviceaccount.com/token?scopes=https%3A%2F%2Fwww.googleapis.com%2Fauth%2Fcloud-platform%2Chttps%3A%2F%2Fwww.googleapis.com%2Fauth%2Fpubsub
HTTP/1.1" 200 241
py38-pyarrow-0 inst: <https://ci-beam.apache.org/job/beam_PreCommit_Python_Cron/ws/src/sdks/python/test-suites/tox/py38/build/srcs/sdks/python/target/.tox-py38-pyarrow-0/.tmp/package/1/apache-beam-2.28.0.dev0.zip>
<https://ci-beam.apache.org/job/beam_PreCommit_Python_Cron/ws/src/sdks/python/scripts/run_integration_test.sh>:
line 278: 23780 Terminated              python setup.py nosetests --test-pipeline-options="$PIPELINE_OPTS"
--with-xunitmp --xunitmp-file=$XUNIT_FILE --ignore-files '.*py3\d?\.py$' $TEST_OPTS
<https://ci-beam.apache.org/job/beam_PreCommit_Python_Cron/ws/src/sdks/python/scripts/run_integration_test.sh>:
line 278:  7126 Terminated              python setup.py nosetests --test-pipeline-options="$PIPELINE_OPTS"
--with-xunitmp --xunitmp-file=$XUNIT_FILE --ignore-files '.*py3\d?\.py$' $TEST_OPTS
scripts/run_tox.sh: line 62: 20978 Terminated              tox -c tox.ini --recreate -e "$TOX_ENVIRONMENT"
Daemon vm is shutting down... The daemon has exited normally or was terminated in response
to a user interrupt.
----- End of the daemon log -----


FAILURE: Build failed with an exception.

* What went wrong:
Gradle build daemon disappeared unexpectedly (it may have been killed or may have crashed)

* Try:
Run with --stacktrace option to get the stack trace. Run with --info or --debug option to
get more log output. Run with --scan to get full insights.

* Get more help at https://help.gradle.org

> Task :sdks:python:test-suites:tox:py38:testPy38pyarrow-1
Build step 'Invoke Gradle script' changed build result to FAILURE
Build step 'Invoke Gradle script' marked build as failure

---------------------------------------------------------------------
To unsubscribe, e-mail: builds-unsubscribe@beam.apache.org
For additional commands, e-mail: builds-help@beam.apache.org


Mime
View raw message