beam-builds mailing list archives

Site index · List index
Message view « Date » · « Thread »
Top « Date » · « Thread »
From Apache Jenkins Server <jenk...@builds.apache.org>
Subject Build failed in Jenkins: beam_PostCommit_Java_Examples_Dataflow_V2_java11 #153
Date Fri, 01 Jan 2021 07:34:31 GMT
See <https://ci-beam.apache.org/job/beam_PostCommit_Java_Examples_Dataflow_V2_java11/153/display/redirect>

Changes:


------------------------------------------
[...truncated 39.34 KB...]
> Task :sdks:java:extensions:google-cloud-platform-core:jar
> Task :sdks:java:fn-execution:jar
> Task :runners:local-java:compileJava FROM-CACHE
> Task :runners:local-java:classes UP-TO-DATE
> Task :runners:core-construction-java:compileJava FROM-CACHE
> Task :runners:core-construction-java:classes UP-TO-DATE

> Task :sdks:java:container:pullLicenses
Copying licenses from <https://ci-beam.apache.org/job/beam_PostCommit_Java_Examples_Dataflow_V2_java11/ws/src/sdks/java/container/build/target/java_third_party_licenses>
to <https://ci-beam.apache.org/job/beam_PostCommit_Java_Examples_Dataflow_V2_java11/ws/src/sdks/java/container/build/target/third_party_licenses.>
Finished license_scripts.sh

> Task :runners:local-java:jar
> Task :runners:core-construction-java:jar
> Task :sdks:java:container:java11:copyPulledLicenses
> Task :sdks:java:extensions:protobuf:extractIncludeProto
> Task :sdks:java:extensions:protobuf:generateProto NO-SOURCE

> Task :sdks:go:resolveBuildDependencies
Resolving golang.org/x/net: commit='2fb46b16b8dda405028c50f7c7f0f9dd1fa6bfb1', urls=[https://go.googlesource.com/net]
Resolving golang.org/x/oauth2: commit='5d25da1a8d43b66f2898c444f899c7bcfd6a407e', urls=[https://go.googlesource.com/oauth2]
Resolving golang.org/x/sync: commit='fd80eb99c8f653c847d294a001bdf2a3a6f768f5', urls=[https://go.googlesource.com/sync]

> Task :sdks:java:extensions:protobuf:compileJava FROM-CACHE
> Task :sdks:java:extensions:protobuf:classes UP-TO-DATE
> Task :runners:core-java:compileJava FROM-CACHE
> Task :runners:core-java:classes UP-TO-DATE
> Task :sdks:java:extensions:protobuf:jar
> Task :runners:core-java:jar
> Task :sdks:java:harness:compileJava FROM-CACHE
> Task :sdks:java:harness:classes UP-TO-DATE
> Task :sdks:java:harness:jar

> Task :sdks:go:resolveBuildDependencies
Resolving golang.org/x/sys: commit='fde4db37ae7ad8191b03d30d27f258b5291ae4e3', urls=[https://go.googlesource.com/sys]

> Task :sdks:java:harness:shadowJar FROM-CACHE
> Task :runners:java-fn-execution:compileJava FROM-CACHE
> Task :runners:java-fn-execution:classes UP-TO-DATE
> Task :runners:java-fn-execution:jar
> Task :sdks:java:expansion-service:compileJava FROM-CACHE
> Task :sdks:java:expansion-service:classes UP-TO-DATE
> Task :sdks:java:expansion-service:jar
> Task :sdks:java:io:kafka:compileJava FROM-CACHE
> Task :sdks:java:io:kafka:classes UP-TO-DATE
> Task :runners:direct-java:compileJava FROM-CACHE
> Task :runners:direct-java:classes UP-TO-DATE
> Task :sdks:java:extensions:ml:compileJava FROM-CACHE
> Task :sdks:java:extensions:ml:classes UP-TO-DATE
> Task :sdks:java:io:kafka:jar
> Task :sdks:java:extensions:ml:jar
> Task :runners:direct-java:shadowJar FROM-CACHE
> Task :sdks:java:io:google-cloud-platform:compileJava FROM-CACHE
> Task :sdks:java:io:google-cloud-platform:classes UP-TO-DATE
> Task :sdks:java:io:google-cloud-platform:jar
> Task :examples:java:compileJava FROM-CACHE
> Task :examples:java:classes UP-TO-DATE
> Task :runners:google-cloud-dataflow-java:compileJava FROM-CACHE
> Task :runners:google-cloud-dataflow-java:classes
> Task :sdks:java:container:java11:copyDockerfileDependencies
> Task :examples:java:jar
> Task :runners:google-cloud-dataflow-java:jar
> Task :examples:java:compileTestJava FROM-CACHE
> Task :examples:java:testClasses
> Task :examples:java:testJar

> Task :release:go-licenses:java:dockerRun
+ go-licenses save github.com/apache/beam/sdks/java/container --save_path=/output/licenses
+ go-licenses csv github.com/apache/beam/sdks/java/container
+ tee /output/licenses/list.csv

> Task :sdks:go:resolveBuildDependencies
Resolving golang.org/x/text: commit='23ae387dee1f90d29a23c0e87ee0b46038fbed0e', urls=[https://go.googlesource.com/text]
Resolving cached github.com/etcd-io/etcd: commit='11214aa33bf5a47d3d9d8dafe0f6b97237dfe921',
urls=[https://github.com/etcd-io/etcd.git, git@github.com:etcd-io/etcd.git]

> Task :release:go-licenses:java:dockerRun
github.com/apache/beam/sdks/java/container,https://github.com/apache/beam/blob/master/LICENSE,Apache-2.0
github.com/apache/beam/sdks/go/pkg/beam,https://github.com/apache/beam/blob/master/sdks/go/README.md,Apache-2.0
google.golang.org/grpc,https://github.com/grpc/grpc-go/blob/master/LICENSE,Apache-2.0
golang.org/x/net,https://go.googlesource.com/net/+/refs/heads/master/LICENSE,BSD-3-Clause
golang.org/x/sys,https://go.googlesource.com/sys/+/refs/heads/master/LICENSE,BSD-3-Clause
golang.org/x/text,https://go.googlesource.com/text/+/refs/heads/master/LICENSE,BSD-3-Clause
github.com/golang/protobuf,https://github.com/golang/protobuf/blob/master/LICENSE,BSD-3-Clause
google.golang.org/protobuf,https://go.googlesource.com/protobuf/+/refs/heads/master/LICENSE,BSD-3-Clause
google.golang.org/genproto/googleapis/rpc/status,https://github.com/googleapis/go-genproto/blob/master/LICENSE,Apache-2.0
+ chmod -R a+w /output/licenses

> Task :release:go-licenses:java:createLicenses
> Task :sdks:java:container:java11:copyGolangLicenses

> Task :sdks:go:resolveBuildDependencies
Resolving google.golang.org/api: commit='0324d5e90dc7753607860272666845fad9ceb97e', urls=[https://code.googlesource.com/google-api-go-client]
Resolving google.golang.org/genproto: commit='4d944d34d83c502a5f761500a14d8842648415c3', urls=[https://github.com/google/go-genproto]
Resolving google.golang.org/grpc: commit='5e8f83304c0563d1ba74db05fee83d9c18ab9a58', urls=[https://github.com/grpc/grpc-go]
Resolving google.golang.org/protobuf: commit='d165be301fb1e13390ad453281ded24385fd8ebc', urls=[https://go.googlesource.com/protobuf]
Resolving cached github.com/etcd-io/etcd: commit='11214aa33bf5a47d3d9d8dafe0f6b97237dfe921',
urls=[https://github.com/etcd-io/etcd.git, git@github.com:etcd-io/etcd.git]
Resolving cached github.com/etcd-io/etcd: commit='11214aa33bf5a47d3d9d8dafe0f6b97237dfe921',
urls=[https://github.com/etcd-io/etcd.git, git@github.com:etcd-io/etcd.git]

> Task :sdks:go:installDependencies
> Task :sdks:go:buildLinuxAmd64
> Task :sdks:go:goBuild

> Task :sdks:java:container:resolveBuildDependencies
Resolving ./github.com/apache/beam/sdks/go@<https://ci-beam.apache.org/job/beam_PostCommit_Java_Examples_Dataflow_V2_java11/ws/src/sdks/go>

> Task :sdks:java:container:installDependencies

> Task :sdks:java:container:buildLinuxAmd64
Unable to watch the file system for changes. The inotify watches limit is too low.

> Task :sdks:java:container:goBuild
> Task :sdks:java:container:java11:copySdkHarnessLauncher
> Task :sdks:java:container:java11:dockerPrepare
> Task :sdks:java:container:java11:docker

> Task :runners:google-cloud-dataflow-java:buildAndPushDockerContainer
WARNING: `gcloud docker` will not be supported for Docker client versions above 18.03.

As an alternative, use `gcloud auth configure-docker` to configure `docker` to
use `gcloud` as a credential helper, then use `docker` as you would for non-GCR
registries, e.g. `docker pull gcr.io/project-id/my-image`. Add
`--verbosity=error` to silence this warning: `gcloud docker
--verbosity=error -- pull gcr.io/project-id/my-image`.

See: https://cloud.google.com/container-registry/docs/support/deprecation-notices#gcloud-docker

The push refers to repository [us.gcr.io/apache-beam-testing/java-postcommit-it/java]
71f08843a167: Preparing
9cbf4dd265d1: Preparing
440b68c3ac89: Preparing
42847e5a29b1: Preparing
ab5e541fecce: Preparing
4ecdd94d65a4: Preparing
314a34ef544a: Preparing
97043bf83618: Preparing
4e9059dabac2: Preparing
f402ac273fbc: Preparing
e077c5d57679: Preparing
998e4e1e3864: Preparing
fb6f398853f5: Preparing
e528f2c31deb: Preparing
c5f4367d4a59: Preparing
ceecb62b2fcc: Preparing
193bc1d68b80: Preparing
f0e10b20de19: Preparing
4ecdd94d65a4: Waiting
314a34ef544a: Waiting
97043bf83618: Waiting
4e9059dabac2: Waiting
ceecb62b2fcc: Waiting
c5f4367d4a59: Waiting
193bc1d68b80: Waiting
f402ac273fbc: Waiting
f0e10b20de19: Waiting
e077c5d57679: Waiting
998e4e1e3864: Waiting
e528f2c31deb: Waiting
fb6f398853f5: Waiting
42847e5a29b1: Pushed
9cbf4dd265d1: Pushed
ab5e541fecce: Pushed
71f08843a167: Pushed
440b68c3ac89: Pushed
97043bf83618: Pushed
314a34ef544a: Pushed
998e4e1e3864: Layer already exists
fb6f398853f5: Layer already exists
e528f2c31deb: Layer already exists
c5f4367d4a59: Layer already exists
ceecb62b2fcc: Layer already exists
193bc1d68b80: Layer already exists
f0e10b20de19: Layer already exists
f402ac273fbc: Pushed
e077c5d57679: Pushed
4ecdd94d65a4: Pushed
4e9059dabac2: Pushed
20210101060100: digest: sha256:9686ebead82a4baffd71ab3a22b981e6eb15de9ecc2a8cfeeb9f14b710645270
size: 4098

> Task :runners:google-cloud-dataflow-java:examplesJavaRunnerV2IntegrationTest

***********************************************************
***********************************************************
**********************Set Up Pubsub************************
The Pub/Sub topic has been set up for this example: projects/apache-beam-testing/topics/testpipeline-jenkins-0101060657-108c6ef3
The Pub/Sub subscription has been set up for this example: projects/apache-beam-testing/subscriptions/testpipeline-jenkins-0101060657-108c6ef3
******************Set Up Big Query Table*******************
The BigQuery table has been set up for this example: apache-beam-testing:traffic_routes_1609481212853.traffic_routes_table
*************************Tear Down*************************
The Pub/Sub topic has been deleted: projects/apache-beam-testing/topics/testpipeline-jenkins-0101060657-108c6ef3
The Pub/Sub subscription has been deleted: projects/apache-beam-testing/subscriptions/testpipeline-jenkins-0101060657-108c6ef3
The BigQuery table might contain the example's output, and it is not deleted automatically:
apache-beam-testing:traffic_routes_1609481212853.traffic_routes_table
Please go to the Developers Console to delete it manually. Otherwise, you may be charged for
its usage.
***********************************************************
***********************************************************

org.apache.beam.examples.snippets.transforms.io.gcp.bigquery.BigQuerySamplesIT > testTableIO
FAILED
    java.lang.RuntimeException at BigQuerySamplesIT.java:121

org.apache.beam.examples.complete.TrafficMaxLaneFlowIT > testE2ETrafficMaxLaneFlow FAILED
    java.lang.RuntimeException at TrafficMaxLaneFlowIT.java:77

8 tests completed, 2 failed

> Task :runners:google-cloud-dataflow-java:examplesJavaRunnerV2IntegrationTest FAILED

> Task :runners:google-cloud-dataflow-java:cleanUpDockerImages FAILED
Untagged: us.gcr.io/apache-beam-testing/java-postcommit-it/java:20210101060100
Untagged: us.gcr.io/apache-beam-testing/java-postcommit-it/java@sha256:9686ebead82a4baffd71ab3a22b981e6eb15de9ecc2a8cfeeb9f14b710645270
ERROR: (gcloud.container.images.delete) [us.gcr.io/apache-beam-testing/java-postcommit-it/java:20210101060100]
is not a valid name. Expected tag in the form "base:tag" or "tag" or digest in the form "sha256:<digest>"

FAILURE: Build completed with 2 failures.

1: Task failed with an exception.
-----------
* What went wrong:
Execution failed for task ':runners:google-cloud-dataflow-java:examplesJavaRunnerV2IntegrationTest'.
> There were failing tests. See the report at: file://<https://ci-beam.apache.org/job/beam_PostCommit_Java_Examples_Dataflow_V2_java11/ws/src/runners/google-cloud-dataflow-java/build/reports/tests/examplesJavaRunnerV2IntegrationTest/index.html>

* Try:
Run with --stacktrace option to get the stack trace. Run with --info or --debug option to
get more log output. Run with --scan to get full insights.
==============================================================================

2: Task failed with an exception.
-----------
* Where:
Build file '<https://ci-beam.apache.org/job/beam_PostCommit_Java_Examples_Dataflow_V2_java11/ws/src/runners/google-cloud-dataflow-java/build.gradle'>
line: 274

* What went wrong:
Execution failed for task ':runners:google-cloud-dataflow-java:cleanUpDockerImages'.
> Process 'command 'gcloud'' finished with non-zero exit value 1

* Try:
Run with --stacktrace option to get the stack trace. Run with --info or --debug option to
get more log output. Run with --scan to get full insights.
==============================================================================

* Get more help at https://help.gradle.org

Deprecated Gradle features were used in this build, making it incompatible with Gradle 7.0.
Use '--warning-mode all' to show the individual deprecation warnings.
See https://docs.gradle.org/6.7.1/userguide/command_line_interface.html#sec:command_line_warnings

BUILD FAILED in 1h 34m 4s
90 actionable tasks: 57 executed, 31 from cache, 2 up-to-date
Gradle was unable to watch the file system for changes. The inotify watches limit is too low.

Publishing build scan...
https://gradle.com/s/cbwfk2fvpetn4

Build step 'Invoke Gradle script' changed build result to FAILURE
Build step 'Invoke Gradle script' marked build as failure

---------------------------------------------------------------------
To unsubscribe, e-mail: builds-unsubscribe@beam.apache.org
For additional commands, e-mail: builds-help@beam.apache.org


Mime
View raw message