beam-builds mailing list archives

Site index · List index
Message view « Date » · « Thread »
Top « Date » · « Thread »
From Apache Jenkins Server <jenk...@builds.apache.org>
Subject Build failed in Jenkins: beam_PostCommit_Java #7083
Date Thu, 14 Jan 2021 13:28:58 GMT
See <https://ci-beam.apache.org/job/beam_PostCommit_Java/7083/display/redirect?page=changes>

Changes:

[noreply] [BEAM-11533] PubSub support Beam DATETIME (SQL TIMESTAMP) type (#13731)


------------------------------------------
[...truncated 50.23 KB...]
> Task :sdks:java:testing:test-utils:compileTestJava FROM-CACHE
> Task :sdks:java:testing:test-utils:testClasses UP-TO-DATE
> Task :sdks:java:testing:test-utils:testJar
> Task :runners:core-construction-java:compileJava FROM-CACHE
> Task :runners:core-construction-java:classes UP-TO-DATE
> Task :sdks:java:core:compileTestJava FROM-CACHE
> Task :sdks:java:core:testClasses

> Task :runners:core-construction-java:jar
Unable to watch the file system for changes. The inotify watches limit is too low.

> Task :sdks:java:core:shadowTestJar FROM-CACHE
> Task :runners:core-java:compileJava FROM-CACHE
> Task :runners:core-java:classes UP-TO-DATE
> Task :runners:core-java:jar
> Task :sdks:java:harness:compileJava FROM-CACHE
> Task :sdks:java:harness:classes UP-TO-DATE
> Task :sdks:java:extensions:google-cloud-platform-core:compileTestJava FROM-CACHE
> Task :sdks:java:extensions:google-cloud-platform-core:testClasses UP-TO-DATE
> Task :sdks:java:extensions:google-cloud-platform-core:testJar
> Task :sdks:java:io:hadoop-file-system:compileTestJava FROM-CACHE
> Task :sdks:java:io:hadoop-file-system:testClasses UP-TO-DATE
> Task :sdks:java:harness:jar
> Task :runners:core-java:compileTestJava FROM-CACHE
> Task :runners:core-java:testClasses UP-TO-DATE
> Task :runners:core-java:testJar
> Task :sdks:java:harness:shadowJar FROM-CACHE
> Task :sdks:java:io:hadoop-common:hadoopVersion2101Test
> Task :sdks:java:io:hadoop-common:hadoopVersion285Test
> Task :runners:java-fn-execution:compileJava FROM-CACHE
> Task :runners:java-fn-execution:classes UP-TO-DATE
> Task :runners:java-fn-execution:jar
> Task :sdks:java:expansion-service:compileJava FROM-CACHE
> Task :sdks:java:expansion-service:classes UP-TO-DATE
> Task :sdks:java:expansion-service:jar
> Task :runners:java-job-service:compileJava FROM-CACHE
> Task :runners:java-job-service:classes UP-TO-DATE
> Task :runners:direct-java:compileJava FROM-CACHE
> Task :runners:direct-java:classes UP-TO-DATE
> Task :runners:java-job-service:jar
> Task :runners:direct-java:shadowJar FROM-CACHE
> Task :sdks:java:io:kafka:compileJava FROM-CACHE
> Task :sdks:java:io:kafka:classes UP-TO-DATE
> Task :sdks:java:extensions:ml:compileJava FROM-CACHE
> Task :sdks:java:extensions:ml:classes UP-TO-DATE
> Task :sdks:java:extensions:ml:jar
> Task :sdks:java:io:kafka:jar
> Task :sdks:java:extensions:ml:compileTestJava FROM-CACHE
> Task :sdks:java:extensions:ml:testClasses
> Task :sdks:java:io:kafka:compileTestJava FROM-CACHE
> Task :sdks:java:io:kafka:testClasses UP-TO-DATE
> Task :sdks:java:io:google-cloud-platform:compileJava FROM-CACHE
> Task :sdks:java:io:google-cloud-platform:classes UP-TO-DATE
> Task :runners:spark:compileJava FROM-CACHE
> Task :runners:spark:classes
> Task :sdks:java:io:hadoop-common:hadoopVersion292Test
> Task :runners:spark:compileTestJava FROM-CACHE
> Task :runners:spark:testClasses
> Task :sdks:java:io:google-cloud-platform:jar
> Task :sdks:java:extensions:zetasketch:compileTestJava FROM-CACHE
> Task :sdks:java:extensions:zetasketch:testClasses UP-TO-DATE
> Task :examples:java:compileJava FROM-CACHE
> Task :examples:java:classes UP-TO-DATE
> Task :runners:google-cloud-dataflow-java:compileJava FROM-CACHE
> Task :runners:google-cloud-dataflow-java:classes
> Task :sdks:java:extensions:google-cloud-platform-core:integrationTestKms
> Task :sdks:java:extensions:google-cloud-platform-core:postCommit
> Task :examples:java:jar
> Task :sdks:java:io:google-cloud-platform:compileTestJava FROM-CACHE
> Task :sdks:java:io:google-cloud-platform:testClasses
> Task :runners:google-cloud-dataflow-java:jar
> Task :examples:java:compileTestJava FROM-CACHE
> Task :examples:java:testClasses
> Task :examples:java:testJar
> Task :sdks:java:io:google-cloud-platform:testJar
> Task :runners:google-cloud-dataflow-java:worker:legacy-worker:compileJava FROM-CACHE
> Task :runners:google-cloud-dataflow-java:worker:legacy-worker:classes UP-TO-DATE
> Task :runners:google-cloud-dataflow-java:worker:legacy-worker:shadowJar FROM-CACHE
> Task :runners:google-cloud-dataflow-java:coreSDKJavaLegacyWorkerIntegrationTest NO-SOURCE
> Task :sdks:java:io:hadoop-common:hadoopVersion321Test
> Task :sdks:java:io:hadoop-common:hadoopVersionsTest
> Task :sdks:java:io:hadoop-common:jar
> Task :sdks:java:io:hadoop-format:compileJava FROM-CACHE
> Task :sdks:java:io:hadoop-format:classes UP-TO-DATE
> Task :sdks:java:extensions:sorter:hadoopVersion2101Test
> Task :sdks:java:io:hadoop-file-system:hadoopVersion2101Test
> Task :sdks:java:io:kinesis:integrationTest
> Task :sdks:java:io:kafka:kafkaVersion01103BatchIT
> Task :runners:spark:hadoopVersion2101Test
> Task :sdks:java:extensions:ml:integrationTest
> Task :sdks:java:io:google-cloud-platform:integrationTest
> Task :runners:google-cloud-dataflow-java:examplesJavaLegacyWorkerIntegrationTest
> Task :sdks:java:io:hadoop-format:compileTestJava FROM-CACHE
> Task :sdks:java:io:hadoop-format:testClasses
> Task :sdks:java:io:hadoop-format:runHadoopFormatIO2101ElasticIT
> Task :sdks:java:extensions:sorter:hadoopVersion285Test
> Task :sdks:java:io:hcatalog:compileJava FROM-CACHE
> Task :sdks:java:io:hcatalog:classes
> Task :sdks:java:io:hcatalog:compileTestJava FROM-CACHE
> Task :sdks:java:io:hcatalog:testClasses UP-TO-DATE
> Task :sdks:java:io:hcatalog:hadoopVersion2101Test
> Task :sdks:java:io:hadoop-file-system:hadoopVersion285Test
> Task :sdks:java:io:parquet:compileJava FROM-CACHE
> Task :sdks:java:io:parquet:classes UP-TO-DATE
> Task :sdks:java:io:parquet:compileTestJava FROM-CACHE
> Task :sdks:java:io:parquet:testClasses UP-TO-DATE
> Task :sdks:java:io:parquet:hadoopVersion2101Test
> Task :sdks:java:extensions:sorter:hadoopVersion292Test
> Task :sdks:java:io:hadoop-file-system:hadoopVersion292Test
> Task :sdks:java:io:hadoop-format:runHadoopFormatIO2101IT

> Task :runners:google-cloud-dataflow-java:examplesJavaLegacyWorkerIntegrationTest

***********************************************************
***********************************************************
**********************Set Up Pubsub************************
The Pub/Sub topic has been set up for this example: projects/apache-beam-testing/topics/testpipeline-jenkins-0114120323-3c6760f4
The Pub/Sub subscription has been set up for this example: projects/apache-beam-testing/subscriptions/testpipeline-jenkins-0114120323-3c6760f4
******************Set Up Big Query Table*******************
The BigQuery table has been set up for this example: apache-beam-testing:traffic_routes_1610625791381.traffic_routes_table
*************************Tear Down*************************
The Pub/Sub topic has been deleted: projects/apache-beam-testing/topics/testpipeline-jenkins-0114120323-3c6760f4
The Pub/Sub subscription has been deleted: projects/apache-beam-testing/subscriptions/testpipeline-jenkins-0114120323-3c6760f4
The BigQuery table might contain the example's output, and it is not deleted automatically:
apache-beam-testing:traffic_routes_1610625791381.traffic_routes_table
Please go to the Developers Console to delete it manually. Otherwise, you may be charged for
its usage.
***********************************************************
***********************************************************

> Task :sdks:java:extensions:sorter:hadoopVersion321Test
> Task :sdks:java:io:parquet:hadoopVersion285Test
> Task :sdks:java:extensions:ml:postCommit
> Task :sdks:java:extensions:zetasketch:integrationTest
> Task :sdks:java:io:hadoop-format:runHadoopFormatIO2101Test
> Task :sdks:java:io:hcatalog:hadoopVersion285Test
> Task :sdks:java:extensions:sorter:hadoopVersionsTest
> Task :sdks:java:io:parquet:hadoopVersion292Test
> Task :sdks:java:io:hadoop-file-system:hadoopVersion321Test
> Task :sdks:java:io:kafka:kafkaVersion01103Test
> Task :sdks:java:io:hadoop-file-system:hadoopVersionsTest
> Task :sdks:java:io:parquet:hadoopVersion321Test
> Task :sdks:java:io:kafka:kafkaVersion100BatchIT
> Task :sdks:java:io:parquet:hadoopVersionsTest
> Task :sdks:java:io:hadoop-format:runHadoopFormatIO285ElasticIT
> Task :sdks:java:io:kafka:kafkaVersion100Test
> Task :sdks:java:io:hcatalog:hadoopVersion292Test

> Task :sdks:java:io:google-cloud-platform:integrationTest

org.apache.beam.sdk.io.gcp.healthcare.FhirIOSearchIT > testFhirIOSearch[R4] FAILED
    com.google.gson.JsonParseException at JsonParser.java:89
        Caused by: java.lang.OutOfMemoryError at TypeAdapters.java:702

> Task :sdks:java:io:hadoop-format:runHadoopFormatIO285IT
> Task :sdks:java:io:kafka:kafkaVersion111BatchIT
> Task :sdks:java:io:kafka:kafkaVersion111Test
> Task :sdks:java:io:hadoop-format:runHadoopFormatIO285Test
> Task :sdks:java:io:hcatalog:hadoopVersionsTest

> Task :sdks:java:io:google-cloud-platform:integrationTest

42 tests completed, 1 failed, 1 skipped

> Task :sdks:java:io:google-cloud-platform:integrationTest FAILED
> Task :sdks:java:io:google-cloud-platform:integrationTestKms
> Task :runners:spark:hadoopVersion285Test
> Task :sdks:java:io:kafka:kafkaVersion201BatchIT
> Task :sdks:java:io:hadoop-format:runHadoopFormatIO292ElasticIT
> Task :sdks:java:io:kafka:kafkaVersion201Test
> Task :sdks:java:io:kafka:kafkaVersion211BatchIT
> Task :sdks:java:io:hadoop-format:runHadoopFormatIO292IT
> Task :sdks:java:io:kafka:kafkaVersion211Test
> Task :sdks:java:io:hadoop-format:runHadoopFormatIO292Test

> Task :runners:google-cloud-dataflow-java:examplesJavaLegacyWorkerIntegrationTest

***********************************************************
***********************************************************
**********************Set Up Pubsub************************
The Pub/Sub topic has been set up for this example: projects/apache-beam-testing/topics/testpipeline-jenkins-0114121520-3f7cedc
The Pub/Sub subscription has been set up for this example: projects/apache-beam-testing/subscriptions/testpipeline-jenkins-0114121520-3f7cedc
******************Set Up Big Query Table*******************
The BigQuery table has been set up for this example: apache-beam-testing:traffic_max_lane_flow_1610626519765.traffic_max_lane_flow_table
*************************Tear Down*************************
The Pub/Sub topic has been deleted: projects/apache-beam-testing/topics/testpipeline-jenkins-0114121520-3f7cedc
The Pub/Sub subscription has been deleted: projects/apache-beam-testing/subscriptions/testpipeline-jenkins-0114121520-3f7cedc
The BigQuery table might contain the example's output, and it is not deleted automatically:
apache-beam-testing:traffic_max_lane_flow_1610626519765.traffic_max_lane_flow_table
Please go to the Developers Console to delete it manually. Otherwise, you may be charged for
its usage.
***********************************************************
***********************************************************

> Task :runners:spark:hadoopVersion292Test
> Task :sdks:java:io:kafka:kafkaVersion222BatchIT
> Task :sdks:java:io:kafka:kafkaVersion222Test
> Task :sdks:java:io:hadoop-format:runHadoopFormatIO321ElasticIT
> Task :sdks:java:io:kafka:kafkaVersion231BatchIT
> Task :sdks:java:io:kafka:kafkaVersion231Test
> Task :sdks:java:io:hadoop-format:runHadoopFormatIO321IT
> Task :runners:spark:hadoopVersion321Test
> Task :sdks:java:io:hadoop-format:runHadoopFormatIO321Test
> Task :sdks:java:io:kafka:kafkaVersion241BatchIT
> Task :sdks:java:io:kafka:kafkaVersion241Test
> Task :sdks:java:io:hadoop-format:hadoopVersionsTest
> Task :sdks:java:io:kafka:kafkaVersion251BatchIT
> Task :runners:spark:hadoopVersionsTest
> Task :javaHadoopVersionsTest
> Task :sdks:java:io:kafka:kafkaVersion251Test
> Task :sdks:java:io:kafka:kafkaVersionsCompatibilityTest
> Task :sdks:java:extensions:zetasketch:postCommit

> Task :runners:google-cloud-dataflow-java:examplesJavaLegacyWorkerIntegrationTest

***********************************************************
***********************************************************
*************************Tear Down*************************
The Pub/Sub topic has been deleted: projects/apache-beam-testing/topics/testpipeline-jenkins-0114122353-c8927875
The Pub/Sub subscription has been deleted: projects/apache-beam-testing/subscriptions/testpipeline-jenkins-0114122353-c8927875
The BigQuery table might contain the example's output, and it is not deleted automatically:
apache-beam-testing:beam_examples.testpipeline_jenkins_0114122353_c8927875
Please go to the Developers Console to delete it manually. Otherwise, you may be charged for
its usage.
***********************************************************
***********************************************************

> Task :runners:google-cloud-dataflow-java:googleCloudPlatformLegacyWorkerIntegrationTest
> Task :runners:google-cloud-dataflow-java:googleCloudPlatformLegacyWorkerKmsIntegrationTest
> Task :runners:google-cloud-dataflow-java:postCommit

FAILURE: Build failed with an exception.

* What went wrong:
Execution failed for task ':sdks:java:io:google-cloud-platform:integrationTest'.
> There were failing tests. See the report at: file://<https://ci-beam.apache.org/job/beam_PostCommit_Java/ws/src/sdks/java/io/google-cloud-platform/build/reports/tests/integrationTest/index.html>

* Try:
Run with --stacktrace option to get the stack trace. Run with --info or --debug option to
get more log output. Run with --scan to get full insights.

* Get more help at https://help.gradle.org

Deprecated Gradle features were used in this build, making it incompatible with Gradle 7.0.
Use '--warning-mode all' to show the individual deprecation warnings.
See https://docs.gradle.org/6.7.1/userguide/command_line_interface.html#sec:command_line_warnings

BUILD FAILED in 1h 28m 34s
220 actionable tasks: 152 executed, 68 from cache
Gradle was unable to watch the file system for changes. The inotify watches limit is too low.

Publishing build scan...
https://gradle.com/s/745ieu6qqbunc

Build step 'Invoke Gradle script' changed build result to FAILURE
Build step 'Invoke Gradle script' marked build as failure

---------------------------------------------------------------------
To unsubscribe, e-mail: builds-unsubscribe@beam.apache.org
For additional commands, e-mail: builds-help@beam.apache.org


Mime
View raw message