beam-builds mailing list archives

Site index · List index
Message view « Date » · « Thread »
Top « Date » · « Thread »
From Apache Jenkins Server <jenk...@builds.apache.org>
Subject Build failed in Jenkins: beam_PostCommit_Java #7134
Date Wed, 27 Jan 2021 06:22:31 GMT
See <https://ci-beam.apache.org/job/beam_PostCommit_Java/7134/display/redirect>

Changes:


------------------------------------------
[...truncated 39.50 KB...]
> Task :sdks:java:extensions:protobuf:generateProto NO-SOURCE
> Task :runners:local-java:compileJava FROM-CACHE
> Task :runners:local-java:classes UP-TO-DATE
> Task :runners:local-java:jar
> Task :sdks:java:testing:test-utils:compileJava FROM-CACHE
> Task :sdks:java:testing:test-utils:classes UP-TO-DATE
> Task :sdks:java:io:hadoop-file-system:compileJava FROM-CACHE
> Task :sdks:java:io:hadoop-file-system:classes UP-TO-DATE
> Task :sdks:java:io:common:compileTestJava FROM-CACHE
> Task :sdks:java:io:common:testClasses UP-TO-DATE
> Task :sdks:java:io:hadoop-common:compileJava FROM-CACHE
> Task :sdks:java:io:hadoop-common:classes UP-TO-DATE
> Task :sdks:java:extensions:sorter:compileJava FROM-CACHE
> Task :sdks:java:io:jdbc:compileJava FROM-CACHE
> Task :sdks:java:extensions:zetasketch:compileJava FROM-CACHE
> Task :sdks:java:extensions:protobuf:compileJava FROM-CACHE
> Task :sdks:java:extensions:sorter:classes
> Task :sdks:java:extensions:protobuf:classes UP-TO-DATE
> Task :vendor:sdks-java-extensions-protobuf:compileJava FROM-CACHE
> Task :sdks:java:io:jdbc:classes UP-TO-DATE
> Task :vendor:sdks-java-extensions-protobuf:classes UP-TO-DATE
> Task :sdks:java:fn-execution:compileJava FROM-CACHE
> Task :sdks:java:fn-execution:classes UP-TO-DATE
> Task :sdks:java:extensions:zetasketch:classes UP-TO-DATE
> Task :sdks:java:io:common:testJar
> Task :sdks:java:extensions:protobuf:jar
> Task :sdks:java:testing:test-utils:jar
> Task :sdks:java:fn-execution:jar
> Task :sdks:java:io:jdbc:jar
> Task :sdks:java:extensions:sorter:compileTestJava FROM-CACHE
> Task :sdks:java:extensions:sorter:testClasses UP-TO-DATE
> Task :sdks:java:io:hadoop-common:compileTestJava FROM-CACHE
> Task :sdks:java:io:hadoop-common:testClasses UP-TO-DATE
> Task :sdks:java:testing:test-utils:compileTestJava FROM-CACHE
> Task :sdks:java:testing:test-utils:testClasses UP-TO-DATE
> Task :sdks:java:io:synthetic:compileJava FROM-CACHE
> Task :sdks:java:io:synthetic:classes UP-TO-DATE
> Task :sdks:java:testing:test-utils:testJar
> Task :sdks:java:io:synthetic:jar
> Task :sdks:java:io:kinesis:compileJava FROM-CACHE
> Task :sdks:java:io:kinesis:classes UP-TO-DATE
> Task :runners:core-construction-java:compileJava FROM-CACHE
> Task :runners:core-construction-java:classes UP-TO-DATE
> Task :runners:core-construction-java:jar
> Task :vendor:sdks-java-extensions-protobuf:shadowJar FROM-CACHE
> Task :sdks:java:io:hadoop-common:hadoopVersion2101Test FROM-CACHE
> Task :sdks:java:io:kinesis:compileTestJava FROM-CACHE
> Task :sdks:java:io:kinesis:testClasses UP-TO-DATE
> Task :runners:core-java:compileJava FROM-CACHE
> Task :runners:core-java:classes UP-TO-DATE
> Task :sdks:java:core:compileTestJava FROM-CACHE
> Task :sdks:java:core:testClasses
> Task :runners:core-java:jar
> Task :sdks:java:io:hadoop-common:hadoopVersion285Test FROM-CACHE
> Task :sdks:java:extensions:google-cloud-platform-core:compileJava FROM-CACHE
> Task :sdks:java:extensions:google-cloud-platform-core:classes UP-TO-DATE
> Task :sdks:java:extensions:google-cloud-platform-core:jar
> Task :sdks:java:core:shadowTestJar FROM-CACHE
> Task :sdks:java:io:hadoop-common:hadoopVersion292Test FROM-CACHE
> Task :sdks:java:harness:compileJava FROM-CACHE
> Task :sdks:java:harness:classes UP-TO-DATE
> Task :sdks:java:harness:jar
> Task :sdks:java:io:hadoop-common:hadoopVersion321Test FROM-CACHE
> Task :sdks:java:io:hadoop-common:hadoopVersionsTest UP-TO-DATE
> Task :sdks:java:io:hadoop-common:jar
> Task :sdks:java:extensions:google-cloud-platform-core:compileTestJava FROM-CACHE
> Task :sdks:java:extensions:google-cloud-platform-core:testClasses UP-TO-DATE
> Task :sdks:java:extensions:google-cloud-platform-core:testJar
> Task :sdks:java:io:hadoop-format:compileJava FROM-CACHE
> Task :sdks:java:io:hadoop-format:classes UP-TO-DATE
> Task :sdks:java:io:hadoop-file-system:compileTestJava FROM-CACHE
> Task :sdks:java:io:hadoop-file-system:testClasses UP-TO-DATE
> Task :sdks:java:io:parquet:compileJava FROM-CACHE
> Task :sdks:java:io:parquet:classes UP-TO-DATE
> Task :sdks:java:io:parquet:compileTestJava FROM-CACHE
> Task :sdks:java:io:parquet:testClasses UP-TO-DATE
> Task :runners:core-java:compileTestJava FROM-CACHE
> Task :runners:core-java:testClasses UP-TO-DATE
> Task :sdks:java:io:hcatalog:compileJava FROM-CACHE
> Task :sdks:java:io:hcatalog:classes
> Task :runners:core-java:testJar
> Task :sdks:java:io:hcatalog:compileTestJava FROM-CACHE
> Task :sdks:java:io:hcatalog:testClasses UP-TO-DATE
> Task :sdks:java:harness:shadowJar FROM-CACHE
> Task :runners:java-fn-execution:compileJava FROM-CACHE
> Task :runners:java-fn-execution:classes UP-TO-DATE
> Task :runners:java-fn-execution:jar
> Task :sdks:java:expansion-service:compileJava FROM-CACHE
> Task :sdks:java:expansion-service:classes UP-TO-DATE
> Task :sdks:java:expansion-service:jar
> Task :runners:direct-java:compileJava FROM-CACHE
> Task :runners:direct-java:classes UP-TO-DATE
> Task :runners:java-job-service:compileJava FROM-CACHE
> Task :runners:java-job-service:classes UP-TO-DATE
> Task :runners:java-job-service:jar
> Task :sdks:java:extensions:ml:compileJava FROM-CACHE
> Task :sdks:java:extensions:ml:classes UP-TO-DATE
> Task :sdks:java:extensions:ml:jar
> Task :sdks:java:io:kafka:compileJava FROM-CACHE
> Task :sdks:java:io:kafka:classes UP-TO-DATE
> Task :runners:direct-java:shadowJar FROM-CACHE
> Task :sdks:java:io:kafka:jar
> Task :sdks:java:extensions:ml:compileTestJava FROM-CACHE
> Task :sdks:java:extensions:ml:testClasses
> Task :sdks:java:io:hcatalog:hadoopVersion2101Test FROM-CACHE
> Task :sdks:java:extensions:sorter:hadoopVersion2101Test FROM-CACHE
> Task :sdks:java:io:parquet:hadoopVersion2101Test FROM-CACHE
> Task :sdks:java:io:hcatalog:hadoopVersion285Test FROM-CACHE
> Task :sdks:java:extensions:sorter:hadoopVersion285Test FROM-CACHE
> Task :sdks:java:io:kafka:compileTestJava FROM-CACHE
> Task :sdks:java:io:kafka:testClasses UP-TO-DATE
> Task :sdks:java:io:parquet:hadoopVersion285Test FROM-CACHE
> Task :runners:spark:compileJava FROM-CACHE
> Task :runners:spark:classes
> Task :sdks:java:io:hcatalog:hadoopVersion292Test FROM-CACHE
> Task :sdks:java:io:hcatalog:hadoopVersionsTest UP-TO-DATE
> Task :sdks:java:extensions:sorter:hadoopVersion292Test FROM-CACHE
> Task :sdks:java:io:parquet:hadoopVersion292Test FROM-CACHE
> Task :sdks:java:extensions:sorter:hadoopVersion321Test FROM-CACHE
> Task :sdks:java:extensions:sorter:hadoopVersionsTest UP-TO-DATE
> Task :sdks:java:io:parquet:hadoopVersion321Test FROM-CACHE
> Task :sdks:java:io:parquet:hadoopVersionsTest UP-TO-DATE
> Task :sdks:java:io:google-cloud-platform:compileJava FROM-CACHE
> Task :sdks:java:io:google-cloud-platform:classes UP-TO-DATE
> Task :sdks:java:extensions:google-cloud-platform-core:integrationTestKms
> Task :sdks:java:extensions:google-cloud-platform-core:postCommit
> Task :runners:spark:compileTestJava FROM-CACHE
> Task :runners:spark:testClasses
> Task :sdks:java:io:google-cloud-platform:jar
> Task :sdks:java:extensions:zetasketch:compileTestJava FROM-CACHE
> Task :sdks:java:extensions:zetasketch:testClasses UP-TO-DATE
> Task :examples:java:compileJava FROM-CACHE
> Task :examples:java:classes UP-TO-DATE
> Task :runners:google-cloud-dataflow-java:compileJava FROM-CACHE
> Task :runners:google-cloud-dataflow-java:classes
> Task :examples:java:jar
> Task :runners:google-cloud-dataflow-java:jar
> Task :sdks:java:io:google-cloud-platform:compileTestJava FROM-CACHE
> Task :sdks:java:io:google-cloud-platform:testClasses
> Task :examples:java:compileTestJava FROM-CACHE
> Task :examples:java:testClasses
> Task :examples:java:testJar
> Task :sdks:java:io:hadoop-format:compileTestJava FROM-CACHE
> Task :sdks:java:io:hadoop-format:testClasses
> Task :sdks:java:io:google-cloud-platform:testJar
> Task :runners:google-cloud-dataflow-java:worker:legacy-worker:compileJava FROM-CACHE
> Task :runners:google-cloud-dataflow-java:worker:legacy-worker:classes UP-TO-DATE
> Task :runners:google-cloud-dataflow-java:worker:legacy-worker:shadowJar FROM-CACHE
> Task :runners:google-cloud-dataflow-java:coreSDKJavaLegacyWorkerIntegrationTest NO-SOURCE
> Task :runners:google-cloud-dataflow-java:examplesJavaLegacyWorkerIntegrationTest FROM-CACHE
> Task :runners:spark:hadoopVersion2101Test FROM-CACHE
> Task :runners:spark:hadoopVersion285Test FROM-CACHE
> Task :sdks:java:io:hadoop-file-system:hadoopVersion2101Test
> Task :sdks:java:io:kinesis:integrationTest
> Task :sdks:java:io:kafka:kafkaVersion01103BatchIT
> Task :sdks:java:extensions:ml:integrationTest
> Task :sdks:java:io:hadoop-format:runHadoopFormatIO2101ElasticIT
> Task :sdks:java:io:google-cloud-platform:integrationTest
> Task :runners:google-cloud-dataflow-java:googleCloudPlatformLegacyWorkerIntegrationTest
FROM-CACHE
> Task :runners:google-cloud-dataflow-java:googleCloudPlatformLegacyWorkerKmsIntegrationTest
FROM-CACHE
> Task :runners:google-cloud-dataflow-java:postCommit UP-TO-DATE
> Task :runners:spark:hadoopVersion292Test FROM-CACHE
> Task :runners:spark:hadoopVersion321Test FROM-CACHE
> Task :runners:spark:hadoopVersionsTest UP-TO-DATE
> Task :sdks:java:extensions:ml:postCommit
> Task :sdks:java:extensions:zetasketch:integrationTest
> Task :sdks:java:io:kafka:kafkaVersion01103Test
> Task :sdks:java:io:hadoop-format:runHadoopFormatIO2101IT
> Task :sdks:java:io:hadoop-file-system:hadoopVersion285Test
> Task :sdks:java:io:kafka:kafkaVersion100BatchIT
> Task :sdks:java:io:hadoop-format:runHadoopFormatIO2101Test
> Task :sdks:java:io:kafka:kafkaVersion100Test
> Task :sdks:java:io:hadoop-file-system:hadoopVersion292Test
> Task :sdks:java:io:kafka:kafkaVersion111BatchIT
> Task :sdks:java:io:hadoop-format:runHadoopFormatIO285ElasticIT
> Task :sdks:java:io:hadoop-file-system:hadoopVersion321Test
> Task :sdks:java:io:kafka:kafkaVersion111Test
> Task :sdks:java:io:hadoop-file-system:hadoopVersionsTest
> Task :sdks:java:io:hadoop-format:runHadoopFormatIO285IT
> Task :sdks:java:io:kafka:kafkaVersion201BatchIT
> Task :sdks:java:io:hadoop-format:runHadoopFormatIO285Test
> Task :sdks:java:io:kafka:kafkaVersion201Test
> Task :sdks:java:io:kafka:kafkaVersion211BatchIT
> Task :sdks:java:io:kafka:kafkaVersion211Test
> Task :sdks:java:io:hadoop-format:runHadoopFormatIO292ElasticIT
> Task :sdks:java:io:kafka:kafkaVersion222BatchIT
> Task :sdks:java:io:kafka:kafkaVersion222Test
> Task :sdks:java:io:hadoop-format:runHadoopFormatIO292IT

> Task :sdks:java:io:google-cloud-platform:integrationTest

org.apache.beam.sdk.io.gcp.healthcare.FhirIOWriteIT > testFhirIO_Import[STU3] FAILED
    org.apache.beam.sdk.Pipeline$PipelineExecutionException at FhirIOWriteIT.java:139
        Caused by: java.lang.AssertionError at FhirIOWriteIT.java:137
            Caused by: java.lang.AssertionError at MatcherAssert.java:18

> Task :sdks:java:io:kafka:kafkaVersion231BatchIT
> Task :sdks:java:io:hadoop-format:runHadoopFormatIO292Test
> Task :sdks:java:io:kafka:kafkaVersion231Test
> Task :sdks:java:io:kafka:kafkaVersion241BatchIT
> Task :sdks:java:io:hadoop-format:runHadoopFormatIO321ElasticIT
> Task :sdks:java:io:kafka:kafkaVersion241Test
> Task :sdks:java:io:hadoop-format:runHadoopFormatIO321IT
> Task :sdks:java:io:kafka:kafkaVersion251BatchIT
> Task :sdks:java:io:hadoop-format:runHadoopFormatIO321Test
> Task :sdks:java:io:kafka:kafkaVersion251Test
> Task :sdks:java:io:kafka:kafkaVersionsCompatibilityTest

> Task :sdks:java:io:google-cloud-platform:integrationTest

org.apache.beam.sdk.io.gcp.healthcare.FhirIOWriteIT > testFhirIO_Import[R4] FAILED
    org.apache.beam.sdk.Pipeline$PipelineExecutionException at FhirIOWriteIT.java:139
        Caused by: java.lang.AssertionError at FhirIOWriteIT.java:137
            Caused by: java.lang.AssertionError at MatcherAssert.java:18

> Task :sdks:java:io:hadoop-format:hadoopVersionsTest
> Task :javaHadoopVersionsTest

> Task :sdks:java:io:google-cloud-platform:integrationTest

43 tests completed, 2 failed, 1 skipped

> Task :sdks:java:io:google-cloud-platform:integrationTest FAILED
> Task :sdks:java:io:google-cloud-platform:integrationTestKms
> Task :sdks:java:extensions:zetasketch:postCommit

FAILURE: Build failed with an exception.

* What went wrong:
Execution failed for task ':sdks:java:io:google-cloud-platform:integrationTest'.
> There were failing tests. See the report at: file://<https://ci-beam.apache.org/job/beam_PostCommit_Java/ws/src/sdks/java/io/google-cloud-platform/build/reports/tests/integrationTest/index.html>

* Try:
Run with --stacktrace option to get the stack trace. Run with --info or --debug option to
get more log output. Run with --scan to get full insights.

* Get more help at https://help.gradle.org

Deprecated Gradle features were used in this build, making it incompatible with Gradle 7.0.
Use '--warning-mode all' to show the individual deprecation warnings.
See https://docs.gradle.org/6.8/userguide/command_line_interface.html#sec:command_line_warnings

BUILD FAILED in 22m 1s
220 actionable tasks: 130 executed, 90 from cache

Publishing build scan...
https://gradle.com/s/du6qr5qk7p3ls

Build step 'Invoke Gradle script' changed build result to FAILURE
Build step 'Invoke Gradle script' marked build as failure

---------------------------------------------------------------------
To unsubscribe, e-mail: builds-unsubscribe@beam.apache.org
For additional commands, e-mail: builds-help@beam.apache.org


Mime
View raw message