beam-builds mailing list archives

Site index · List index
Message view « Date » · « Thread »
Top « Date » · « Thread »
From Apache Jenkins Server <jenk...@builds.apache.org>
Subject Build failed in Jenkins: beam_PostCommit_Java_Nexmark_Dataflow #6850
Date Sat, 30 Jan 2021 01:45:18 GMT
See <https://ci-beam.apache.org/job/beam_PostCommit_Java_Nexmark_Dataflow/6850/display/redirect?page=changes>

Changes:

[sonam.ramchand] Implemented BIT_XOR for Zetasql dialect

[sonam.ramchand] replaced integer with Bigint type

[sonam.ramchand] added int32 field in testcase

[sonam.ramchand] INT32 to INT64

[sonam.ramchand] fixed spotless checks

[sonam.ramchand] SQL_Java11 PreCommit issue fixed

[sonam.ramchand] removed * dependencies

[sonam.ramchand] removed * dependencies from zetasql test file

[sonam.ramchand] removed * dependency from SQloperators.java

[sonam.ramchand] Fixed check style violations

[sonam.ramchand] fixed checkstyle violations from sqloperators table

[sonam.ramchand] fixed violations from beambuiltinagg file

[sonam.ramchand] bit_Xor to support bytes as well

[sonam.ramchand] deleted extra introduced class

[sonam.ramchand] added meaningful name for unit test

[Kyle Weaver] [BEAM-10925] Load user-provided jars in CalcFn.

[kileysok] Disable Gradle module metadata generation

[Kyle Weaver] [BEAM-10925] Fix code style

[noreply] [BEAM-11415] Enabling new ValidatesRunner framework on Jenkins. (#13684)

[Kyle Weaver] Wrap classloader creation in doPrivileged block.

[Kyle Weaver] [BEAM-10925] Add Java UDFs to UserFunctionDefinitions holder.

[Kyle Weaver] [BEAM-10925] Add optional jar path field to ZetaSqlScalarFunctionImpl.

[Kyle Weaver] Add javadoc comment to JavaScalarFunction::getJarPath.


------------------------------------------
[...truncated 1.64 MB...]
2021-01-30T01:41:49.942Z no activity
2021-01-30T01:42:05.037Z RUNNING ZetaSqlQuery3
Jan 30, 2021 1:42:05 AM org.apache.beam.sdk.testutils.metrics.MetricsReader getCounterMetric
SEVERE: Failed to get metric event.elements, from namespace ZetaSqlQuery3.Events
Jan 30, 2021 1:42:05 AM org.apache.beam.sdk.testutils.metrics.MetricsReader getCounterMetric
SEVERE: Failed to get metric event.bytes, from namespace ZetaSqlQuery3.Events
Jan 30, 2021 1:42:05 AM org.apache.beam.sdk.testutils.metrics.MetricsReader getCounterMetric
SEVERE: Failed to get metric result.elements, from namespace ZetaSqlQuery3.Results
Jan 30, 2021 1:42:05 AM org.apache.beam.sdk.testutils.metrics.MetricsReader getCounterMetric
SEVERE: Failed to get metric result.bytes, from namespace ZetaSqlQuery3.Results
2021-01-30T01:42:05.759Z no activity
2021-01-30T01:42:20.863Z RUNNING ZetaSqlQuery3
Jan 30, 2021 1:42:20 AM org.apache.beam.sdk.testutils.metrics.MetricsReader getCounterMetric
SEVERE: Failed to get metric event.elements, from namespace ZetaSqlQuery3.Events
Jan 30, 2021 1:42:21 AM org.apache.beam.sdk.testutils.metrics.MetricsReader getCounterMetric
SEVERE: Failed to get metric event.bytes, from namespace ZetaSqlQuery3.Events
Jan 30, 2021 1:42:21 AM org.apache.beam.sdk.testutils.metrics.MetricsReader getCounterMetric
SEVERE: Failed to get metric result.elements, from namespace ZetaSqlQuery3.Results
Jan 30, 2021 1:42:21 AM org.apache.beam.sdk.testutils.metrics.MetricsReader getCounterMetric
SEVERE: Failed to get metric result.bytes, from namespace ZetaSqlQuery3.Results
2021-01-30T01:42:21.620Z no activity
2021-01-30T01:42:36.682Z RUNNING ZetaSqlQuery3
Jan 30, 2021 1:42:36 AM org.apache.beam.sdk.testutils.metrics.MetricsReader getCounterMetric
SEVERE: Failed to get metric event.elements, from namespace ZetaSqlQuery3.Events
Jan 30, 2021 1:42:36 AM org.apache.beam.sdk.testutils.metrics.MetricsReader getCounterMetric
SEVERE: Failed to get metric event.bytes, from namespace ZetaSqlQuery3.Events
Jan 30, 2021 1:42:37 AM org.apache.beam.sdk.testutils.metrics.MetricsReader getCounterMetric
SEVERE: Failed to get metric result.elements, from namespace ZetaSqlQuery3.Results
Jan 30, 2021 1:42:37 AM org.apache.beam.sdk.testutils.metrics.MetricsReader getCounterMetric
SEVERE: Failed to get metric result.bytes, from namespace ZetaSqlQuery3.Results
2021-01-30T01:42:37.280Z no activity
2021-01-30T01:42:52.372Z RUNNING ZetaSqlQuery3
Jan 30, 2021 1:42:52 AM org.apache.beam.sdk.testutils.metrics.MetricsReader getCounterMetric
SEVERE: Failed to get metric event.elements, from namespace ZetaSqlQuery3.Events
Jan 30, 2021 1:42:52 AM org.apache.beam.sdk.testutils.metrics.MetricsReader getCounterMetric
SEVERE: Failed to get metric event.bytes, from namespace ZetaSqlQuery3.Events
Jan 30, 2021 1:42:52 AM org.apache.beam.sdk.testutils.metrics.MetricsReader getCounterMetric
SEVERE: Failed to get metric result.elements, from namespace ZetaSqlQuery3.Results
Jan 30, 2021 1:42:52 AM org.apache.beam.sdk.testutils.metrics.MetricsReader getCounterMetric
SEVERE: Failed to get metric result.bytes, from namespace ZetaSqlQuery3.Results
2021-01-30T01:42:53.114Z no activity
2021-01-30T01:43:08.197Z RUNNING ZetaSqlQuery3
Jan 30, 2021 1:43:08 AM org.apache.beam.sdk.testutils.metrics.MetricsReader getCounterMetric
SEVERE: Failed to get metric event.elements, from namespace ZetaSqlQuery3.Events
Jan 30, 2021 1:43:08 AM org.apache.beam.sdk.testutils.metrics.MetricsReader getCounterMetric
SEVERE: Failed to get metric event.bytes, from namespace ZetaSqlQuery3.Events
Jan 30, 2021 1:43:08 AM org.apache.beam.sdk.testutils.metrics.MetricsReader getCounterMetric
SEVERE: Failed to get metric result.elements, from namespace ZetaSqlQuery3.Results
Jan 30, 2021 1:43:08 AM org.apache.beam.sdk.testutils.metrics.MetricsReader getCounterMetric
SEVERE: Failed to get metric result.bytes, from namespace ZetaSqlQuery3.Results
2021-01-30T01:43:08.906Z no activity
2021-01-30T01:43:24.012Z RUNNING ZetaSqlQuery3
Jan 30, 2021 1:43:24 AM org.apache.beam.sdk.testutils.metrics.MetricsReader getCounterMetric
SEVERE: Failed to get metric event.elements, from namespace ZetaSqlQuery3.Events
Jan 30, 2021 1:43:24 AM org.apache.beam.sdk.testutils.metrics.MetricsReader getCounterMetric
SEVERE: Failed to get metric event.bytes, from namespace ZetaSqlQuery3.Events
Jan 30, 2021 1:43:24 AM org.apache.beam.sdk.testutils.metrics.MetricsReader getCounterMetric
SEVERE: Failed to get metric result.elements, from namespace ZetaSqlQuery3.Results
Jan 30, 2021 1:43:24 AM org.apache.beam.sdk.testutils.metrics.MetricsReader getCounterMetric
SEVERE: Failed to get metric result.bytes, from namespace ZetaSqlQuery3.Results
2021-01-30T01:43:24.752Z no activity
2021-01-30T01:43:39.864Z RUNNING ZetaSqlQuery3
Jan 30, 2021 1:43:39 AM org.apache.beam.sdk.testutils.metrics.MetricsReader getCounterMetric
SEVERE: Failed to get metric event.elements, from namespace ZetaSqlQuery3.Events
Jan 30, 2021 1:43:40 AM org.apache.beam.sdk.testutils.metrics.MetricsReader getCounterMetric
SEVERE: Failed to get metric event.bytes, from namespace ZetaSqlQuery3.Events
Jan 30, 2021 1:43:40 AM org.apache.beam.sdk.testutils.metrics.MetricsReader getCounterMetric
SEVERE: Failed to get metric result.elements, from namespace ZetaSqlQuery3.Results
Jan 30, 2021 1:43:40 AM org.apache.beam.sdk.testutils.metrics.MetricsReader getCounterMetric
SEVERE: Failed to get metric result.bytes, from namespace ZetaSqlQuery3.Results
2021-01-30T01:43:40.631Z no activity
2021-01-30T01:43:55.697Z RUNNING ZetaSqlQuery3
Jan 30, 2021 1:43:55 AM org.apache.beam.sdk.testutils.metrics.MetricsReader getCounterMetric
SEVERE: Failed to get metric event.elements, from namespace ZetaSqlQuery3.Events
Jan 30, 2021 1:43:55 AM org.apache.beam.sdk.testutils.metrics.MetricsReader getCounterMetric
SEVERE: Failed to get metric event.bytes, from namespace ZetaSqlQuery3.Events
Jan 30, 2021 1:43:56 AM org.apache.beam.sdk.testutils.metrics.MetricsReader getCounterMetric
SEVERE: Failed to get metric result.elements, from namespace ZetaSqlQuery3.Results
Jan 30, 2021 1:43:56 AM org.apache.beam.sdk.testutils.metrics.MetricsReader getCounterMetric
SEVERE: Failed to get metric result.bytes, from namespace ZetaSqlQuery3.Results
2021-01-30T01:43:56.510Z no activity
2021-01-30T01:44:11.601Z RUNNING ZetaSqlQuery3
Jan 30, 2021 1:44:11 AM org.apache.beam.sdk.testutils.metrics.MetricsReader getCounterMetric
SEVERE: Failed to get metric event.elements, from namespace ZetaSqlQuery3.Events
Jan 30, 2021 1:44:11 AM org.apache.beam.sdk.testutils.metrics.MetricsReader getCounterMetric
SEVERE: Failed to get metric event.bytes, from namespace ZetaSqlQuery3.Events
Jan 30, 2021 1:44:11 AM org.apache.beam.sdk.testutils.metrics.MetricsReader getCounterMetric
SEVERE: Failed to get metric result.elements, from namespace ZetaSqlQuery3.Results
Jan 30, 2021 1:44:12 AM org.apache.beam.sdk.testutils.metrics.MetricsReader getCounterMetric
SEVERE: Failed to get metric result.bytes, from namespace ZetaSqlQuery3.Results
2021-01-30T01:44:12.215Z no activity
2021-01-30T01:44:27.293Z RUNNING ZetaSqlQuery3
Jan 30, 2021 1:44:27 AM org.apache.beam.sdk.testutils.metrics.MetricsReader getCounterMetric
SEVERE: Failed to get metric event.elements, from namespace ZetaSqlQuery3.Events
Jan 30, 2021 1:44:27 AM org.apache.beam.sdk.testutils.metrics.MetricsReader getCounterMetric
SEVERE: Failed to get metric event.bytes, from namespace ZetaSqlQuery3.Events
Jan 30, 2021 1:44:27 AM org.apache.beam.sdk.testutils.metrics.MetricsReader getCounterMetric
SEVERE: Failed to get metric result.elements, from namespace ZetaSqlQuery3.Results
Jan 30, 2021 1:44:27 AM org.apache.beam.sdk.testutils.metrics.MetricsReader getCounterMetric
SEVERE: Failed to get metric result.bytes, from namespace ZetaSqlQuery3.Results
2021-01-30T01:44:28.088Z no activity
2021-01-30T01:44:43.171Z RUNNING ZetaSqlQuery3
Jan 30, 2021 1:44:43 AM org.apache.beam.sdk.testutils.metrics.MetricsReader getCounterMetric
SEVERE: Failed to get metric event.elements, from namespace ZetaSqlQuery3.Events
Jan 30, 2021 1:44:43 AM org.apache.beam.sdk.testutils.metrics.MetricsReader getCounterMetric
SEVERE: Failed to get metric event.bytes, from namespace ZetaSqlQuery3.Events
Jan 30, 2021 1:44:43 AM org.apache.beam.sdk.testutils.metrics.MetricsReader getCounterMetric
SEVERE: Failed to get metric result.elements, from namespace ZetaSqlQuery3.Results
Jan 30, 2021 1:44:43 AM org.apache.beam.sdk.testutils.metrics.MetricsReader getCounterMetric
SEVERE: Failed to get metric result.bytes, from namespace ZetaSqlQuery3.Results
2021-01-30T01:44:43.824Z no activity
2021-01-30T01:44:58.881Z RUNNING ZetaSqlQuery3
Jan 30, 2021 1:44:58 AM org.apache.beam.sdk.testutils.metrics.MetricsReader getCounterMetric
SEVERE: Failed to get metric event.elements, from namespace ZetaSqlQuery3.Events
Jan 30, 2021 1:44:59 AM org.apache.beam.sdk.testutils.metrics.MetricsReader getCounterMetric
SEVERE: Failed to get metric event.bytes, from namespace ZetaSqlQuery3.Events
Jan 30, 2021 1:44:59 AM org.apache.beam.sdk.testutils.metrics.MetricsReader getCounterMetric
SEVERE: Failed to get metric result.elements, from namespace ZetaSqlQuery3.Results
Jan 30, 2021 1:44:59 AM org.apache.beam.sdk.testutils.metrics.MetricsReader getCounterMetric
SEVERE: Failed to get metric result.bytes, from namespace ZetaSqlQuery3.Results
2021-01-30T01:44:59.562Z no activity
2021-01-30T01:45:14.672Z FAILED ZetaSqlQuery3
Jan 30, 2021 1:45:14 AM org.apache.beam.sdk.testutils.metrics.MetricsReader getCounterMetric
SEVERE: Failed to get metric event.elements, from namespace ZetaSqlQuery3.Events
Jan 30, 2021 1:45:14 AM org.apache.beam.sdk.testutils.metrics.MetricsReader getCounterMetric
SEVERE: Failed to get metric event.bytes, from namespace ZetaSqlQuery3.Events
Jan 30, 2021 1:45:14 AM org.apache.beam.sdk.testutils.metrics.MetricsReader getCounterMetric
SEVERE: Failed to get metric result.elements, from namespace ZetaSqlQuery3.Results
Jan 30, 2021 1:45:14 AM org.apache.beam.sdk.testutils.metrics.MetricsReader getCounterMetric
SEVERE: Failed to get metric result.bytes, from namespace ZetaSqlQuery3.Results

==========================================================================================
Run started 2021-01-30T00:43:36.133Z and ran for PT3698.563S

Default configuration:
{"debug":true,"query":null,"sourceType":"DIRECT","generateEventFilePathPrefix":null,"sinkType":"DEVNULL","exportSummaryToBigQuery":false,"pubSubMode":"COMBINED","pubsubMessageSerializationMethod":"CODER","sideInputType":"DIRECT","sideInputRowCount":500,"sideInputNumShards":3,"sideInputUrl":null,"sessionGap":{"standardHours":0,"standardMinutes":10,"standardDays":0,"standardSeconds":600,"millis":600000},"numEvents":100000,"numEventGenerators":100,"rateShape":"SINE","firstEventRate":10000,"nextEventRate":10000,"rateUnit":"PER_SECOND","ratePeriodSec":600,"preloadSeconds":0,"streamTimeout":240,"isRateLimited":false,"useWallclockEventTime":false,"avgPersonByteSize":200,"avgAuctionByteSize":500,"avgBidByteSize":100,"hotAuctionRatio":2,"hotSellersRatio":4,"hotBiddersRatio":4,"windowSizeSec":10,"windowPeriodSec":5,"watermarkHoldbackSec":0,"numInFlightAuctions":100,"numActivePeople":1000,"coderStrategy":"HAND","cpuDelayMs":0,"diskBusyBytes":0,"auctionSkip":123,"fanout":5,"maxAuctionsWaitingTime":600,"occasionalDelaySec":3,"probDelayedEvent":0.1,"maxLogEvents":100000,"usePubsubPublishTime":false,"outOfOrderGroupSize":1}

Configurations:
  Conf  Description
  0000  query:PASSTHROUGH; exportSummaryToBigQuery:true; numEvents:10000000
  0001  query:CURRENCY_CONVERSION; exportSummaryToBigQuery:true; numEvents:10000000
  0002  query:SELECTION; exportSummaryToBigQuery:true; numEvents:10000000
  0003  query:LOCAL_ITEM_SUGGESTION; exportSummaryToBigQuery:true; numEvents:10000000
  0004  query:AVERAGE_PRICE_FOR_CATEGORY; exportSummaryToBigQuery:true; numEvents:1000000
  0005  query:HOT_ITEMS; exportSummaryToBigQuery:true; numEvents:10000000
  0006  query:AVERAGE_SELLING_PRICE_BY_SELLER; exportSummaryToBigQuery:true; numEvents:1000000
  0007  query:HIGHEST_BID; exportSummaryToBigQuery:true; numEvents:10000000
  0008  query:MONITOR_NEW_USERS; exportSummaryToBigQuery:true; numEvents:10000000
  0009  query:WINNING_BIDS; exportSummaryToBigQuery:true; numEvents:1000000
  0010  query:LOG_TO_SHARDED_FILES; exportSummaryToBigQuery:true; numEvents:10000000
  0011  query:USER_SESSIONS; exportSummaryToBigQuery:true; numEvents:10000000
  0012  query:PROCESSING_TIME_WINDOWS; exportSummaryToBigQuery:true; numEvents:10000000
  0013  query:BOUNDED_SIDE_INPUT_JOIN; exportSummaryToBigQuery:true; numEvents:10000000
  0014  query:SESSION_SIDE_INPUT_JOIN; exportSummaryToBigQuery:true; numEvents:10000000

Performance:
  Conf  Runtime(sec)    (Baseline)  Events(/sec)    (Baseline)       Results    (Baseline)
  0000         197.4                     50649.1                     9200000             

  0001  *** not run ***
  0002         116.9                     85526.4                       83527             

  0003          -1.0                        -1.0                          -1             

        *** Job was unexpectedly updated ***
  0004  *** not run ***
  0005  *** not run ***
  0006  *** not run ***
  0007  *** not run ***
  0008  *** not run ***
  0009  *** not run ***
  0010  *** not run ***
  0011  *** not run ***
  0012  *** not run ***
  0013         373.4                     26779.9                     9200000             

  0014  *** not run ***
==========================================================================================


==========================================================================================
Run started 2021-01-30T00:43:36.133Z and ran for PT3699.854S

Default configuration:
{"debug":true,"query":null,"sourceType":"DIRECT","generateEventFilePathPrefix":null,"sinkType":"DEVNULL","exportSummaryToBigQuery":false,"pubSubMode":"COMBINED","pubsubMessageSerializationMethod":"CODER","sideInputType":"DIRECT","sideInputRowCount":500,"sideInputNumShards":3,"sideInputUrl":null,"sessionGap":{"standardHours":0,"standardMinutes":10,"standardDays":0,"standardSeconds":600,"millis":600000},"numEvents":100000,"numEventGenerators":100,"rateShape":"SINE","firstEventRate":10000,"nextEventRate":10000,"rateUnit":"PER_SECOND","ratePeriodSec":600,"preloadSeconds":0,"streamTimeout":240,"isRateLimited":false,"useWallclockEventTime":false,"avgPersonByteSize":200,"avgAuctionByteSize":500,"avgBidByteSize":100,"hotAuctionRatio":2,"hotSellersRatio":4,"hotBiddersRatio":4,"windowSizeSec":10,"windowPeriodSec":5,"watermarkHoldbackSec":0,"numInFlightAuctions":100,"numActivePeople":1000,"coderStrategy":"HAND","cpuDelayMs":0,"diskBusyBytes":0,"auctionSkip":123,"fanout":5,"maxAuctionsWaitingTime":600,"occasionalDelaySec":3,"probDelayedEvent":0.1,"maxLogEvents":100000,"usePubsubPublishTime":false,"outOfOrderGroupSize":1}

Configurations:
  Conf  Description
  0000  query:PASSTHROUGH; exportSummaryToBigQuery:true; numEvents:10000000
  0001  query:CURRENCY_CONVERSION; exportSummaryToBigQuery:true; numEvents:10000000
  0002  query:SELECTION; exportSummaryToBigQuery:true; numEvents:10000000
  0003  query:LOCAL_ITEM_SUGGESTION; exportSummaryToBigQuery:true; numEvents:10000000
  0004  query:AVERAGE_PRICE_FOR_CATEGORY; exportSummaryToBigQuery:true; numEvents:1000000
  0005  query:HOT_ITEMS; exportSummaryToBigQuery:true; numEvents:10000000
  0006  query:AVERAGE_SELLING_PRICE_BY_SELLER; exportSummaryToBigQuery:true; numEvents:1000000
  0007  query:HIGHEST_BID; exportSummaryToBigQuery:true; numEvents:10000000
  0008  query:MONITOR_NEW_USERS; exportSummaryToBigQuery:true; numEvents:10000000
  0009  query:WINNING_BIDS; exportSummaryToBigQuery:true; numEvents:1000000
  0010  query:LOG_TO_SHARDED_FILES; exportSummaryToBigQuery:true; numEvents:10000000
  0011  query:USER_SESSIONS; exportSummaryToBigQuery:true; numEvents:10000000
  0012  query:PROCESSING_TIME_WINDOWS; exportSummaryToBigQuery:true; numEvents:10000000
  0013  query:BOUNDED_SIDE_INPUT_JOIN; exportSummaryToBigQuery:true; numEvents:10000000
  0014  query:SESSION_SIDE_INPUT_JOIN; exportSummaryToBigQuery:true; numEvents:10000000

Performance:
  Conf  Runtime(sec)    (Baseline)  Events(/sec)    (Baseline)       Results    (Baseline)
  0000         197.4                     50649.1                     9200000             

  0001  *** not run ***
  0002         116.9                     85526.4                       83527             

  0003          -1.0                        -1.0                          -1             

        *** Job was unexpectedly updated ***
  0004  *** not run ***
  0005  *** not run ***
  0006  *** not run ***
  0007  *** not run ***
  0008  *** not run ***
  0009  *** not run ***
  0010  *** not run ***
  0011  *** not run ***
  0012  *** not run ***
  0013         373.4                     26779.9                     9200000             

  0014  *** not run ***
==========================================================================================

Exception in thread "main" java.lang.RuntimeException: Execution was not successful
	at org.apache.beam.sdk.nexmark.Main.runAll(Main.java:186)
	at org.apache.beam.sdk.nexmark.Main.main(Main.java:494)

> Task :sdks:java:testing:nexmark:run FAILED

FAILURE: Build failed with an exception.

* What went wrong:
Execution failed for task ':sdks:java:testing:nexmark:run'.
> Process 'command '/usr/lib/jvm/java-8-openjdk-amd64/bin/java'' finished with non-zero
exit value 1

* Try:
Run with --stacktrace option to get the stack trace. Run with --info or --debug option to
get more log output. Run with --scan to get full insights.

* Get more help at https://help.gradle.org

Deprecated Gradle features were used in this build, making it incompatible with Gradle 7.0.
Use '--warning-mode all' to show the individual deprecation warnings.
See https://docs.gradle.org/6.8/userguide/command_line_interface.html#sec:command_line_warnings

BUILD FAILED in 1h 1m 47s
123 actionable tasks: 2 executed, 121 up-to-date

Publishing build scan...
https://gradle.com/s/zneaifxk3wfwq

Build step 'Invoke Gradle script' changed build result to FAILURE
Build step 'Invoke Gradle script' marked build as failure

---------------------------------------------------------------------
To unsubscribe, e-mail: builds-unsubscribe@beam.apache.org
For additional commands, e-mail: builds-help@beam.apache.org


Mime
View raw message