beam-builds mailing list archives

Site index · List index
Message view « Date » · « Thread »
Top « Date » · « Thread »
From Apache Jenkins Server <jenk...@builds.apache.org>
Subject Build failed in Jenkins: beam_PostCommit_Java #7149
Date Sun, 31 Jan 2021 01:46:51 GMT
See <https://ci-beam.apache.org/job/beam_PostCommit_Java/7149/display/redirect>

Changes:


------------------------------------------
[...truncated 105.06 KB...]
golang.org/x/sys,https://go.googlesource.com/sys/+/refs/heads/master/LICENSE,BSD-3-Clause
golang.org/x/text,https://go.googlesource.com/text/+/refs/heads/master/LICENSE,BSD-3-Clause
+ chmod -R a+w /output/licenses

> Task :release:go-licenses:java:createLicenses
> Task :sdks:java:container:java8:copyGolangLicenses
> Task :sdks:java:io:hadoop-file-system:hadoopVersion285Test
> Task :sdks:java:io:kafka:kafkaVersion01103Test

> Task :sdks:go:resolveBuildDependencies
Resolving golang.org/x/text: commit='23ae387dee1f90d29a23c0e87ee0b46038fbed0e', urls=[https://go.googlesource.com/text]
Resolving cached github.com/etcd-io/etcd: commit='11214aa33bf5a47d3d9d8dafe0f6b97237dfe921',
urls=[https://github.com/etcd-io/etcd.git, git@github.com:etcd-io/etcd.git]

> Task :sdks:java:io:hadoop-format:runHadoopFormatIO2101IT
> Task :sdks:java:io:kafka:kafkaVersion100BatchIT
> Task :sdks:java:io:hadoop-file-system:hadoopVersion292Test
> Task :sdks:java:io:hadoop-format:runHadoopFormatIO2101Test
> Task :sdks:java:io:kafka:kafkaVersion100Test
> Task :sdks:java:io:hadoop-file-system:hadoopVersion321Test

> Task :sdks:java:io:google-cloud-platform:integrationTest

org.apache.beam.sdk.io.gcp.healthcare.FhirIOLROIT > test_FhirIO_deidentify FAILED
    org.apache.beam.sdk.Pipeline$PipelineExecutionException at FhirIOLROIT.java:109
        Caused by: com.google.api.client.googleapis.json.GoogleJsonResponseException at GoogleJsonResponseException.java:149

> Task :sdks:java:io:kafka:kafkaVersion111BatchIT
> Task :sdks:java:io:hadoop-file-system:hadoopVersionsTest
> Task :sdks:java:io:hadoop-format:runHadoopFormatIO285ElasticIT
> Task :sdks:java:io:kafka:kafkaVersion111Test
> Task :sdks:java:io:kafka:kafkaVersion201BatchIT
> Task :sdks:java:io:hadoop-format:runHadoopFormatIO285IT
> Task :sdks:java:io:kafka:kafkaVersion201Test
> Task :sdks:java:io:hadoop-format:runHadoopFormatIO285Test
> Task :sdks:java:io:kafka:kafkaVersion211BatchIT

> Task :sdks:go:resolveBuildDependencies
Resolving google.golang.org/api: commit='0324d5e90dc7753607860272666845fad9ceb97e', urls=[https://code.googlesource.com/google-api-go-client]

> Task :sdks:java:io:kafka:kafkaVersion211Test
> Task :sdks:java:io:hadoop-format:runHadoopFormatIO292ElasticIT
> Task :sdks:java:io:kafka:kafkaVersion222BatchIT

> Task :sdks:go:resolveBuildDependencies
Resolving google.golang.org/genproto: commit='4d944d34d83c502a5f761500a14d8842648415c3', urls=[https://github.com/google/go-genproto]
Resolving google.golang.org/grpc: commit='5e8f83304c0563d1ba74db05fee83d9c18ab9a58', urls=[https://github.com/grpc/grpc-go]

> Task :sdks:java:io:kafka:kafkaVersion222Test

> Task :sdks:go:resolveBuildDependencies
Resolving google.golang.org/protobuf: commit='d165be301fb1e13390ad453281ded24385fd8ebc', urls=[https://go.googlesource.com/protobuf]
Resolving cached github.com/etcd-io/etcd: commit='11214aa33bf5a47d3d9d8dafe0f6b97237dfe921',
urls=[https://github.com/etcd-io/etcd.git, git@github.com:etcd-io/etcd.git]
Resolving cached github.com/etcd-io/etcd: commit='11214aa33bf5a47d3d9d8dafe0f6b97237dfe921',
urls=[https://github.com/etcd-io/etcd.git, git@github.com:etcd-io/etcd.git]

> Task :sdks:java:io:hadoop-format:runHadoopFormatIO292IT
> Task :sdks:go:installDependencies
> Task :sdks:go:buildLinuxAmd64
> Task :sdks:go:goBuild

> Task :sdks:java:container:resolveBuildDependencies
Resolving ./github.com/apache/beam/sdks/go@<https://ci-beam.apache.org/job/beam_PostCommit_Java/ws/src/sdks/go>

> Task :sdks:java:container:installDependencies
> Task :sdks:java:container:buildLinuxAmd64
> Task :sdks:java:container:goBuild
> Task :sdks:java:container:java8:copySdkHarnessLauncher

> Task :sdks:java:container:java8:dockerPrepare
Unable to watch the file system for changes. The inotify watches limit is too low.

> Task :sdks:java:io:kafka:kafkaVersion231BatchIT
> Task :sdks:java:io:hadoop-format:runHadoopFormatIO292Test
> Task :sdks:java:container:java8:docker

> Task :runners:google-cloud-dataflow-java:buildAndPushDockerContainer
WARNING: `gcloud docker` will not be supported for Docker client versions above 18.03.

As an alternative, use `gcloud auth configure-docker` to configure `docker` to
use `gcloud` as a credential helper, then use `docker` as you would for non-GCR
registries, e.g. `docker pull gcr.io/project-id/my-image`. Add
`--verbosity=error` to silence this warning: `gcloud docker
--verbosity=error -- pull gcr.io/project-id/my-image`.

See: https://cloud.google.com/container-registry/docs/support/deprecation-notices#gcloud-docker

The push refers to repository [us.gcr.io/apache-beam-testing/java-postcommit-it/java]
df592ce6c237: Preparing
d7a43d3eb2d5: Preparing
7f07dcbfdee3: Preparing
c9c1d9e61de2: Preparing
c05e7373c39c: Preparing
0e364f88128d: Preparing
315c9857b110: Preparing
6bc9c3a5c15f: Preparing
04569591d3cd: Preparing
91a0c6989c99: Preparing
a6f46edd0088: Preparing
25b2e6cfc187: Preparing
7df6dd475950: Preparing
7496c5e8691b: Preparing
aa7af8a465c6: Preparing
ef9a7b8862f4: Preparing
a1f2f42922b1: Preparing
4762552ad7d8: Preparing
0e364f88128d: Waiting
315c9857b110: Waiting
7496c5e8691b: Waiting
a6f46edd0088: Waiting
6bc9c3a5c15f: Waiting
4762552ad7d8: Waiting
04569591d3cd: Waiting
aa7af8a465c6: Waiting
91a0c6989c99: Waiting
ef9a7b8862f4: Waiting
a1f2f42922b1: Waiting
25b2e6cfc187: Waiting
7df6dd475950: Waiting
df592ce6c237: Pushed
d7a43d3eb2d5: Pushed
c05e7373c39c: Pushed
c9c1d9e61de2: Pushed
6bc9c3a5c15f: Pushed
315c9857b110: Pushed
7f07dcbfdee3: Pushed
25b2e6cfc187: Layer already exists
7df6dd475950: Layer already exists
7496c5e8691b: Layer already exists
aa7af8a465c6: Layer already exists
ef9a7b8862f4: Layer already exists
a1f2f42922b1: Layer already exists
4762552ad7d8: Layer already exists
91a0c6989c99: Pushed
a6f46edd0088: Pushed
0e364f88128d: Pushed
04569591d3cd: Pushed
20210131000105: digest: sha256:7317a41466c67c90b3e7be5c5fe15f3ad96f195fa2fda6346edc3b1a26298d59
size: 4098

> Task :runners:google-cloud-dataflow-java:coreSDKJavaRunnerV2IntegrationTest NO-SOURCE
> Task :sdks:java:io:kafka:kafkaVersion231Test
> Task :runners:google-cloud-dataflow-java:examplesJavaRunnerV2IntegrationTest

> Task :sdks:java:io:google-cloud-platform:integrationTest

43 tests completed, 1 failed, 1 skipped

> Task :sdks:java:io:google-cloud-platform:integrationTest FAILED
> Task :sdks:java:io:google-cloud-platform:integrationTestKms
> Task :sdks:java:io:kafka:kafkaVersion241BatchIT
> Task :sdks:java:io:hadoop-format:runHadoopFormatIO321ElasticIT
> Task :sdks:java:io:kafka:kafkaVersion241Test
> Task :sdks:java:io:kafka:kafkaVersion251BatchIT
> Task :sdks:java:io:hadoop-format:runHadoopFormatIO321IT
> Task :sdks:java:io:kafka:kafkaVersion251Test
> Task :sdks:java:io:hadoop-format:runHadoopFormatIO321Test
> Task :sdks:java:io:kafka:kafkaVersionsCompatibilityTest
> Task :sdks:java:io:hadoop-format:hadoopVersionsTest
> Task :javaHadoopVersionsTest

> Task :runners:google-cloud-dataflow-java:examplesJavaRunnerV2IntegrationTest

***********************************************************
***********************************************************
**********************Set Up Pubsub************************
The Pub/Sub topic has been set up for this example: projects/apache-beam-testing/topics/testpipeline-jenkins-0131001454-76ccda11
The Pub/Sub subscription has been set up for this example: projects/apache-beam-testing/subscriptions/testpipeline-jenkins-0131001454-76ccda11
******************Set Up Big Query Table*******************
The BigQuery table has been set up for this example: apache-beam-testing:traffic_routes_1612052087705.traffic_routes_table
*************************Tear Down*************************
The Pub/Sub topic has been deleted: projects/apache-beam-testing/topics/testpipeline-jenkins-0131001454-76ccda11
The Pub/Sub subscription has been deleted: projects/apache-beam-testing/subscriptions/testpipeline-jenkins-0131001454-76ccda11
The BigQuery table might contain the example's output, and it is not deleted automatically:
apache-beam-testing:traffic_routes_1612052087705.traffic_routes_table
Please go to the Developers Console to delete it manually. Otherwise, you may be charged for
its usage.
***********************************************************
***********************************************************

> Task :sdks:java:extensions:zetasketch:postCommit

> Task :runners:google-cloud-dataflow-java:examplesJavaRunnerV2IntegrationTest

***********************************************************
***********************************************************
**********************Set Up Pubsub************************
The Pub/Sub topic has been set up for this example: projects/apache-beam-testing/topics/testpipeline-jenkins-0131004046-c43586ca
The Pub/Sub subscription has been set up for this example: projects/apache-beam-testing/subscriptions/testpipeline-jenkins-0131004046-c43586ca
******************Set Up Big Query Table*******************
The BigQuery table has been set up for this example: apache-beam-testing:traffic_max_lane_flow_1612053646024.traffic_max_lane_flow_table
*************************Tear Down*************************
The Pub/Sub topic has been deleted: projects/apache-beam-testing/topics/testpipeline-jenkins-0131004046-c43586ca
The Pub/Sub subscription has been deleted: projects/apache-beam-testing/subscriptions/testpipeline-jenkins-0131004046-c43586ca
The BigQuery table might contain the example's output, and it is not deleted automatically:
apache-beam-testing:traffic_max_lane_flow_1612053646024.traffic_max_lane_flow_table
Please go to the Developers Console to delete it manually. Otherwise, you may be charged for
its usage.
***********************************************************
***********************************************************

> Task :runners:google-cloud-dataflow-java:googleCloudPlatformRunnerV2IntegrationTest

> Task :runners:google-cloud-dataflow-java:cleanUpDockerImages
Untagged: us.gcr.io/apache-beam-testing/java-postcommit-it/java:20210131000105
Untagged: us.gcr.io/apache-beam-testing/java-postcommit-it/java@sha256:7317a41466c67c90b3e7be5c5fe15f3ad96f195fa2fda6346edc3b1a26298d59
Deleted: sha256:243e2cd135c973c1ecf5de719dce3f5586d1e3f60b54d15827e75b17d523f8b8
Deleted: sha256:28a5473fae7175d87487e50ac1f92d85ba90b552612a2aa72b038a4dfa09b4c0
Deleted: sha256:0c9a7932d9e0e616090fa05d34b9a7b56aba228bf877986fa29aef08f280e82e
Deleted: sha256:5cea2dab01f73a902fc1cd471c1466e307122a498548677923c11c8adcab6b02
Deleted: sha256:699260abcf595c17eb6bf0891e0deb54a9ba783c41c464f0605d2675dd66e506
Deleted: sha256:29b53c24a2f7eaa29014ffe1fdfd631592e746014cfa164684dda0d1033a390c
Deleted: sha256:fe7fd9def6a6146455f08bb205bc7221a30d95f5bad688a8b6a2e6b27b5783e2
Deleted: sha256:0dcf46d7b27ec46c168bcfe2aecb3a2266806a1d41a14456089a4c799186f415
Deleted: sha256:6247cd692d00313d3e7a0cb2921496a5c81278fcdd56e38d2bf700064883606b
Deleted: sha256:7fd1f0036682b832fb5b0d280f82838427ea4b1fffb4e0561d1ada1ccd7722ae
Deleted: sha256:999634907416dbab7e0b1e52d50b9b6551553738bdd8b0c191cea3b57e1f92bb
Deleted: sha256:7acc0192930dae2113ed124d8ad1414ac0688fefc3d192bc1e5283762acd3c9c
Deleted: sha256:e3491beab8b3a3c161b1fa61d5f3059e3f007c0ee425a02e01f43c0691faeea0
Deleted: sha256:765c2909ed1764a12834b37ebf467548263bae255569ed431c4a700522dc91e9
Deleted: sha256:f10e95d01bf64a34e4a253a2e3c4bc889fd5be75e826f493374abf0a6eab9c53
Digests:
- us.gcr.io/apache-beam-testing/java-postcommit-it/java@sha256:7317a41466c67c90b3e7be5c5fe15f3ad96f195fa2fda6346edc3b1a26298d59
  Associated tags:
 - 20210131000105
Tags:
- us.gcr.io/apache-beam-testing/java-postcommit-it/java:20210131000105
Deleted [us.gcr.io/apache-beam-testing/java-postcommit-it/java:20210131000105].
Deleted [us.gcr.io/apache-beam-testing/java-postcommit-it/java@sha256:7317a41466c67c90b3e7be5c5fe15f3ad96f195fa2fda6346edc3b1a26298d59].

> Task :runners:google-cloud-dataflow-java:postCommitRunnerV2

FAILURE: Build failed with an exception.

* What went wrong:
Execution failed for task ':sdks:java:io:google-cloud-platform:integrationTest'.
> There were failing tests. See the report at: file://<https://ci-beam.apache.org/job/beam_PostCommit_Java/ws/src/sdks/java/io/google-cloud-platform/build/reports/tests/integrationTest/index.html>

* Try:
Run with --stacktrace option to get the stack trace. Run with --info or --debug option to
get more log output. Run with --scan to get full insights.

* Get more help at https://help.gradle.org

Deprecated Gradle features were used in this build, making it incompatible with Gradle 7.0.
Use '--warning-mode all' to show the individual deprecation warnings.
See https://docs.gradle.org/6.8/userguide/command_line_interface.html#sec:command_line_warnings

BUILD FAILED in 1h 46m 23s
248 actionable tasks: 156 executed, 90 from cache, 2 up-to-date
Gradle was unable to watch the file system for changes. The inotify watches limit is too low.

Publishing build scan...
https://gradle.com/s/n4ptbagtwe7pq

Build step 'Invoke Gradle script' changed build result to FAILURE
Build step 'Invoke Gradle script' marked build as failure

---------------------------------------------------------------------
To unsubscribe, e-mail: builds-unsubscribe@beam.apache.org
For additional commands, e-mail: builds-help@beam.apache.org


Mime
View raw message