beam-builds mailing list archives

Site index · List index
Message view « Date » · « Thread »
Top « Date » · « Thread »
From Apache Jenkins Server <jenk...@builds.apache.org>
Subject Build failed in Jenkins: beam_LoadTests_Go_CoGBK_Flink_batch #32
Date Fri, 08 Jan 2021 08:39:34 GMT
See <https://ci-beam.apache.org/job/beam_LoadTests_Go_CoGBK_Flink_batch/32/display/redirect?page=changes>

Changes:

[dcavazos] [BEAM-10983] Add getting started from Spark page

[dcavazos] Add "From Apache Spark" entry to side menu

[dcavazos] Add links to transform catalog

[dcavazos] Add more links

[dcavazos] Add RDD/DataFrame clarification

[dcavazos] Add link to from-spark page

[dcavazos] Added extra explanations

[dcavazos] Fixed typos + removed italics

[Kyle Weaver] [BEAM-11504] Clean up direct runner parallelism section.

[alxavier] [BEAM-11543] Increase Spanner streaming read timeout to 2 hours

[Robert Bradshaw] [BEAM-1833] Give transforms more control over the names of their inputs

[Ismaël Mejía] [BEAM-11419] Update Flink supported versions in the website

[noreply] [BEAM-11415] Adds documentation to integration package. (#13683)

[noreply] [BEAM-11580] Add disk_size_gb flag for Go SDK. (#13693)

[noreply] Clarify some assertions (#13515)

[Robert Bradshaw] mypy

[noreply] Revert "[BEAM-11474] Track transform processing thread in Java SDK

[noreply] Correct the license in website package.json file

[noreply] [BEAM-11582] Merge website/.gitignore into .gitignore (#13697)


------------------------------------------
[...truncated 55.58 KB...]
  >
  coders: <
    key: "c4"
    value: <
      spec: <
        urn: "beam:coder:length_prefix:v1"
      >
      component_coder_ids: "c3"
    >
  >
  coders: <
    key: "c5"
    value: <
      spec: <
        urn: "beam:coder:kv:v1"
      >
      component_coder_ids: "c4"
      component_coder_ids: "c0"
    >
  >
  coders: <
    key: "c6"
    value: <
      spec: <
        urn: "beam:coder:kv:v1"
      >
      component_coder_ids: "c0"
      component_coder_ids: "c5"
    >
  >
  coders: <
    key: "c7"
    value: <
      spec: <
        urn: "beam:coder:iterable:v1"
      >
      component_coder_ids: "c5"
    >
  >
  coders: <
    key: "c8"
    value: <
      spec: <
        urn: "beam:coder:kv:v1"
      >
      component_coder_ids: "c0"
      component_coder_ids: "c7"
    >
  >
  coders: <
    key: "c9"
    value: <
      spec: <
        urn: "beam:go:coder:cogbklist:v1"
      >
      component_coder_ids: "c0"
      component_coder_ids: "c0"
    >
  >
  environments: <
    key: "go"
    value: <
      urn: "beam:env:docker:v1"
      payload: "\n>gcr.io/apache-beam-testing/beam_portability/beam_go_sdk:latest"
      capabilities: "beam:protocol:progress_reporting:v0"
      capabilities: "beam:protocol:multi_core_bundle_processing:v1"
      capabilities: "beam:version:sdk_base:go"
      capabilities: "beam:coder:bytes:v1"
      capabilities: "beam:coder:bool:v1"
      capabilities: "beam:coder:varint:v1"
      capabilities: "beam:coder:double:v1"
      capabilities: "beam:coder:string_utf8:v1"
      capabilities: "beam:coder:length_prefix:v1"
      capabilities: "beam:coder:kv:v1"
      capabilities: "beam:coder:iterable:v1"
      capabilities: "beam:coder:state_backed_iterable:v1"
      capabilities: "beam:coder:windowed_value:v1"
      capabilities: "beam:coder:global_window:v1"
      capabilities: "beam:coder:interval_window:v1"
      dependencies: <
        type_urn: "beam:artifact:type:go_****_binary:v1"
        role_urn: "beam:artifact:role:staging_to:v1"
        role_payload: "\n\006****"
      >
    >
  >
>
root_transform_ids: "s2"
root_transform_ids: "s1"
root_transform_ids: "e4"
root_transform_ids: "e8"
root_transform_ids: "e9_cogbk"
root_transform_ids: "e10"
root_transform_ids: "e11"
requirements: "beam:requirement:pardo:splittable_dofn:v1"
2021/01/08 08:33:55 Prepared job with id: load-tests-go-flink-batch-cogbk-2-0108065550_acffa7b6-08b7-46f4-a14c-5d71a89ff4da
and staging token: load-tests-go-flink-batch-cogbk-2-0108065550_acffa7b6-08b7-46f4-a14c-5d71a89ff4da
2021/01/08 08:33:55 Using specified **** binary: 'linux_amd64/cogbk'
2021/01/08 08:33:58 Staged binary artifact with token: 
2021/01/08 08:33:59 Submitted job: load0tests0go0flink0batch0cogbk0200108065550-root-0108083358-12964427_df0d3f37-df39-4a90-b2b2-ce89222275de
2021/01/08 08:33:59 Job state: STOPPED
2021/01/08 08:33:59 Job state: STARTING
2021/01/08 08:33:59 Job state: RUNNING
2021/01/08 08:39:31  (): java.util.concurrent.ExecutionException: org.apache.flink.client.program.ProgramInvocationException:
Job failed (JobID: fd8a94db05c280be4f9504ac40c18d99)
	at java.util.concurrent.CompletableFuture.reportGet(CompletableFuture.java:357)
	at java.util.concurrent.CompletableFuture.get(CompletableFuture.java:1908)
	at org.apache.flink.api.java.ExecutionEnvironment.execute(ExecutionEnvironment.java:864)
	at org.apache.beam.runners.flink.FlinkBatchPortablePipelineTranslator$BatchTranslationContext.execute(FlinkBatchPortablePipelineTranslator.java:199)
	at org.apache.beam.runners.flink.FlinkPipelineRunner.runPipelineWithTranslator(FlinkPipelineRunner.java:118)
	at org.apache.beam.runners.flink.FlinkPipelineRunner.run(FlinkPipelineRunner.java:85)
	at org.apache.beam.runners.jobsubmission.JobInvocation.runPipeline(JobInvocation.java:86)
	at org.apache.beam.vendor.guava.v26_0_jre.com.google.common.util.concurrent.TrustedListenableFutureTask$TrustedFutureInterruptibleTask.runInterruptibly(TrustedListenableFutureTask.java:125)
	at org.apache.beam.vendor.guava.v26_0_jre.com.google.common.util.concurrent.InterruptibleTask.run(InterruptibleTask.java:57)
	at org.apache.beam.vendor.guava.v26_0_jre.com.google.common.util.concurrent.TrustedListenableFutureTask.run(TrustedListenableFutureTask.java:78)
	at java.util.concurrent.ThreadPoolExecutor.runWorker(ThreadPoolExecutor.java:1149)
	at java.util.concurrent.ThreadPoolExecutor$Worker.run(ThreadPoolExecutor.java:624)
	at java.lang.Thread.run(Thread.java:748)
Caused by: org.apache.flink.client.program.ProgramInvocationException: Job failed (JobID:
fd8a94db05c280be4f9504ac40c18d99)
	at org.apache.flink.client.deployment.ClusterClientJobClientAdapter.lambda$null$6(ClusterClientJobClientAdapter.java:112)
	at java.util.concurrent.CompletableFuture.uniApply(CompletableFuture.java:616)
	at java.util.concurrent.CompletableFuture$UniApply.tryFire(CompletableFuture.java:591)
	at java.util.concurrent.CompletableFuture.postComplete(CompletableFuture.java:488)
	at java.util.concurrent.CompletableFuture.complete(CompletableFuture.java:1975)
	at org.apache.flink.client.program.rest.RestClusterClient.lambda$pollResourceAsync$21(RestClusterClient.java:565)
	at java.util.concurrent.CompletableFuture.uniWhenComplete(CompletableFuture.java:774)
	at java.util.concurrent.CompletableFuture$UniWhenComplete.tryFire(CompletableFuture.java:750)
	at java.util.concurrent.CompletableFuture.postComplete(CompletableFuture.java:488)
	at java.util.concurrent.CompletableFuture.complete(CompletableFuture.java:1975)
	at org.apache.flink.runtime.concurrent.FutureUtils.lambda$retryOperationWithDelay$8(FutureUtils.java:291)
	at java.util.concurrent.CompletableFuture.uniWhenComplete(CompletableFuture.java:774)
	at java.util.concurrent.CompletableFuture$UniWhenComplete.tryFire(CompletableFuture.java:750)
	at java.util.concurrent.CompletableFuture.postComplete(CompletableFuture.java:488)
	at java.util.concurrent.CompletableFuture.postFire(CompletableFuture.java:575)
	at java.util.concurrent.CompletableFuture$UniCompose.tryFire(CompletableFuture.java:943)
	at java.util.concurrent.CompletableFuture$Completion.run(CompletableFuture.java:456)
	... 3 more
Caused by: org.apache.flink.runtime.client.JobExecutionException: Job execution failed.
	at org.apache.flink.runtime.jobmaster.JobResult.toJobExecutionResult(JobResult.java:147)
	at org.apache.flink.client.deployment.ClusterClientJobClientAdapter.lambda$null$6(ClusterClientJobClientAdapter.java:110)
	... 19 more
Caused by: org.apache.flink.runtime.JobException: Recovery is suppressed by NoRestartBackoffTimeStrategy
	at org.apache.flink.runtime.executiongraph.failover.flip1.ExecutionFailureHandler.handleFailure(ExecutionFailureHandler.java:110)
	at org.apache.flink.runtime.executiongraph.failover.flip1.ExecutionFailureHandler.getFailureHandlingResult(ExecutionFailureHandler.java:76)
	at org.apache.flink.runtime.scheduler.DefaultScheduler.handleTaskFailure(DefaultScheduler.java:192)
	at org.apache.flink.runtime.scheduler.DefaultScheduler.maybeHandleTaskFailure(DefaultScheduler.java:186)
	at org.apache.flink.runtime.scheduler.DefaultScheduler.updateTaskExecutionStateInternal(DefaultScheduler.java:180)
	at org.apache.flink.runtime.scheduler.SchedulerBase.updateTaskExecutionState(SchedulerBase.java:496)
	at org.apache.flink.runtime.scheduler.UpdateSchedulerNgOnInternalFailuresListener.notifyTaskFailure(UpdateSchedulerNgOnInternalFailuresListener.java:49)
	at org.apache.flink.runtime.executiongraph.ExecutionGraph.notifySchedulerNgAboutInternalTaskFailure(ExecutionGraph.java:1703)
	at org.apache.flink.runtime.executiongraph.Execution.processFail(Execution.java:1252)
	at org.apache.flink.runtime.executiongraph.Execution.processFail(Execution.java:1220)
	at org.apache.flink.runtime.executiongraph.Execution.markFailed(Execution.java:1051)
	at org.apache.flink.runtime.executiongraph.ExecutionVertex.markFailed(ExecutionVertex.java:748)
	at org.apache.flink.runtime.scheduler.DefaultExecutionVertexOperations.markFailed(DefaultExecutionVertexOperations.java:41)
	at org.apache.flink.runtime.scheduler.DefaultScheduler.handleTaskDeploymentFailure(DefaultScheduler.java:446)
	at org.apache.flink.runtime.scheduler.DefaultScheduler.lambda$assignResourceOrHandleError$5(DefaultScheduler.java:433)
	at java.util.concurrent.CompletableFuture.uniHandle(CompletableFuture.java:836)
	at java.util.concurrent.CompletableFuture$UniHandle.tryFire(CompletableFuture.java:811)
	at java.util.concurrent.CompletableFuture.postComplete(CompletableFuture.java:488)
	at java.util.concurrent.CompletableFuture.completeExceptionally(CompletableFuture.java:1990)
	at org.apache.flink.runtime.jobmaster.slotpool.SchedulerImpl.lambda$internalAllocateSlot$0(SchedulerImpl.java:168)
	at java.util.concurrent.CompletableFuture.uniWhenComplete(CompletableFuture.java:774)
	at java.util.concurrent.CompletableFuture$UniWhenComplete.tryFire(CompletableFuture.java:750)
	at java.util.concurrent.CompletableFuture.postComplete(CompletableFuture.java:488)
	at java.util.concurrent.CompletableFuture.completeExceptionally(CompletableFuture.java:1990)
	at org.apache.flink.runtime.jobmaster.slotpool.SlotSharingManager$SingleTaskSlot.release(SlotSharingManager.java:726)
	at org.apache.flink.runtime.jobmaster.slotpool.SlotSharingManager$MultiTaskSlot.release(SlotSharingManager.java:537)
	at org.apache.flink.runtime.jobmaster.slotpool.SlotSharingManager$MultiTaskSlot.lambda$new$0(SlotSharingManager.java:432)
	at java.util.concurrent.CompletableFuture.uniHandle(CompletableFuture.java:836)
	at java.util.concurrent.CompletableFuture$UniHandle.tryFire(CompletableFuture.java:811)
	at java.util.concurrent.CompletableFuture.postComplete(CompletableFuture.java:488)
	at java.util.concurrent.CompletableFuture.completeExceptionally(CompletableFuture.java:1990)
	at org.apache.flink.runtime.concurrent.FutureUtils.lambda$forward$21(FutureUtils.java:1065)
	at java.util.concurrent.CompletableFuture.uniWhenComplete(CompletableFuture.java:774)
	at java.util.concurrent.CompletableFuture$UniWhenComplete.tryFire(CompletableFuture.java:750)
	at java.util.concurrent.CompletableFuture.postComplete(CompletableFuture.java:488)
	at java.util.concurrent.CompletableFuture.completeExceptionally(CompletableFuture.java:1990)
	at org.apache.flink.runtime.concurrent.FutureUtils$Timeout.run(FutureUtils.java:999)
	at org.apache.flink.runtime.rpc.akka.AkkaRpcActor.handleRunAsync(AkkaRpcActor.java:402)
	at org.apache.flink.runtime.rpc.akka.AkkaRpcActor.handleRpcMessage(AkkaRpcActor.java:195)
	at org.apache.flink.runtime.rpc.akka.FencedAkkaRpcActor.handleRpcMessage(FencedAkkaRpcActor.java:74)
	at org.apache.flink.runtime.rpc.akka.AkkaRpcActor.handleMessage(AkkaRpcActor.java:152)
	at akka.japi.pf.UnitCaseStatement.apply(CaseStatements.scala:26)
	at akka.japi.pf.UnitCaseStatement.apply(CaseStatements.scala:21)
	at scala.PartialFunction$class.applyOrElse(PartialFunction.scala:123)
	at akka.japi.pf.UnitCaseStatement.applyOrElse(CaseStatements.scala:21)
	at scala.PartialFunction$OrElse.applyOrElse(PartialFunction.scala:170)
	at scala.PartialFunction$OrElse.applyOrElse(PartialFunction.scala:171)
	at scala.PartialFunction$OrElse.applyOrElse(PartialFunction.scala:171)
	at akka.actor.Actor$class.aroundReceive(Actor.scala:517)
	at akka.actor.AbstractActor.aroundReceive(AbstractActor.scala:225)
	at akka.actor.ActorCell.receiveMessage(ActorCell.scala:592)
	at akka.actor.ActorCell.invoke(ActorCell.scala:561)
	at akka.dispatch.Mailbox.processMailbox(Mailbox.scala:258)
	at akka.dispatch.Mailbox.run(Mailbox.scala:225)
	at akka.dispatch.Mailbox.exec(Mailbox.scala:235)
	at akka.dispatch.forkjoin.ForkJoinTask.doExec(ForkJoinTask.java:260)
	at akka.dispatch.forkjoin.ForkJoinPool$WorkQueue.runTask(ForkJoinPool.java:1339)
	at akka.dispatch.forkjoin.ForkJoinPool.runWorker(ForkJoinPool.java:1979)
	at akka.dispatch.forkjoin.ForkJoinWorkerThread.run(ForkJoinWorkerThread.java:107)
Caused by: org.apache.flink.runtime.jobmanager.scheduler.NoResourceAvailableException: Could
not allocate the required slot within slot request timeout. Please make sure that the cluster
has enough resources.
	at org.apache.flink.runtime.scheduler.DefaultScheduler.maybeWrapWithNoResourceAvailableException(DefaultScheduler.java:452)
	... 45 more
Caused by: java.util.concurrent.CompletionException: java.util.concurrent.TimeoutException
	at java.util.concurrent.CompletableFuture.encodeThrowable(CompletableFuture.java:292)
	at java.util.concurrent.CompletableFuture.completeThrowable(CompletableFuture.java:308)
	at java.util.concurrent.CompletableFuture.uniApply(CompletableFuture.java:607)
	at java.util.concurrent.CompletableFuture$UniApply.tryFire(CompletableFuture.java:591)
	... 25 more
Caused by: java.util.concurrent.TimeoutException
	... 23 more
2021/01/08 08:39:31  (): java.util.concurrent.TimeoutException
2021/01/08 08:39:32 Job state: FAILED
2021/01/08 08:39:32 Failed to execute job: job load0tests0go0flink0batch0cogbk0200108065550-root-0108083358-12964427_df0d3f37-df39-4a90-b2b2-ce89222275de
failed
panic: Failed to execute job: job load0tests0go0flink0batch0cogbk0200108065550-root-0108083358-12964427_df0d3f37-df39-4a90-b2b2-ce89222275de
failed

goroutine 1 [running]:
github.com/apache/beam/sdks/go/test/load/vendor/github.com/apache/beam/sdks/go/pkg/beam/log.Fatalf(0x1191d40,
0xc00003e0b0, 0x105169c, 0x19, 0xc00020dee8, 0x1, 0x1)
	<https://ci-beam.apache.org/job/beam_LoadTests_Go_CoGBK_Flink_batch/ws/src/sdks/go/test/load/.gogradle/project_gopath/src/github.com/apache/beam/sdks/go/test/load/vendor/github.com/apache/beam/sdks/go/pkg/beam/log/log.go>:153
+0xec
main.main()
	<https://ci-beam.apache.org/job/beam_LoadTests_Go_CoGBK_Flink_batch/ws/src/sdks/go/test/load/.gogradle/project_gopath/src/github.com/apache/beam/sdks/go/test/load/cogbk/cogbk.go>:99
+0x577

> Task :sdks:go:test:load:run FAILED

FAILURE: Build failed with an exception.

* Where:
Build file '<https://ci-beam.apache.org/job/beam_LoadTests_Go_CoGBK_Flink_batch/ws/src/sdks/go/test/load/build.gradle'>
line: 65

* What went wrong:
Execution failed for task ':sdks:go:test:load:run'.
> Process 'command 'sh'' finished with non-zero exit value 2

* Try:
Run with --stacktrace option to get the stack trace. Run with --info or --debug option to
get more log output. Run with --scan to get full insights.

* Get more help at https://help.gradle.org

Deprecated Gradle features were used in this build, making it incompatible with Gradle 7.0.
Use '--warning-mode all' to show the individual deprecation warnings.
See https://docs.gradle.org/6.7.1/userguide/command_line_interface.html#sec:command_line_warnings

BUILD FAILED in 9m 19s
6 actionable tasks: 6 executed

Publishing build scan...
https://gradle.com/s/4gmrvqkjykvmg

Build step 'Invoke Gradle script' changed build result to FAILURE
Build step 'Invoke Gradle script' marked build as failure

---------------------------------------------------------------------
To unsubscribe, e-mail: builds-unsubscribe@beam.apache.org
For additional commands, e-mail: builds-help@beam.apache.org


Mime
View raw message