beam-builds mailing list archives

Site index · List index
Message view « Date » · « Thread »
Top « Date » · « Thread »
From Apache Jenkins Server <jenk...@builds.apache.org>
Subject Build failed in Jenkins: beam_PostCommit_Java_Examples_Dataflow_V2_java11 #152
Date Fri, 01 Jan 2021 01:17:57 GMT
See <https://ci-beam.apache.org/job/beam_PostCommit_Java_Examples_Dataflow_V2_java11/152/display/redirect>

Changes:


------------------------------------------
[...truncated 37.71 KB...]
Resolving cached github.com/etcd-io/etcd: commit='11214aa33bf5a47d3d9d8dafe0f6b97237dfe921',
urls=[https://github.com/etcd-io/etcd.git, git@github.com:etcd-io/etcd.git]
Resolving cached github.com/etcd-io/etcd: commit='11214aa33bf5a47d3d9d8dafe0f6b97237dfe921',
urls=[https://github.com/etcd-io/etcd.git, git@github.com:etcd-io/etcd.git]
Resolving github.com/prometheus/procfs: commit='cb4147076ac75738c9a7d279075a253c0cc5acbd',
urls=[https://github.com/prometheus/procfs.git, git@github.com:prometheus/procfs.git]
Resolving github.com/rcrowley/go-metrics: commit='8732c616f52954686704c8645fe1a9d59e9df7c1',
urls=[https://github.com/rcrowley/go-metrics.git, git@github.com:rcrowley/go-metrics.git]
Resolving github.com/cpuguy83/go-md2man: commit='dc9f53734905c233adfc09fd4f063dce63ce3daf',
urls=[https://github.com/cpuguy83/go-md2man.git, git@github.com:cpuguy83/go-md2man.git]
Resolving cached github.com/cpuguy83/go-md2man: commit='dc9f53734905c233adfc09fd4f063dce63ce3daf',
urls=[https://github.com/cpuguy83/go-md2man.git, git@github.com:cpuguy83/go-md2man.git]
Resolving cached github.com/etcd-io/etcd: commit='11214aa33bf5a47d3d9d8dafe0f6b97237dfe921',
urls=[https://github.com/etcd-io/etcd.git, git@github.com:etcd-io/etcd.git]
Resolving cached github.com/etcd-io/etcd: commit='11214aa33bf5a47d3d9d8dafe0f6b97237dfe921',
urls=[https://github.com/etcd-io/etcd.git, git@github.com:etcd-io/etcd.git]
Resolving github.com/spf13/afero: commit='bb8f1927f2a9d3ab41c9340aa034f6b803f4359c', urls=[https://github.com/spf13/afero.git,
git@github.com:spf13/afero.git]
Resolving github.com/spf13/cast: commit='acbeb36b902d72a7a4c18e8f3241075e7ab763e4', urls=[https://github.com/spf13/cast.git,
git@github.com:spf13/cast.git]
Resolving github.com/spf13/cobra: commit='93959269ad99e80983c9ba742a7e01203a4c0e4f', urls=[https://github.com/spf13/cobra.git,
git@github.com:spf13/cobra.git]
Resolving github.com/spf13/jwalterweatherman: commit='7c0cea34c8ece3fbeb2b27ab9b59511d360fb394',
urls=[https://github.com/spf13/jwalterweatherman.git, git@github.com:spf13/jwalterweatherman.git]
Resolving cached github.com/etcd-io/etcd: commit='11214aa33bf5a47d3d9d8dafe0f6b97237dfe921',
urls=[https://github.com/etcd-io/etcd.git, git@github.com:etcd-io/etcd.git]
Resolving github.com/spf13/viper: commit='aafc9e6bc7b7bb53ddaa75a5ef49a17d6e654be5', urls=[https://github.com/spf13/viper.git,
git@github.com:spf13/viper.git]
Resolving github.com/stathat/go: commit='74669b9f388d9d788c97399a0824adbfee78400e', urls=[https://github.com/stathat/go.git,
git@github.com:stathat/go.git]
Resolving cached github.com/etcd-io/etcd: commit='11214aa33bf5a47d3d9d8dafe0f6b97237dfe921',
urls=[https://github.com/etcd-io/etcd.git, git@github.com:etcd-io/etcd.git]
Resolving cached github.com/etcd-io/etcd: commit='11214aa33bf5a47d3d9d8dafe0f6b97237dfe921',
urls=[https://github.com/etcd-io/etcd.git, git@github.com:etcd-io/etcd.git]
Resolving cached github.com/etcd-io/etcd: commit='11214aa33bf5a47d3d9d8dafe0f6b97237dfe921',
urls=[https://github.com/etcd-io/etcd.git, git@github.com:etcd-io/etcd.git]
Resolving cached github.com/etcd-io/etcd: commit='11214aa33bf5a47d3d9d8dafe0f6b97237dfe921',
urls=[https://github.com/etcd-io/etcd.git, git@github.com:etcd-io/etcd.git]
Resolving github.com/xordataexchange/crypt: commit='b2862e3d0a775f18c7cfe02273500ae307b61218',
urls=[https://github.com/xordataexchange/crypt.git, git@github.com:xordataexchange/crypt.git]
Resolving go.opencensus.io: commit='3fb168f674736c026e623310bfccb0691e6dec8a', urls=[https://github.com/census-instrumentation/opencensus-go]
Resolving golang.org/x/crypto: commit='d9133f5469342136e669e85192a26056b587f503', urls=[https://go.googlesource.com/crypto]
Resolving golang.org/x/debug: commit='95515998a8a4bd7448134b2cb5971dbeb12e0b77', urls=[https://go.googlesource.com/debug]

> Task :runners:java-fn-execution:compileJava FROM-CACHE
> Task :runners:java-fn-execution:classes UP-TO-DATE

> Task :sdks:java:container:pullLicenses
DEPRECATION: Python 3.5 reached the end of its life on September 13th, 2020. Please upgrade
your Python as Python 3.5 is no longer maintained. pip 21.0 will drop support for Python 3.5
in January 2021. pip 21.0 will remove support for this functionality.
INFO:root:Pulling license for 205 dependencies using 16 threads.

> Task :runners:java-fn-execution:jar
> Task :sdks:java:expansion-service:compileJava FROM-CACHE
> Task :sdks:java:expansion-service:classes UP-TO-DATE
> Task :sdks:java:expansion-service:jar
> Task :runners:direct-java:compileJava FROM-CACHE
> Task :sdks:java:extensions:ml:compileJava FROM-CACHE
> Task :sdks:java:extensions:ml:classes UP-TO-DATE
> Task :sdks:java:io:kafka:compileJava FROM-CACHE
> Task :sdks:java:io:kafka:classes UP-TO-DATE
> Task :sdks:java:extensions:ml:jar
> Task :runners:direct-java:classes UP-TO-DATE
> Task :sdks:java:io:kafka:jar

> Task :sdks:go:resolveBuildDependencies
Resolving golang.org/x/net: commit='2fb46b16b8dda405028c50f7c7f0f9dd1fa6bfb1', urls=[https://go.googlesource.com/net]

> Task :runners:direct-java:shadowJar FROM-CACHE
> Task :sdks:java:io:google-cloud-platform:compileJava FROM-CACHE
> Task :sdks:java:io:google-cloud-platform:classes UP-TO-DATE
> Task :sdks:java:io:google-cloud-platform:jar
> Task :runners:google-cloud-dataflow-java:compileJava FROM-CACHE
> Task :runners:google-cloud-dataflow-java:classes
> Task :runners:google-cloud-dataflow-java:jar

> Task :sdks:java:container:pullLicenses
INFO:root:pull_licenses_java.py succeed. It took 3.344292 seconds with 16 threads.

> Task :examples:java:compileJava FROM-CACHE
> Task :examples:java:classes UP-TO-DATE
> Task :sdks:java:container:java11:copyDockerfileDependencies
> Task :examples:java:jar
> Task :examples:java:compileTestJava FROM-CACHE
> Task :examples:java:testClasses
> Task :examples:java:testJar

> Task :sdks:go:resolveBuildDependencies
Resolving golang.org/x/oauth2: commit='5d25da1a8d43b66f2898c444f899c7bcfd6a407e', urls=[https://go.googlesource.com/oauth2]
Resolving golang.org/x/sync: commit='fd80eb99c8f653c847d294a001bdf2a3a6f768f5', urls=[https://go.googlesource.com/sync]

> Task :sdks:java:container:java11:copyPulledLicenses

> Task :sdks:go:resolveBuildDependencies
Resolving golang.org/x/sys: commit='fde4db37ae7ad8191b03d30d27f258b5291ae4e3', urls=[https://go.googlesource.com/sys]
Resolving golang.org/x/text: commit='23ae387dee1f90d29a23c0e87ee0b46038fbed0e', urls=[https://go.googlesource.com/text]
Resolving cached github.com/etcd-io/etcd: commit='11214aa33bf5a47d3d9d8dafe0f6b97237dfe921',
urls=[https://github.com/etcd-io/etcd.git, git@github.com:etcd-io/etcd.git]

> Task :release:go-licenses:java:dockerRun
+ go-licenses save github.com/apache/beam/sdks/java/container --save_path=/output/licenses
+ go-licenses csv github.com/apache/beam/sdks/java/container
+ tee /output/licenses/list.csv
+ chmod -R a+w /output/licenses

> Task :release:go-licenses:java:createLicenses
> Task :sdks:java:container:java11:copyGolangLicenses

> Task :sdks:go:resolveBuildDependencies
Resolving google.golang.org/api: commit='0324d5e90dc7753607860272666845fad9ceb97e', urls=[https://code.googlesource.com/google-api-go-client]
Resolving google.golang.org/genproto: commit='4d944d34d83c502a5f761500a14d8842648415c3', urls=[https://github.com/google/go-genproto]
Resolving google.golang.org/grpc: commit='5e8f83304c0563d1ba74db05fee83d9c18ab9a58', urls=[https://github.com/grpc/grpc-go]
Resolving google.golang.org/protobuf: commit='d165be301fb1e13390ad453281ded24385fd8ebc', urls=[https://go.googlesource.com/protobuf]
Resolving cached github.com/etcd-io/etcd: commit='11214aa33bf5a47d3d9d8dafe0f6b97237dfe921',
urls=[https://github.com/etcd-io/etcd.git, git@github.com:etcd-io/etcd.git]
Resolving cached github.com/etcd-io/etcd: commit='11214aa33bf5a47d3d9d8dafe0f6b97237dfe921',
urls=[https://github.com/etcd-io/etcd.git, git@github.com:etcd-io/etcd.git]

> Task :sdks:go:installDependencies
> Task :sdks:go:buildLinuxAmd64
> Task :sdks:go:goBuild

> Task :sdks:java:container:resolveBuildDependencies
Resolving ./github.com/apache/beam/sdks/go@<https://ci-beam.apache.org/job/beam_PostCommit_Java_Examples_Dataflow_V2_java11/ws/src/sdks/go>

> Task :sdks:java:container:installDependencies

> Task :sdks:java:container:buildLinuxAmd64
Unable to watch the file system for changes. The inotify watches limit is too low.

> Task :sdks:java:container:goBuild
> Task :sdks:java:container:java11:copySdkHarnessLauncher
> Task :sdks:java:container:java11:dockerPrepare
> Task :sdks:java:container:java11:docker

> Task :runners:google-cloud-dataflow-java:buildAndPushDockerContainer
WARNING: `gcloud docker` will not be supported for Docker client versions above 18.03.

As an alternative, use `gcloud auth configure-docker` to configure `docker` to
use `gcloud` as a credential helper, then use `docker` as you would for non-GCR
registries, e.g. `docker pull gcr.io/project-id/my-image`. Add
`--verbosity=error` to silence this warning: `gcloud docker
--verbosity=error -- pull gcr.io/project-id/my-image`.

See: https://cloud.google.com/container-registry/docs/support/deprecation-notices#gcloud-docker

The push refers to repository [us.gcr.io/apache-beam-testing/java-postcommit-it/java]
483c4e9bf721: Preparing
aa1716780f9d: Preparing
78f813f70b61: Preparing
8a7c86d65384: Preparing
7ae7c3adf71d: Preparing
68df49944a88: Preparing
c936cdf40c96: Preparing
fe30fa9be499: Preparing
fca4def025c4: Preparing
ff8fd266ec74: Preparing
e22963d87dfb: Preparing
998e4e1e3864: Preparing
fb6f398853f5: Preparing
e528f2c31deb: Preparing
c5f4367d4a59: Preparing
ceecb62b2fcc: Preparing
193bc1d68b80: Preparing
f0e10b20de19: Preparing
e22963d87dfb: Waiting
998e4e1e3864: Waiting
fb6f398853f5: Waiting
e528f2c31deb: Waiting
c5f4367d4a59: Waiting
ceecb62b2fcc: Waiting
f0e10b20de19: Waiting
fe30fa9be499: Waiting
fca4def025c4: Waiting
68df49944a88: Waiting
c936cdf40c96: Waiting
ff8fd266ec74: Waiting
193bc1d68b80: Waiting
483c4e9bf721: Pushed
aa1716780f9d: Pushed
8a7c86d65384: Pushed
7ae7c3adf71d: Pushed
fe30fa9be499: Pushed
c936cdf40c96: Pushed
78f813f70b61: Pushed
998e4e1e3864: Layer already exists
fb6f398853f5: Layer already exists
e528f2c31deb: Layer already exists
c5f4367d4a59: Layer already exists
ceecb62b2fcc: Layer already exists
193bc1d68b80: Layer already exists
f0e10b20de19: Layer already exists
ff8fd266ec74: Pushed
e22963d87dfb: Pushed
68df49944a88: Pushed
fca4def025c4: Pushed
20210101000051: digest: sha256:debc59197966b1648e0a724865197b77b1d39b333b3bdbe605d9e7b34f8aa1a0
size: 4098

> Task :runners:google-cloud-dataflow-java:examplesJavaRunnerV2IntegrationTest

***********************************************************
***********************************************************
**********************Set Up Pubsub************************
The Pub/Sub topic has been set up for this example: projects/apache-beam-testing/topics/testpipeline-jenkins-0101000727-995313df
The Pub/Sub subscription has been set up for this example: projects/apache-beam-testing/subscriptions/testpipeline-jenkins-0101000727-995313df
******************Set Up Big Query Table*******************
The BigQuery table has been set up for this example: apache-beam-testing:traffic_routes_1609459642385.traffic_routes_table
*************************Tear Down*************************
The Pub/Sub topic has been deleted: projects/apache-beam-testing/topics/testpipeline-jenkins-0101000727-995313df
The Pub/Sub subscription has been deleted: projects/apache-beam-testing/subscriptions/testpipeline-jenkins-0101000727-995313df
The BigQuery table might contain the example's output, and it is not deleted automatically:
apache-beam-testing:traffic_routes_1609459642385.traffic_routes_table
Please go to the Developers Console to delete it manually. Otherwise, you may be charged for
its usage.
***********************************************************
***********************************************************

***********************************************************
***********************************************************
**********************Set Up Pubsub************************
The Pub/Sub topic has been set up for this example: projects/apache-beam-testing/topics/testpipeline-jenkins-0101003302-9a64d978
The Pub/Sub subscription has been set up for this example: projects/apache-beam-testing/subscriptions/testpipeline-jenkins-0101003302-9a64d978
******************Set Up Big Query Table*******************
The BigQuery table has been set up for this example: apache-beam-testing:traffic_max_lane_flow_1609461181599.traffic_max_lane_flow_table
*************************Tear Down*************************
The Pub/Sub topic has been deleted: projects/apache-beam-testing/topics/testpipeline-jenkins-0101003302-9a64d978
The Pub/Sub subscription has been deleted: projects/apache-beam-testing/subscriptions/testpipeline-jenkins-0101003302-9a64d978
The BigQuery table might contain the example's output, and it is not deleted automatically:
apache-beam-testing:traffic_max_lane_flow_1609461181599.traffic_max_lane_flow_table
Please go to the Developers Console to delete it manually. Otherwise, you may be charged for
its usage.
***********************************************************
***********************************************************

org.apache.beam.examples.snippets.transforms.io.gcp.bigquery.BigQuerySamplesIT > testTableIO
FAILED
    java.lang.RuntimeException at BigQuerySamplesIT.java:121

8 tests completed, 1 failed

> Task :runners:google-cloud-dataflow-java:examplesJavaRunnerV2IntegrationTest FAILED

> Task :runners:google-cloud-dataflow-java:cleanUpDockerImages
Untagged: us.gcr.io/apache-beam-testing/java-postcommit-it/java:20210101000051
Untagged: us.gcr.io/apache-beam-testing/java-postcommit-it/java@sha256:debc59197966b1648e0a724865197b77b1d39b333b3bdbe605d9e7b34f8aa1a0
Digests:
- us.gcr.io/apache-beam-testing/java-postcommit-it/java@sha256:0703ea34fb179f9ab12fc9c9682a170915f47176b635592a00803fb7b1b4bd6c
  Associated tags:
 - 20210101000051
Tags:
- us.gcr.io/apache-beam-testing/java-postcommit-it/java:20210101000051
Deleted [us.gcr.io/apache-beam-testing/java-postcommit-it/java:20210101000051].
Deleted [us.gcr.io/apache-beam-testing/java-postcommit-it/java@sha256:0703ea34fb179f9ab12fc9c9682a170915f47176b635592a00803fb7b1b4bd6c].

FAILURE: Build failed with an exception.

* What went wrong:
Execution failed for task ':runners:google-cloud-dataflow-java:examplesJavaRunnerV2IntegrationTest'.
> There were failing tests. See the report at: file://<https://ci-beam.apache.org/job/beam_PostCommit_Java_Examples_Dataflow_V2_java11/ws/src/runners/google-cloud-dataflow-java/build/reports/tests/examplesJavaRunnerV2IntegrationTest/index.html>

* Try:
Run with --stacktrace option to get the stack trace. Run with --info or --debug option to
get more log output. Run with --scan to get full insights.

* Get more help at https://help.gradle.org

Deprecated Gradle features were used in this build, making it incompatible with Gradle 7.0.
Use '--warning-mode all' to show the individual deprecation warnings.
See https://docs.gradle.org/6.7.1/userguide/command_line_interface.html#sec:command_line_warnings

BUILD FAILED in 1h 17m 31s
90 actionable tasks: 57 executed, 31 from cache, 2 up-to-date
Gradle was unable to watch the file system for changes. The inotify watches limit is too low.

Publishing build scan...
https://gradle.com/s/aabwz3wztsoue

Build step 'Invoke Gradle script' changed build result to FAILURE
Build step 'Invoke Gradle script' marked build as failure

---------------------------------------------------------------------
To unsubscribe, e-mail: builds-unsubscribe@beam.apache.org
For additional commands, e-mail: builds-help@beam.apache.org


Mime
View raw message