beam-builds mailing list archives

Site index · List index
Message view « Date » · « Thread »
Top « Date » · « Thread »
From Apache Jenkins Server <jenk...@builds.apache.org>
Subject Build failed in Jenkins: beam_PostCommit_Py_VR_Dataflow_V2 #1562
Date Fri, 22 Jan 2021 01:26:04 GMT
See <https://ci-beam.apache.org/job/beam_PostCommit_Py_VR_Dataflow_V2/1562/display/redirect?page=changes>

Changes:

[Boyuan Zhang] [BEAM-11325] ReadFromKafkaDoFn should stop reading when topic/partition

[noreply] [BEAM-11092][Go SDK] Ack Harness monitoring requests (#13788)

[noreply] [BEAM-10961] Enabled strict dependencies on samza (#13667)

[noreply] [BEAM-11200] Update Go SDK version on release. (#13789)


------------------------------------------
[...truncated 6.82 MB...]
              "is_wrapper": true
            },
            "output_name": "None",
            "user_name": "assert_that/Unkey.out"
          }
        ],
        "parallel_input": {
          "@type": "OutputReference",
          "output_name": "None",
          "step_name": "s19"
        },
        "serialized_fn": "ref_AppliedPTransform_assert_that/Unkey_29",
        "user_name": "assert_that/Unkey"
      }
    },
    {
      "kind": "ParallelDo",
      "name": "s21",
      "properties": {
        "display_data": [
          {
            "key": "fn",
            "label": "Transform Function",
            "namespace": "apache_beam.transforms.core.ParDo",
            "shortValue": "CallableWrapperDoFn",
            "type": "STRING",
            "value": "apache_beam.transforms.core.CallableWrapperDoFn"
          },
          {
            "key": "fn",
            "label": "Transform Function",
            "namespace": "apache_beam.transforms.core.CallableWrapperDoFn",
            "type": "STRING",
            "value": "_equal"
          }
        ],
        "non_parallel_inputs": {},
        "output_info": [
          {
            "encoding": {
              "@type": "kind:windowed_value",
              "component_encodings": [
                {
                  "@type": "FastPrimitivesCoder$eNprYJmaxgABPZKJBYnJGanxSamJuXrJ+SmpRcVQakqPsFticUlAUWZuZklmWWqxM0h4yuQpmo1Taqf08MenJebkJCUmZ8eD1U/JYOjhDshMzs5JRVGYVJykBwDOUCqY",
                  "component_encodings": [
                    {
                      "@type": "FastPrimitivesCoder$eNprYJmaxgABPZKJBYnJGanxSamJuXrJ+SmpRcVQakqPsFticUlAUWZuZklmWWqxM0h4yuQpmo1Taqf08MenJebkJCUmZ8eD1U/JYOjhDshMzs5JRVGYVJykBwDOUCqY",
                      "component_encodings": [],
                      "pipeline_proto_coder_id": "ref_Coder_FastPrimitivesCoder_6"
                    },
                    {
                      "@type": "FastPrimitivesCoder$eNprYJmaxgABPZKJBYnJGanxSamJuXrJ+SmpRcVQakqPsFticUlAUWZuZklmWWqxM0h4yuQpmo1Taqf08MenJebkJCUmZ8eD1U/JYOjhDshMzs5JRVGYVJykBwDOUCqY",
                      "component_encodings": [],
                      "pipeline_proto_coder_id": "ref_Coder_FastPrimitivesCoder_6"
                    }
                  ],
                  "is_pair_like": true,
                  "pipeline_proto_coder_id": "ref_Coder_FastPrimitivesCoder_6"
                },
                {
                  "@type": "kind:global_window"
                }
              ],
              "is_wrapper": true
            },
            "output_name": "None",
            "user_name": "assert_that/Match.out"
          }
        ],
        "parallel_input": {
          "@type": "OutputReference",
          "output_name": "None",
          "step_name": "s20"
        },
        "serialized_fn": "ref_AppliedPTransform_assert_that/Match_30",
        "user_name": "assert_that/Match"
      }
    }
  ],
  "type": "JOB_TYPE_STREAMING"
}
INFO:apache_beam.runners.dataflow.internal.apiclient:Create job: <Job
 createTime: '2021-01-22T01:17:49.998537Z'
 currentStateTime: '1970-01-01T00:00:00Z'
 id: '2021-01-21_17_17_47-1638815060769579799'
 location: 'us-central1'
 name: 'beamapp-jenkins-0122011739-202604'
 projectId: 'apache-beam-testing'
 stageStates: []
 startTime: '2021-01-22T01:17:49.998537Z'
 steps: []
 tempFiles: []
 type: TypeValueValuesEnum(JOB_TYPE_STREAMING, 2)>
INFO:apache_beam.runners.dataflow.internal.apiclient:Created job with id: [2021-01-21_17_17_47-1638815060769579799]
INFO:apache_beam.runners.dataflow.internal.apiclient:Submitted job: 2021-01-21_17_17_47-1638815060769579799
INFO:apache_beam.runners.dataflow.internal.apiclient:To access the Dataflow monitoring console,
please navigate to https://console.cloud.google.com/dataflow/jobs/us-central1/2021-01-21_17_17_47-1638815060769579799?project=apache-beam-testing
WARNING:apache_beam.runners.dataflow.test_dataflow_runner:Waiting indefinitely for streaming
job.
INFO:apache_beam.runners.dataflow.dataflow_runner:Job 2021-01-21_17_17_47-1638815060769579799
is in state JOB_STATE_RUNNING
INFO:apache_beam.runners.dataflow.dataflow_runner:2021-01-22T01:17:48.002Z: JOB_MESSAGE_WARNING:
Autoscaling is enabled for Dataflow Streaming Engine. Workers will scale between 1 and 100
unless maxNumWorkers is specified.
INFO:apache_beam.runners.dataflow.dataflow_runner:2021-01-22T01:17:48.002Z: JOB_MESSAGE_DETAILED:
Autoscaling is enabled for job 2021-01-21_17_17_47-1638815060769579799. The number of workers
will be between 1 and 100.
INFO:apache_beam.runners.dataflow.dataflow_runner:2021-01-22T01:17:48.002Z: JOB_MESSAGE_DETAILED:
Autoscaling was automatically enabled for job 2021-01-21_17_17_47-1638815060769579799.
INFO:apache_beam.runners.dataflow.dataflow_runner:2021-01-22T01:17:53.347Z: JOB_MESSAGE_BASIC:
Worker configuration: n1-standard-2 in us-central1-f.
INFO:apache_beam.runners.dataflow.dataflow_runner:2021-01-22T01:17:54.129Z: JOB_MESSAGE_DETAILED:
Expanding SplittableParDo operations into optimizable parts.
INFO:apache_beam.runners.dataflow.dataflow_runner:2021-01-22T01:17:54.163Z: JOB_MESSAGE_DETAILED:
Expanding CollectionToSingleton operations into optimizable parts.
INFO:apache_beam.runners.dataflow.dataflow_runner:2021-01-22T01:17:54.238Z: JOB_MESSAGE_DETAILED:
Expanding CoGroupByKey operations into optimizable parts.
INFO:apache_beam.runners.dataflow.dataflow_runner:2021-01-22T01:17:54.283Z: JOB_MESSAGE_DEBUG:
Combiner lifting skipped for step assert_that/Group/GroupByKey: GroupByKey not followed by
a combiner.
INFO:apache_beam.runners.dataflow.dataflow_runner:2021-01-22T01:17:54.312Z: JOB_MESSAGE_DEBUG:
Combiner lifting skipped for step Create/MaybeReshuffle/Reshuffle/ReshufflePerKey/GroupByKey:
GroupByKey not followed by a combiner.
INFO:apache_beam.runners.dataflow.dataflow_runner:2021-01-22T01:17:54.352Z: JOB_MESSAGE_DETAILED:
Expanding SplittableProcessKeyed operations into optimizable parts.
INFO:apache_beam.runners.dataflow.dataflow_runner:2021-01-22T01:17:54.393Z: JOB_MESSAGE_DETAILED:
Expanding GroupByKey operations into streaming Read/Write steps
INFO:apache_beam.runners.dataflow.dataflow_runner:2021-01-22T01:17:54.493Z: JOB_MESSAGE_DETAILED:
Lifting ValueCombiningMappingFns into MergeBucketsMappingFns
INFO:apache_beam.runners.dataflow.dataflow_runner:2021-01-22T01:17:54.605Z: JOB_MESSAGE_DEBUG:
Annotating graph with Autotuner information.
INFO:apache_beam.runners.dataflow.dataflow_runner:2021-01-22T01:17:54.662Z: JOB_MESSAGE_DETAILED:
Fusing adjacent ParDo, Read, Write, and Flatten operations
INFO:apache_beam.runners.dataflow.dataflow_runner:2021-01-22T01:17:54.705Z: JOB_MESSAGE_DETAILED:
Unzipping flatten s17 for input s15.None
INFO:apache_beam.runners.dataflow.dataflow_runner:2021-01-22T01:17:54.765Z: JOB_MESSAGE_DETAILED:
Fusing unzipped copy of assert_that/Group/GroupByKey/WriteStream, through flatten assert_that/Group/Flatten,
into producer assert_that/Group/pair_with_0
INFO:apache_beam.runners.dataflow.dataflow_runner:2021-01-22T01:17:54.797Z: JOB_MESSAGE_DETAILED:
Fusing consumer assert_that/Group/GroupByKey/WriteStream into assert_that/Group/pair_with_1
INFO:apache_beam.runners.dataflow.dataflow_runner:2021-01-22T01:17:54.833Z: JOB_MESSAGE_DETAILED:
Fusing consumer Create/FlatMap(<lambda at core.py:2957>) into Create/Impulse
INFO:apache_beam.runners.dataflow.dataflow_runner:2021-01-22T01:17:54.855Z: JOB_MESSAGE_DETAILED:
Fusing consumer assert_that/Create/FlatMap(<lambda at core.py:2957>) into assert_that/Create/Impulse
INFO:apache_beam.runners.dataflow.dataflow_runner:2021-01-22T01:17:54.894Z: JOB_MESSAGE_DETAILED:
Fusing consumer assert_that/Create/Map(decode) into assert_that/Create/FlatMap(<lambda
at core.py:2957>)
INFO:apache_beam.runners.dataflow.dataflow_runner:2021-01-22T01:17:54.968Z: JOB_MESSAGE_DETAILED:
Fusing consumer assert_that/Group/pair_with_0 into assert_that/Create/Map(decode)
INFO:apache_beam.runners.dataflow.dataflow_runner:2021-01-22T01:17:55.023Z: JOB_MESSAGE_DETAILED:
Fusing consumer Create/MaybeReshuffle/Reshuffle/AddRandomKeys into Create/FlatMap(<lambda
at core.py:2957>)
INFO:apache_beam.runners.dataflow.dataflow_runner:2021-01-22T01:17:55.059Z: JOB_MESSAGE_DETAILED:
Fusing consumer Create/MaybeReshuffle/Reshuffle/ReshufflePerKey/Map(reify_timestamps) into
Create/MaybeReshuffle/Reshuffle/AddRandomKeys
INFO:apache_beam.runners.dataflow.dataflow_runner:2021-01-22T01:17:55.386Z: JOB_MESSAGE_DETAILED:
Fusing consumer Create/MaybeReshuffle/Reshuffle/ReshufflePerKey/GroupByKey/WriteStream into
Create/MaybeReshuffle/Reshuffle/ReshufflePerKey/Map(reify_timestamps)
INFO:apache_beam.runners.dataflow.dataflow_runner:2021-01-22T01:17:55.552Z: JOB_MESSAGE_DETAILED:
Fusing consumer Create/MaybeReshuffle/Reshuffle/ReshufflePerKey/GroupByKey/MergeBuckets into
Create/MaybeReshuffle/Reshuffle/ReshufflePerKey/GroupByKey/ReadStream
INFO:apache_beam.runners.dataflow.dataflow_runner:2021-01-22T01:17:55.585Z: JOB_MESSAGE_DETAILED:
Fusing consumer Create/MaybeReshuffle/Reshuffle/ReshufflePerKey/FlatMap(restore_timestamps)
into Create/MaybeReshuffle/Reshuffle/ReshufflePerKey/GroupByKey/MergeBuckets
INFO:apache_beam.runners.dataflow.dataflow_runner:2021-01-22T01:17:55.620Z: JOB_MESSAGE_DETAILED:
Fusing consumer Create/MaybeReshuffle/Reshuffle/RemoveRandomKeys into Create/MaybeReshuffle/Reshuffle/ReshufflePerKey/FlatMap(restore_timestamps)
INFO:apache_beam.runners.dataflow.dataflow_runner:2021-01-22T01:17:55.652Z: JOB_MESSAGE_DETAILED:
Fusing consumer Create/Map(decode) into Create/MaybeReshuffle/Reshuffle/RemoveRandomKeys
INFO:apache_beam.runners.dataflow.dataflow_runner:2021-01-22T01:17:55.681Z: JOB_MESSAGE_DETAILED:
Fusing consumer Key param into Create/Map(decode)
INFO:apache_beam.runners.dataflow.dataflow_runner:2021-01-22T01:17:55.727Z: JOB_MESSAGE_DETAILED:
Fusing consumer assert_that/WindowInto(WindowIntoFn) into Key param
INFO:apache_beam.runners.dataflow.dataflow_runner:2021-01-22T01:17:55.763Z: JOB_MESSAGE_DETAILED:
Fusing consumer assert_that/ToVoidKey into assert_that/WindowInto(WindowIntoFn)
INFO:apache_beam.runners.dataflow.dataflow_runner:2021-01-22T01:17:55.792Z: JOB_MESSAGE_DETAILED:
Fusing consumer assert_that/Group/pair_with_1 into assert_that/ToVoidKey
INFO:apache_beam.runners.dataflow.dataflow_runner:2021-01-22T01:17:55.818Z: JOB_MESSAGE_DETAILED:
Fusing consumer assert_that/Group/GroupByKey/MergeBuckets into assert_that/Group/GroupByKey/ReadStream
INFO:apache_beam.runners.dataflow.dataflow_runner:2021-01-22T01:17:55.842Z: JOB_MESSAGE_DETAILED:
Fusing consumer assert_that/Group/Map(_merge_tagged_vals_under_key) into assert_that/Group/GroupByKey/MergeBuckets
INFO:apache_beam.runners.dataflow.dataflow_runner:2021-01-22T01:17:55.865Z: JOB_MESSAGE_DETAILED:
Fusing consumer assert_that/Unkey into assert_that/Group/Map(_merge_tagged_vals_under_key)
INFO:apache_beam.runners.dataflow.dataflow_runner:2021-01-22T01:17:55.890Z: JOB_MESSAGE_DETAILED:
Fusing consumer assert_that/Match into assert_that/Unkey
INFO:apache_beam.runners.dataflow.dataflow_runner:2021-01-22T01:17:55.922Z: JOB_MESSAGE_DEBUG:
Workflow config is missing a default resource spec.
INFO:apache_beam.runners.dataflow.dataflow_runner:2021-01-22T01:17:55.958Z: JOB_MESSAGE_DEBUG:
Adding StepResource setup and teardown to workflow graph.
INFO:apache_beam.runners.dataflow.dataflow_runner:2021-01-22T01:17:55.984Z: JOB_MESSAGE_DEBUG:
Adding workflow start and stop steps.
INFO:apache_beam.runners.dataflow.dataflow_runner:2021-01-22T01:17:56.006Z: JOB_MESSAGE_DEBUG:
Assigning stage ids.
INFO:apache_beam.runners.dataflow.dataflow_runner:2021-01-22T01:17:57.176Z: JOB_MESSAGE_DEBUG:
Starting worker pool setup.
INFO:apache_beam.runners.dataflow.dataflow_runner:2021-01-22T01:17:57.199Z: JOB_MESSAGE_DEBUG:
Starting worker pool setup.
INFO:apache_beam.runners.dataflow.dataflow_runner:2021-01-22T01:17:57.234Z: JOB_MESSAGE_BASIC:
Starting 1 workers in us-central1-f...
INFO:apache_beam.runners.dataflow.dataflow_runner:2021-01-22T01:18:09.553Z: JOB_MESSAGE_BASIC:
Your project already contains 100 Dataflow-created metric descriptors, so new user metrics
of the form custom.googleapis.com/* will not be created. However, all user metrics are also
available in the metric dataflow.googleapis.com/job/user_counter. If you rely on the custom
metrics, you can delete old / unused metric descriptors. See https://developers.google.com/apis-explorer/#p/monitoring/v3/monitoring.projects.metricDescriptors.list
and https://developers.google.com/apis-explorer/#p/monitoring/v3/monitoring.projects.metricDescriptors.delete
INFO:apache_beam.runners.dataflow.dataflow_runner:2021-01-22T01:18:33.692Z: JOB_MESSAGE_DETAILED:
Autoscaling: Raised the number of workers to 1 so that the pipeline can catch up with its
backlog and keep up with its input rate.
INFO:apache_beam.runners.dataflow.dataflow_runner:2021-01-22T01:19:06.766Z: JOB_MESSAGE_DETAILED:
Workers have started successfully.
INFO:apache_beam.runners.dataflow.dataflow_runner:2021-01-22T01:19:06.795Z: JOB_MESSAGE_DETAILED:
Workers have started successfully.
INFO:apache_beam.runners.dataflow.dataflow_runner:2021-01-22T01:24:58.449Z: JOB_MESSAGE_DETAILED:
Cleaning up.
INFO:apache_beam.runners.dataflow.dataflow_runner:2021-01-22T01:24:58.498Z: JOB_MESSAGE_DEBUG:
Starting worker pool teardown.
INFO:apache_beam.runners.dataflow.dataflow_runner:2021-01-22T01:24:58.534Z: JOB_MESSAGE_BASIC:
Stopping worker pool...
INFO:apache_beam.runners.dataflow.dataflow_runner:2021-01-22T01:24:58.622Z: JOB_MESSAGE_DEBUG:
Starting worker pool teardown.
INFO:apache_beam.runners.dataflow.dataflow_runner:2021-01-22T01:24:58.654Z: JOB_MESSAGE_BASIC:
Stopping worker pool...
INFO:apache_beam.runners.dataflow.dataflow_runner:2021-01-22T01:25:46.174Z: JOB_MESSAGE_DETAILED:
Autoscaling: Reduced the number of workers to 0 based on low average worker CPU utilization,
and the pipeline having sufficiently low backlog and keeping up with input rate.
INFO:apache_beam.runners.dataflow.dataflow_runner:2021-01-22T01:25:46.223Z: JOB_MESSAGE_BASIC:
Worker pool stopped.
INFO:apache_beam.runners.dataflow.dataflow_runner:2021-01-22T01:25:46.256Z: JOB_MESSAGE_DEBUG:
Tearing down pending resources...
INFO:apache_beam.runners.dataflow.dataflow_runner:Job 2021-01-21_17_17_47-1638815060769579799
is in state JOB_STATE_DONE
Worker logs: https://console.cloud.google.com/dataflow/jobs/us-central1/2021-01-21_16_42_59-4398071281644749531?project=apache-beam-testing
Worker logs: https://console.cloud.google.com/dataflow/jobs/us-central1/2021-01-21_16_51_30-2818264465020873239?project=apache-beam-testing
Worker logs: https://console.cloud.google.com/dataflow/jobs/us-central1/2021-01-21_17_01_05-3509271580239495271?project=apache-beam-testing
Worker logs: https://console.cloud.google.com/dataflow/jobs/us-central1/2021-01-21_16_43_01-15276280119869069099?project=apache-beam-testing
Worker logs: https://console.cloud.google.com/dataflow/jobs/us-central1/2021-01-21_16_52_21-4109999683552676435?project=apache-beam-testing
Worker logs: https://console.cloud.google.com/dataflow/jobs/us-central1/2021-01-21_17_00_53-3574451715452677760?project=apache-beam-testing
Worker logs: https://console.cloud.google.com/dataflow/jobs/us-central1/2021-01-21_16_43_03-13403662799495124428?project=apache-beam-testing
Worker logs: https://console.cloud.google.com/dataflow/jobs/us-central1/2021-01-21_16_50_59-8379710439074816356?project=apache-beam-testing
Worker logs: https://console.cloud.google.com/dataflow/jobs/us-central1/2021-01-21_16_59_20-3582734413851356627?project=apache-beam-testing
Worker logs: https://console.cloud.google.com/dataflow/jobs/us-central1/2021-01-21_17_07_42-6131944809859319979?project=apache-beam-testing
Worker logs: https://console.cloud.google.com/dataflow/jobs/us-central1/2021-01-21_16_43_04-14378054540641477832?project=apache-beam-testing
Worker logs: https://console.cloud.google.com/dataflow/jobs/us-central1/2021-01-21_16_52_30-11945230679699235232?project=apache-beam-testing
Worker logs: https://console.cloud.google.com/dataflow/jobs/us-central1/2021-01-21_17_01_05-1098639624075515402?project=apache-beam-testing
Worker logs: https://console.cloud.google.com/dataflow/jobs/us-central1/2021-01-21_16_43_07-7036206861400131072?project=apache-beam-testing
Worker logs: https://console.cloud.google.com/dataflow/jobs/us-central1/2021-01-21_16_52_40-4136248667265294670?project=apache-beam-testing
Worker logs: https://console.cloud.google.com/dataflow/jobs/us-central1/2021-01-21_17_01_11-1079767020554838503?project=apache-beam-testing
Worker logs: https://console.cloud.google.com/dataflow/jobs/us-central1/2021-01-21_16_43_05-5323225072930770747?project=apache-beam-testing
Worker logs: https://console.cloud.google.com/dataflow/jobs/us-central1/2021-01-21_16_52_38-13512559648653807386?project=apache-beam-testing
Worker logs: https://console.cloud.google.com/dataflow/jobs/us-central1/2021-01-21_17_02_08-16835204383818223308?project=apache-beam-testing
Worker logs: https://console.cloud.google.com/dataflow/jobs/us-central1/2021-01-21_16_43_19-12183961704472283585?project=apache-beam-testing
Worker logs: https://console.cloud.google.com/dataflow/jobs/us-central1/2021-01-21_16_52_38-1899315444194119526?project=apache-beam-testing
Worker logs: https://console.cloud.google.com/dataflow/jobs/us-central1/2021-01-21_17_02_14-9579869966990491690?project=apache-beam-testing
Worker logs: https://console.cloud.google.com/dataflow/jobs/us-central1/2021-01-21_16_43_04-14040848327547273091?project=apache-beam-testing
Worker logs: https://console.cloud.google.com/dataflow/jobs/us-central1/2021-01-21_16_51_25-12085421111096254520?project=apache-beam-testing
Worker logs: https://console.cloud.google.com/dataflow/jobs/us-central1/2021-01-21_17_00_57-13176612778613535410?project=apache-beam-testing
Worker logs: https://console.cloud.google.com/dataflow/jobs/us-central1/2021-01-21_17_09_17-5842947456964069830?project=apache-beam-testing
Worker logs: https://console.cloud.google.com/dataflow/jobs/us-central1/2021-01-21_17_17_47-1638815060769579799?project=apache-beam-testing
test_gbk_many_values (apache_beam.runners.portability.fn_api_runner.fn_runner_test.FnApiBasedStateBackedCoderTest)
... ok
Test TimestampCombiner with EARLIEST. ... ok
Test TimestampCombiner with LATEST. ... ok
Runs streaming Dataflow job and verifies that user metrics are reported ... ok
test_flatten_one_single_pcollection (apache_beam.transforms.ptransform_test.PTransformTest)
... ok
test_user_counter_using_pardo (apache_beam.metrics.metric_test.MetricsTest) ... ok
test_dofn_lifecycle (apache_beam.transforms.dofn_lifecycle_test.DoFnLifecycleTest) ... ok
test_flatten_multiple_pcollections_having_multiple_consumers (apache_beam.transforms.ptransform_test.PTransformTest)
... ok
test_flatten_a_flattened_pcollection (apache_beam.transforms.ptransform_test.PTransformTest)
... ok
test_flatten_pcollections (apache_beam.transforms.ptransform_test.PTransformTest) ... ok
test_impulse (apache_beam.transforms.ptransform_test.PTransformTest) ... ok
test_par_do_with_multiple_outputs_and_using_yield (apache_beam.transforms.ptransform_test.PTransformTest)
... ok
test_multiple_empty_outputs (apache_beam.transforms.ptransform_test.PTransformTest) ... ok
test_par_do_with_multiple_outputs_and_using_return (apache_beam.transforms.ptransform_test.PTransformTest)
... ok
test_as_list_and_as_dict_side_inputs (apache_beam.transforms.sideinputs_test.SideInputsTest)
... ok
test_as_dict_twice (apache_beam.transforms.sideinputs_test.SideInputsTest) ... ok
test_undeclared_outputs (apache_beam.transforms.ptransform_test.PTransformTest) ... ok
test_as_list_twice (apache_beam.transforms.sideinputs_test.SideInputsTest) ... ok
test_as_singleton_without_unique_labels (apache_beam.transforms.sideinputs_test.SideInputsTest)
... ok
test_combine (apache_beam.transforms.combinefn_lifecycle_test.CombineFnLifecycleTest) ...
ok
test_combining_value_state (apache_beam.transforms.combinefn_lifecycle_test.CombineFnLifecycleTest)
... ok
test_non_liftable_combine (apache_beam.transforms.combinefn_lifecycle_test.CombineFnLifecycleTest)
... ok
test_empty_singleton_side_input (apache_beam.transforms.sideinputs_test.SideInputsTest) ...
ok
test_as_singleton_with_different_defaults (apache_beam.transforms.sideinputs_test.SideInputsTest)
... ok
test_default_value_singleton_side_input (apache_beam.transforms.sideinputs_test.SideInputsTest)
... ok
test_flattened_side_input (apache_beam.transforms.sideinputs_test.SideInputsTest) ... ok
test_iterable_side_input (apache_beam.transforms.sideinputs_test.SideInputsTest) ... ok
test_reshuffle_preserves_timestamps (apache_beam.transforms.util_test.ReshuffleTest) ... ok
test_element_param (apache_beam.pipeline_test.DoFnTest) ... ok
test_key_param (apache_beam.pipeline_test.DoFnTest) ... ok

----------------------------------------------------------------------
XML: nosetests-validatesRunnerStreamingTests-df-py38.xml
----------------------------------------------------------------------
XML: <https://ci-beam.apache.org/job/beam_PostCommit_Py_VR_Dataflow_V2/ws/src/sdks/python/nosetests.xml>
----------------------------------------------------------------------
Ran 30 tests in 2611.641s

OK

> Task :sdks:python:test-suites:dataflow:validatesRunnerStreamingTestsV2

FAILURE: Build failed with an exception.

* Where:
Script '<https://ci-beam.apache.org/job/beam_PostCommit_Py_VR_Dataflow_V2/ws/src/sdks/python/test-suites/dataflow/common.gradle'>
line: 146

* What went wrong:
Execution failed for task ':sdks:python:test-suites:dataflow:py38:validatesRunnerBatchTests'.
> Process 'command 'sh'' finished with non-zero exit value 1

* Try:
Run with --stacktrace option to get the stack trace. Run with --info or --debug option to
get more log output. Run with --scan to get full insights.

* Get more help at https://help.gradle.org

Deprecated Gradle features were used in this build, making it incompatible with Gradle 7.0.
Use '--warning-mode all' to show the individual deprecation warnings.
See https://docs.gradle.org/6.8/userguide/command_line_interface.html#sec:command_line_warnings

BUILD FAILED in 1h 25m 35s
81 actionable tasks: 51 executed, 30 from cache

Publishing build scan...
https://gradle.com/s/s6nblto5kl5vs

Build step 'Invoke Gradle script' changed build result to FAILURE
Build step 'Invoke Gradle script' marked build as failure

---------------------------------------------------------------------
To unsubscribe, e-mail: builds-unsubscribe@beam.apache.org
For additional commands, e-mail: builds-help@beam.apache.org


Mime
View raw message