beam-builds mailing list archives

Site index · List index
Message view « Date » · « Thread »
Top « Date » · « Thread »
From Apache Jenkins Server <jenk...@builds.apache.org>
Subject Build failed in Jenkins: beam_PreCommit_CommunityMetrics_Cron #3273
Date Sun, 31 Jan 2021 06:01:42 GMT
See <https://ci-beam.apache.org/job/beam_PreCommit_CommunityMetrics_Cron/3273/display/redirect>

Changes:


------------------------------------------
Started by timer
Running as SYSTEM
[EnvInject] - Loading node environment variables.
Building remotely on apache-beam-jenkins-9 (beam) in workspace <https://ci-beam.apache.org/job/beam_PreCommit_CommunityMetrics_Cron/ws/>
No credentials specified
Wiping out workspace first.
Cloning the remote Git repository
Cloning repository https://github.com/apache/beam.git
 > git init <https://ci-beam.apache.org/job/beam_PreCommit_CommunityMetrics_Cron/ws/src>
# timeout=10
Fetching upstream changes from https://github.com/apache/beam.git
 > git --version # timeout=10
 > git fetch --tags --progress https://github.com/apache/beam.git +refs/heads/*:refs/remotes/origin/*
# timeout=10
 > git config remote.origin.url https://github.com/apache/beam.git # timeout=10
 > git config --add remote.origin.fetch +refs/heads/*:refs/remotes/origin/* # timeout=10
 > git config remote.origin.url https://github.com/apache/beam.git # timeout=10
Fetching upstream changes from https://github.com/apache/beam.git
 > git fetch --tags --progress https://github.com/apache/beam.git +refs/heads/*:refs/remotes/origin/*
+refs/pull/${ghprbPullId}/*:refs/remotes/origin/pr/${ghprbPullId}/* # timeout=10
 > git rev-parse origin/master^{commit} # timeout=10
Checking out Revision bf5810a311737573827b8e8d24ad910b5d4e77fb (origin/master)
 > git config core.sparsecheckout # timeout=10
 > git checkout -f bf5810a311737573827b8e8d24ad910b5d4e77fb # timeout=10
Commit message: "Merge pull request #13819: [website] Clarify JIRA priority for security issues
(CVEs)"
 > git rev-list --no-walk bf5810a311737573827b8e8d24ad910b5d4e77fb # timeout=10
No emails were triggered.
[EnvInject] - Executing scripts and injecting environment variables after the SCM step.
[EnvInject] - Injecting as environment variables the properties content 
SPARK_LOCAL_IP=127.0.0.1
SETUPTOOLS_USE_DISTUTILS=stdlib

[EnvInject] - Variables injected successfully.
[Gradle] - Launching build.
[src] $ <https://ci-beam.apache.org/job/beam_PreCommit_CommunityMetrics_Cron/ws/src/gradlew>
--continue --max-workers=12 -Dorg.gradle.jvmargs=-Xms2g -Dorg.gradle.jvmargs=-Xmx4g -Pdocker-pull-licenses
:communityMetricsPreCommit
Starting a Gradle Daemon, 1 busy Daemon could not be reused, use --status for details
> Task :buildSrc:compileJava NO-SOURCE
> Task :buildSrc:compileGroovy FROM-CACHE
> Task :buildSrc:pluginDescriptors
> Task :buildSrc:processResources
> Task :buildSrc:classes
> Task :buildSrc:jar
> Task :buildSrc:assemble
> Task :buildSrc:spotlessGroovy FROM-CACHE
> Task :buildSrc:spotlessGroovyCheck UP-TO-DATE
> Task :buildSrc:spotlessGroovyGradle FROM-CACHE
> Task :buildSrc:spotlessGroovyGradleCheck UP-TO-DATE
> Task :buildSrc:spotlessCheck UP-TO-DATE
> Task :buildSrc:pluginUnderTestMetadata
> Task :buildSrc:compileTestJava NO-SOURCE
> Task :buildSrc:compileTestGroovy NO-SOURCE
> Task :buildSrc:processTestResources NO-SOURCE
> Task :buildSrc:testClasses UP-TO-DATE
> Task :buildSrc:test NO-SOURCE
> Task :buildSrc:validatePlugins FROM-CACHE
> Task :buildSrc:check UP-TO-DATE
> Task :buildSrc:build
Configuration on demand is an incubating feature.
> Task :beam-test-infra-metrics:createEmptyConfig

> Task :beam-test-infra-metrics:composeUp
postgresql uses an image, skipping
influxdb uses an image, skipping
Building influxdb-restore
Building grafana
Building syncgithub
Building syncjenkins
Building syncjira
Creating network "7f68c8270306616dc9f681dd43484432_beam-test-infra-metrics__default" with
the default driver
Creating volume "7f68c8270306616dc9f681dd43484432_beam-test-infra-metrics__beam-postgresql-data"
with default driver
Creating volume "7f68c8270306616dc9f681dd43484432_beam-test-infra-metrics__beam-grafana-libdata"
with default driver
Creating volume "7f68c8270306616dc9f681dd43484432_beam-test-infra-metrics__beam-grafana-etcdata"
with default driver
Creating volume "7f68c8270306616dc9f681dd43484432_beam-test-infra-metrics__beam-grafana-logdata"
with default driver
Creating volume "7f68c8270306616dc9f681dd43484432_beam-test-infra-metrics__beam-influxdb-storage"
with default driver
Pulling postgresql (postgres:)...
latest: Pulling from library/postgres
Digest: sha256:c32f3f8364d79f71958c9ada74c43c2033d7e13d9d5fc21d3ba89322e6559c9d
Status: Downloaded newer image for postgres:latest
Creating beampostgresql ... 
Creating influxdb       ... 
Creating beamsyncjira   ... 
Creating beamsyncgithub ... 
Creating beamsyncjenkins ... 
Creating beamgrafana     ... 
Creating influxdb        ... error

ERROR: for influxdb  Cannot start service influxdb: network 7f68c8270306616dc9f681dd43484432_beam-test-infra-metrics__default
not found
Creating beampostgresql  ... error

ERROR: for beampostgresql  Cannot start service postgresql: network 7f68c8270306616dc9f681dd43484432_beam-test-infra-metrics__default
not found
Creating beamsyncjira    ... error

ERROR: for beamsyncjira  Cannot start service syncjira: network 7f68c8270306616dc9f681dd43484432_beam-test-infra-metrics__default
not found
Creating beamsyncgithub  ... error

ERROR: for beamsyncgithub  Cannot start service syncgithub: network 7f68c8270306616dc9f681dd43484432_beam-test-infra-metrics__default
not found
Creating beamgrafana     ... error

ERROR: for beamgrafana  Cannot start service grafana: network 7f68c8270306616dc9f681dd43484432_beam-test-infra-metrics__default
not found
Creating beamsyncjenkins ... error

ERROR: for beamsyncjenkins  Cannot start service syncjenkins: network 7f68c8270306616dc9f681dd43484432_beam-test-infra-metrics__default
not found

ERROR: for influxdb  Cannot start service influxdb: network 7f68c8270306616dc9f681dd43484432_beam-test-infra-metrics__default
not found

ERROR: for postgresql  Cannot start service postgresql: network 7f68c8270306616dc9f681dd43484432_beam-test-infra-metrics__default
not found

ERROR: for syncjira  Cannot start service syncjira: network 7f68c8270306616dc9f681dd43484432_beam-test-infra-metrics__default
not found

ERROR: for syncgithub  Cannot start service syncgithub: network 7f68c8270306616dc9f681dd43484432_beam-test-infra-metrics__default
not found

ERROR: for grafana  Cannot start service grafana: network 7f68c8270306616dc9f681dd43484432_beam-test-infra-metrics__default
not found

ERROR: for syncjenkins  Cannot start service syncjenkins: network 7f68c8270306616dc9f681dd43484432_beam-test-infra-metrics__default
not found
Encountered errors while bringing up the project.
Removing beamsyncjenkins ... 
Removing beamgrafana     ... 
Removing beamsyncgithub  ... 
Removing beamsyncjira    ... 
Removing beampostgresql  ... 
Removing influxdb        ... 
Removing influxdb        ... done
Removing beamsyncjenkins ... done
Removing beampostgresql  ... done
Removing beamsyncgithub  ... done
Removing beamsyncjira    ... done
Removing beamgrafana     ... done
Removing network 7f68c8270306616dc9f681dd43484432_beam-test-infra-metrics__default
Network 7f68c8270306616dc9f681dd43484432_beam-test-infra-metrics__default not found.
Removing volume 7f68c8270306616dc9f681dd43484432_beam-test-infra-metrics__beam-postgresql-data
Removing volume 7f68c8270306616dc9f681dd43484432_beam-test-infra-metrics__beam-grafana-libdata
Removing volume 7f68c8270306616dc9f681dd43484432_beam-test-infra-metrics__beam-grafana-etcdata
Removing volume 7f68c8270306616dc9f681dd43484432_beam-test-infra-metrics__beam-grafana-logdata
Removing volume 7f68c8270306616dc9f681dd43484432_beam-test-infra-metrics__beam-influxdb-storage

> Task :beam-test-infra-metrics:composeUp FAILED

> Task :beam-test-infra-metrics:validateConfiguration
persistentvolumeclaim/beam-grafana-etcdata created (dry run)
persistentvolumeclaim/beam-grafana-libdata created (dry run)
persistentvolumeclaim/beam-grafana-logdata created (dry run)
cronjob.batch/influxdb-autobackup created (dry run)
persistentvolumeclaim/influxdb-storage created (dry run)
configmap/influxdb-init-scripts created (dry run)
deployment.apps/influxdb created (dry run)
service/influxdb created (dry run)
service/influxdb-rpc created (dry run)
persistentvolumeclaim/beam-postgresql-data created (dry run)
deployment.apps/beamgrafana created (dry run)

FAILURE: Build failed with an exception.

* What went wrong:
Execution failed for task ':beam-test-infra-metrics:composeUp'.
> Exit-code 1 when calling docker-compose, stdout: N/A

* Try:
Run with --stacktrace option to get the stack trace. Run with --info or --debug option to
get more log output. Run with --scan to get full insights.

* Get more help at https://help.gradle.org

Deprecated Gradle features were used in this build, making it incompatible with Gradle 7.0.
Use '--warning-mode all' to show the individual deprecation warnings.
See https://docs.gradle.org/6.8/userguide/command_line_interface.html#sec:command_line_warnings

BUILD FAILED in 1m 10s
3 actionable tasks: 3 executed

Publishing build scan...
https://gradle.com/s/vs5qbqe4frngc

Build step 'Invoke Gradle script' changed build result to FAILURE
Build step 'Invoke Gradle script' marked build as failure

---------------------------------------------------------------------
To unsubscribe, e-mail: builds-unsubscribe@beam.apache.org
For additional commands, e-mail: builds-help@beam.apache.org


Mime
View raw message