beam-builds mailing list archives

Site index · List index
Message view « Date » · « Thread »
Top « Date » · « Thread »
From Apache Jenkins Server <jenk...@builds.apache.org>
Subject Build failed in Jenkins: beam_PostCommit_Java_VR_Dataflow_V2_Streaming #346
Date Fri, 29 Jan 2021 22:17:17 GMT
See <https://ci-beam.apache.org/job/beam_PostCommit_Java_VR_Dataflow_V2_Streaming/346/display/redirect?page=changes>

Changes:

[Ismaël Mejía] [BEAM-11658] Match .snappy files into the given (de)compressor


------------------------------------------
[...truncated 63.01 KB...]
Note: Some input files use or override a deprecated API.
Note: Recompile with -Xlint:deprecation for details.
Note: Some input files use unchecked or unsafe operations.
Note: Recompile with -Xlint:unchecked for details.

> Task :runners:core-construction-java:testClasses
> Task :runners:core-construction-java:testJar
> Task :sdks:java:container:installDependencies

> Task :sdks:java:extensions:google-cloud-platform-core:compileJava
Note: Some input files use or override a deprecated API.
Note: Recompile with -Xlint:deprecation for details.

> Task :sdks:java:extensions:google-cloud-platform-core:classes
> Task :sdks:java:extensions:google-cloud-platform-core:jar
> Task :sdks:java:container:buildLinuxAmd64
> Task :sdks:java:container:goBuild
> Task :sdks:java:container:java8:copySdkHarnessLauncher

> Task :sdks:java:extensions:google-cloud-platform-core:compileTestJava
Note: Some input files use or override a deprecated API.
Note: Recompile with -Xlint:deprecation for details.

> Task :sdks:java:extensions:google-cloud-platform-core:testClasses
> Task :sdks:java:extensions:google-cloud-platform-core:testJar
> Task :sdks:java:harness:compileJava
Note: Some input files use or override a deprecated API.
Note: Recompile with -Xlint:deprecation for details.
Note: Some input files use unchecked or unsafe operations.
Note: Recompile with -Xlint:unchecked for details.

> Task :sdks:java:harness:classes
> Task :sdks:java:harness:jar
> Task :sdks:java:harness:shadowJar
> Task :runners:java-fn-execution:compileJava
Note: Some input files use or override a deprecated API.
Note: Recompile with -Xlint:deprecation for details.
Note: Some input files use unchecked or unsafe operations.
Note: Recompile with -Xlint:unchecked for details.

> Task :runners:java-fn-execution:classes
> Task :runners:java-fn-execution:jar

> Task :sdks:java:expansion-service:compileJava
Note: <https://ci-beam.apache.org/job/beam_PostCommit_Java_VR_Dataflow_V2_Streaming/ws/src/sdks/java/expansion-service/src/main/java/org/apache/beam/sdk/expansion/service/ExpansionService.java>
uses unchecked or unsafe operations.
Note: Recompile with -Xlint:unchecked for details.

> Task :sdks:java:expansion-service:classes
> Task :sdks:java:expansion-service:jar
> Task :runners:direct-java:compileJava
> Task :sdks:java:io:kafka:compileJava
> Task :sdks:java:io:google-cloud-platform:compileJava

> Task :sdks:java:io:kafka:compileJava
Note: Some input files use or override a deprecated API.
Note: Recompile with -Xlint:deprecation for details.
Note: Some input files use unchecked or unsafe operations.
Note: Recompile with -Xlint:unchecked for details.

> Task :sdks:java:io:kafka:classes
> Task :sdks:java:io:kafka:jar
> Task :sdks:java:container:java8:copyDockerfileDependencies
> Task :sdks:java:container:java8:dockerPrepare
> Task :sdks:java:container:java8:docker

> Task :runners:direct-java:compileJava
Note: Some input files use or override a deprecated API.
Note: Recompile with -Xlint:deprecation for details.
Note: Some input files use unchecked or unsafe operations.
Note: Recompile with -Xlint:unchecked for details.

> Task :runners:direct-java:classes

> Task :sdks:java:container:java8:docker
 ---> ce627081cfc6
Step 15/17 : RUN rm /opt/apache/beam/third_party_licenses/golang/LICENSE
 ---> Running in eb00e87309ce

> Task :runners:direct-java:shadowJar

> Task :sdks:java:container:java8:docker
Removing intermediate container eb00e87309ce
 ---> ff6d58abf68d
Step 16/17 : RUN if [ "${pull_licenses}" = "false" ] ; then     rm -rf /opt/apache/beam/third_party_licenses
;    fi
 ---> Running in 94500a31d5a7
Removing intermediate container 94500a31d5a7
 ---> a5b4401a5600
Step 17/17 : ENTRYPOINT ["/opt/apache/beam/boot"]
 ---> Running in 163d08b9daf8
Removing intermediate container 163d08b9daf8
 ---> a1df3b20cab6
Successfully built a1df3b20cab6
Successfully tagged apache/beam_java8_sdk:2.29.0.dev

> Task :runners:google-cloud-dataflow-java:buildAndPushDockerContainer
WARNING: `gcloud docker` will not be supported for Docker client versions above 18.03.

As an alternative, use `gcloud auth configure-docker` to configure `docker` to
use `gcloud` as a credential helper, then use `docker` as you would for non-GCR
registries, e.g. `docker pull gcr.io/project-id/my-image`. Add
`--verbosity=error` to silence this warning: `gcloud docker
--verbosity=error -- pull gcr.io/project-id/my-image`.

See: https://cloud.google.com/container-registry/docs/support/deprecation-notices#gcloud-docker

The push refers to repository [us.gcr.io/apache-beam-testing/java-postcommit-it/java]
f83a93a5b796: Preparing
2c16698abed1: Preparing
63c3bf0ce853: Preparing
f95382013db1: Preparing
44c4c441421d: Preparing
f232ccfb8f63: Preparing
0ed5793f3ac2: Preparing
9d09723b62fa: Preparing
7cdeeb18cf6f: Preparing
196afe8fddfa: Preparing
074a82da7a60: Preparing
25b2e6cfc187: Preparing
7df6dd475950: Preparing
7496c5e8691b: Preparing
f232ccfb8f63: Waiting
0ed5793f3ac2: Waiting
9d09723b62fa: Waiting
196afe8fddfa: Waiting
074a82da7a60: Waiting
7cdeeb18cf6f: Waiting
25b2e6cfc187: Waiting
7df6dd475950: Waiting
aa7af8a465c6: Preparing
ef9a7b8862f4: Preparing
a1f2f42922b1: Preparing
aa7af8a465c6: Waiting
ef9a7b8862f4: Waiting
4762552ad7d8: Preparing
a1f2f42922b1: Waiting
7496c5e8691b: Waiting
2c16698abed1: Pushed
44c4c441421d: Pushed
f95382013db1: Pushed
f83a93a5b796: Pushed
9d09723b62fa: Pushed
0ed5793f3ac2: Pushed
63c3bf0ce853: Pushed
25b2e6cfc187: Layer already exists
7df6dd475950: Layer already exists
7496c5e8691b: Layer already exists
aa7af8a465c6: Layer already exists
ef9a7b8862f4: Layer already exists
a1f2f42922b1: Layer already exists
4762552ad7d8: Layer already exists
196afe8fddfa: Pushed
074a82da7a60: Pushed
f232ccfb8f63: Pushed
7cdeeb18cf6f: Pushed
20210129180056: digest: sha256:cc4dbd6a1e12d5e730c36ccacc1870272914c76bcf6941d39211d4c6019ddb34
size: 4098

> Task :sdks:java:io:google-cloud-platform:compileJava
Note: Some input files use or override a deprecated API.
Note: Recompile with -Xlint:deprecation for details.
Note: Some input files use unchecked or unsafe operations.
Note: Recompile with -Xlint:unchecked for details.

> Task :sdks:java:io:google-cloud-platform:classes
> Task :sdks:java:io:google-cloud-platform:jar
> Task :runners:google-cloud-dataflow-java:compileJava
> Task :sdks:java:io:google-cloud-platform:compileTestJava

> Task :runners:google-cloud-dataflow-java:compileJava
Note: Some input files use or override a deprecated API.
Note: Recompile with -Xlint:deprecation for details.
Note: Some input files use unchecked or unsafe operations.
Note: Recompile with -Xlint:unchecked for details.

> Task :runners:google-cloud-dataflow-java:classes
> Task :runners:google-cloud-dataflow-java:jar

> Task :sdks:java:io:google-cloud-platform:compileTestJava
Note: Some input files use or override a deprecated API.
Note: Recompile with -Xlint:deprecation for details.
Note: Some input files use unchecked or unsafe operations.
Note: Recompile with -Xlint:unchecked for details.

> Task :sdks:java:io:google-cloud-platform:testClasses
> Task :sdks:java:io:google-cloud-platform:testJar
> Task :runners:google-cloud-dataflow-java:compileTestJava
Note: Some input files use or override a deprecated API.
Note: Recompile with -Xlint:deprecation for details.
Note: Some input files use unchecked or unsafe operations.
Note: Recompile with -Xlint:unchecked for details.

> Task :runners:google-cloud-dataflow-java:testClasses
> Task :runners:google-cloud-dataflow-java:testJar
> Task :runners:google-cloud-dataflow-java:validatesRunnerV2TestStreaming

org.apache.beam.sdk.schemas.AvroSchemaTest > testAvroPipelineGroupBy FAILED
    java.lang.RuntimeException at AvroSchemaTest.java:500

org.apache.beam.sdk.transforms.ParDoTest$TimerTests > testTimerReceivedInOriginalWindow
FAILED
    java.lang.RuntimeException at ParDoTest.java:3610

org.apache.beam.sdk.transforms.ParDoTest$StateTests > testValueStateSameId FAILED
    java.lang.RuntimeException at ParDoTest.java:2168

org.apache.beam.sdk.transforms.ViewTest > testMapSideInputWithNonDeterministicKeyCoder
FAILED
    java.lang.RuntimeException at ViewTest.java:1058

org.apache.beam.sdk.transforms.windowing.WindowTest > testTimestampCombinerDefault FAILED
    java.lang.RuntimeException at WindowTest.java:471

232 tests completed, 5 failed, 2 skipped

> Task :runners:google-cloud-dataflow-java:validatesRunnerV2TestStreaming FAILED

> Task :runners:google-cloud-dataflow-java:cleanUpDockerImages
Untagged: us.gcr.io/apache-beam-testing/java-postcommit-it/java:20210129180056
Untagged: us.gcr.io/apache-beam-testing/java-postcommit-it/java@sha256:cc4dbd6a1e12d5e730c36ccacc1870272914c76bcf6941d39211d4c6019ddb34
Digests:
- us.gcr.io/apache-beam-testing/java-postcommit-it/java@sha256:cc4dbd6a1e12d5e730c36ccacc1870272914c76bcf6941d39211d4c6019ddb34
  Associated tags:
 - 20210129180056
Tags:
- us.gcr.io/apache-beam-testing/java-postcommit-it/java:20210129180056
Deleted [us.gcr.io/apache-beam-testing/java-postcommit-it/java:20210129180056].
Deleted [us.gcr.io/apache-beam-testing/java-postcommit-it/java@sha256:cc4dbd6a1e12d5e730c36ccacc1870272914c76bcf6941d39211d4c6019ddb34].

FAILURE: Build failed with an exception.

* What went wrong:
Execution failed for task ':runners:google-cloud-dataflow-java:validatesRunnerV2TestStreaming'.
> There were failing tests. See the report at: file://<https://ci-beam.apache.org/job/beam_PostCommit_Java_VR_Dataflow_V2_Streaming/ws/src/runners/google-cloud-dataflow-java/build/reports/tests/validatesRunnerV2TestStreaming/index.html>

* Try:
Run with --stacktrace option to get the stack trace. Run with --info or --debug option to
get more log output. Run with --scan to get full insights.

* Get more help at https://help.gradle.org

Deprecated Gradle features were used in this build, making it incompatible with Gradle 7.0.
Use '--warning-mode all' to show the individual deprecation warnings.
See https://docs.gradle.org/6.8/userguide/command_line_interface.html#sec:command_line_warnings

BUILD FAILED in 4h 16m 49s
123 actionable tasks: 110 executed, 11 from cache, 2 up-to-date
Gradle was unable to watch the file system for changes. The inotify watches limit is too low.

Publishing build scan...
https://gradle.com/s/ud2enklekphdo

Build step 'Invoke Gradle script' changed build result to FAILURE
Build step 'Invoke Gradle script' marked build as failure

---------------------------------------------------------------------
To unsubscribe, e-mail: builds-unsubscribe@beam.apache.org
For additional commands, e-mail: builds-help@beam.apache.org


Mime
View raw message