beam-builds mailing list archives

Site index · List index
Message view « Date » · « Thread »
Top « Date » · « Thread »
From Apache Jenkins Server <jenk...@builds.apache.org>
Subject Build failed in Jenkins: beam_PostCommit_PortableJar_Flink #3148
Date Fri, 15 Jan 2021 00:29:26 GMT
See <https://ci-beam.apache.org/job/beam_PostCommit_PortableJar_Flink/3148/display/redirect?page=changes>

Changes:

[sonam.ramchand] Enabled strict dependency

[sonam.ramchand] removed * depdendency

[sonam.ramchand] enabled strict dependency check to false

[sonam.ramchand] Fixed checker-qual issue

[sonam.ramchand] removed * dep

[sonam.ramchand] Fixed requested changes

[sonam.ramchand] autovalue_version variable added

[Kyle Weaver] Alphabetize dependency lists.

[tobiasz.kedzierski] Add gradle-command-action as submodule

[noreply] Make DataCatalogTableProvider.createDataCatalogClient public (#13752)

[noreply] [BEAM-11637] Use accumulators properly in BitAnd. (#13745)


------------------------------------------
[...truncated 1.82 MB...]
capabilities: "beam:coder:bool:v1"
capabilities: "beam:coder:varint:v1"
capabilities: "beam:coder:double:v1"
capabilities: "beam:coder:iterable:v1"
capabilities: "beam:coder:timer:v1"
capabilities: "beam:coder:interval_window:v1"
capabilities: "beam:coder:length_prefix:v1"
capabilities: "beam:coder:global_window:v1"
capabilities: "beam:coder:windowed_value:v1"
capabilities: "beam:coder:param_windowed_value:v1"
capabilities: "beam:coder:state_backed_iterable:v1"
capabilities: "beam:coder:row:v1"
capabilities: "beam:coder:sharded_key:v1"
capabilities: "beam:protocol:progress_reporting:v0"
capabilities: "beam:protocol:worker_status:v1"
capabilities: "beam:combinefn:packed_python:v1"
capabilities: "beam:version:sdk_base:apache/beam_python3.6_sdk:2.28.0.dev"
capabilities: "beam:transform:sdf_truncate_sized_restrictions:v1"
dependencies {
  type_urn: "beam:artifact:type:file:v1"
  type_payload: "\n\253\001classpath://BEAM-PIPELINE/pipeline/artifacts/job-21f393d4-dab8-4bc0-ab87-10094dda539d/182270e8651ebe9742acf4408973141dab1f4d441444043fe8d4b17b99b413d2-pickled_main_session"
  role_urn: "beam:artifact:role:staging_to:v1"
  role_payload: "\n\024pickled_main_session"
}

Jan 15, 2021 12:29:14 AM org.apache.beam.runners.fnexecution.logging.GrpcLoggingService close
INFO: 1 Beam Fn Logging clients still connected during shutdown.
Jan 15, 2021 12:29:14 AM org.apache.beam.sdk.fn.data.BeamFnDataGrpcMultiplexer$InboundObserver
onCompleted
WARNING: Hanged up for unknown endpoint.
Jan 15, 2021 12:29:14 AM org.apache.beam.sdk.fn.data.BeamFnDataGrpcMultiplexer$InboundObserver
onCompleted
WARNING: Hanged up for unknown endpoint.
Jan 15, 2021 12:29:14 AM org.apache.beam.runners.fnexecution.environment.DockerContainerEnvironment
close
INFO: Closing Docker container 1ad78e182362a3f43af4be33a61684a9ee3314cc45d0b9d09ef18cf81c9e199b.
Logs:
2021/01/15 00:29:11 Provision info:
pipeline_options:{fields:{key:"beam:option:app_name:v1"  value:{null_value:NULL_VALUE}}  fields:{key:"beam:option:artifact_port:v1"
 value:{string_value:"0"}}  fields:{key:"beam:option:beam_services:v1"  value:{struct_value:{}}}
 fields:{key:"beam:option:dataflow_endpoint:v1"  value:{string_value:"https://dataflow.googleapis.com"}}
 fields:{key:"beam:option:direct_num_workers:v1"  value:{string_value:"1"}}  fields:{key:"beam:option:direct_runner_bundle_repeat:v1"
 value:{string_value:"0"}}  fields:{key:"beam:option:direct_runner_use_stacked_bundle:v1"
 value:{bool_value:true}}  fields:{key:"beam:option:direct_running_mode:v1"  value:{string_value:"in_memory"}}
 fields:{key:"beam:option:dry_run:v1"  value:{bool_value:false}}  fields:{key:"beam:option:enable_streaming_engine:v1"
 value:{bool_value:false}}  fields:{key:"beam:option:environment_cache_millis:v1"  value:{string_value:"0"}}
 fields:{key:"beam:option:environment_options:v1"  value:{list_value:{values:{string_value:"docker_container_image=apache/beam_python3.6_sdk:2.28.0.dev"}}}}
 fields:{key:"beam:option:environment_type:v1"  value:{string_value:"DOCKER"}}  fields:{key:"beam:option:expansion_port:v1"
 value:{string_value:"0"}}  fields:{key:"beam:option:experiments:v1"  value:{list_value:{values:{string_value:"beam_fn_api"}}}}
 fields:{key:"beam:option:flink_job_server_jar:v1"  value:{string_value:"<https://ci-beam.apache.org/job/beam_PostCommit_PortableJar_Flink/ws/src/runners/flink/1.12/job-server/build/libs/beam-runners-flink-1.12-job-server-2.28.0-SNAPSHOT.jar"}}>
 fields:{key:"beam:option:flink_master:v1"  value:{string_value:"[auto]"}}  fields:{key:"beam:option:flink_submit_uber_jar:v1"
 value:{bool_value:true}}  fields:{key:"beam:option:flink_version:v1"  value:{string_value:"1.10"}}
 fields:{key:"beam:option:hdfs_full_urls:v1"  value:{bool_value:false}}  fields:{key:"beam:option:job_name:v1"
 value:{string_value:"BeamApp-jenkins-0115002857-349f9e75"}}  fields:{key:"beam:option:job_port:v1"
 value:{string_value:"0"}}  fields:{key:"beam:option:job_server_java_launcher:v1"  value:{string_value:"java"}}
 fields:{key:"beam:option:job_server_jvm_properties:v1"  value:{list_value:{}}}  fields:{key:"beam:option:job_server_timeout:v1"
 value:{string_value:"60"}}  fields:{key:"beam:option:no_auth:v1"  value:{bool_value:false}}
 fields:{key:"beam:option:options_id:v1"  value:{number_value:1}}  fields:{key:"beam:option:parallelism:v1"
 value:{string_value:"1"}}  fields:{key:"beam:option:performance_runtime_type_check:v1"  value:{bool_value:false}}
 fields:{key:"beam:option:pipeline_type_check:v1"  value:{bool_value:true}}  fields:{key:"beam:option:profile_cpu:v1"
 value:{bool_value:false}}  fields:{key:"beam:option:profile_memory:v1"  value:{bool_value:false}}
 fields:{key:"beam:option:profile_sample_rate:v1"  value:{number_value:1}}  fields:{key:"beam:option:runtime_type_check:v1"
 value:{bool_value:false}}  fields:{key:"beam:option:s3_disable_ssl:v1"  value:{bool_value:false}}
 fields:{key:"beam:option:save_main_session:v1"  value:{bool_value:true}}  fields:{key:"beam:option:sdk_location:v1"
 value:{string_value:"container"}}  fields:{key:"beam:option:sdk_worker_parallelism:v1"  value:{string_value:"1"}}
 fields:{key:"beam:option:spark_master_url:v1"  value:{string_value:"local[4]"}}  fields:{key:"beam:option:spark_submit_uber_jar:v1"
 value:{bool_value:false}}  fields:{key:"beam:option:streaming:v1"  value:{bool_value:false}}
 fields:{key:"beam:option:type_check_additional:v1"  value:{string_value:""}}  fields:{key:"beam:option:type_check_strictness:v1"
 value:{string_value:"DEFAULT_TO_ANY"}}  fields:{key:"beam:option:update:v1"  value:{bool_value:false}}}
 retrieval_token:"__no_artifacts_staged__"  logging_endpoint:{url:"localhost:36815"}  artifact_endpoint:{url:"localhost:33891"}
 control_endpoint:{url:"localhost:35305"}  dependencies:{type_urn:"beam:artifact:type:file:v1"
 type_payload:"\n\xab\x01classpath://BEAM-PIPELINE/pipeline/artifacts/job-21f393d4-dab8-4bc0-ab87-10094dda539d/182270e8651ebe9742acf4408973141dab1f4d441444043fe8d4b17b99b413d2-pickled_main_session"
 role_urn:"beam:artifact:role:staging_to:v1"  role_payload:"\n\x14pickled_main_session"}
2021/01/15 00:29:11 Initializing python harness: /opt/apache/beam/boot --id=1-1 --provision_endpoint=localhost:35737
2021/01/15 00:29:11 Found artifact: pickled_main_session
2021/01/15 00:29:11 Installing setup packages ...
2021/01/15 00:29:11 Executing: python -m apache_beam.runners.worker.sdk_worker_main
Jan 15, 2021 12:29:17 AM org.apache.flink.runtime.taskmanager.Task transitionState
INFO: MapPartition (MapPartition at [3]assert_that/{Group, Unkey, Match}) (1/1)#0 (16fc4c374c0d055b0f90d89e60bfc967)
switched from RUNNING to FINISHED.
Jan 15, 2021 12:29:17 AM org.apache.flink.runtime.taskmanager.Task transitionState
INFO: DataSink (DiscardingOutput) (1/1)#0 (93e448e20d553252efc22be6e8318298) switched from
RUNNING to FINISHED.
Jan 15, 2021 12:29:17 AM org.apache.flink.runtime.taskmanager.Task doRun
INFO: Freeing task resources for MapPartition (MapPartition at [3]assert_that/{Group, Unkey,
Match}) (1/1)#0 (16fc4c374c0d055b0f90d89e60bfc967).
Jan 15, 2021 12:29:17 AM org.apache.flink.runtime.taskmanager.Task doRun
INFO: Freeing task resources for DataSink (DiscardingOutput) (1/1)#0 (93e448e20d553252efc22be6e8318298).
Jan 15, 2021 12:29:17 AM org.apache.flink.runtime.taskexecutor.TaskExecutor unregisterTaskAndNotifyFinalState
INFO: Un-registering task and sending final execution state FINISHED to JobManager for task
MapPartition (MapPartition at [3]assert_that/{Group, Unkey, Match}) (1/1)#0 16fc4c374c0d055b0f90d89e60bfc967.
Jan 15, 2021 12:29:17 AM org.apache.flink.runtime.taskexecutor.TaskExecutor unregisterTaskAndNotifyFinalState
INFO: Un-registering task and sending final execution state FINISHED to JobManager for task
DataSink (DiscardingOutput) (1/1)#0 93e448e20d553252efc22be6e8318298.
Jan 15, 2021 12:29:18 AM org.apache.flink.runtime.executiongraph.Execution transitionState
INFO: MapPartition (MapPartition at [3]assert_that/{Group, Unkey, Match}) (1/1) (16fc4c374c0d055b0f90d89e60bfc967)
switched from RUNNING to FINISHED.
Jan 15, 2021 12:29:18 AM org.apache.flink.runtime.executiongraph.Execution transitionState
INFO: DataSink (DiscardingOutput) (1/1) (93e448e20d553252efc22be6e8318298) switched from RUNNING
to FINISHED.
Jan 15, 2021 12:29:18 AM org.apache.flink.runtime.executiongraph.ExecutionGraph transitionState
INFO: Job BeamApp-jenkins-0115002857-349f9e75 (71aad1f40a7f93beb35426da0c83fe26) switched
from state RUNNING to FINISHED.
Jan 15, 2021 12:29:18 AM org.apache.flink.runtime.dispatcher.Dispatcher jobReachedGloballyTerminalState
INFO: Job 71aad1f40a7f93beb35426da0c83fe26 reached globally terminal state FINISHED.
Jan 15, 2021 12:29:18 AM org.apache.flink.runtime.jobmaster.JobMaster onStop
INFO: Stopping the JobMaster for job BeamApp-jenkins-0115002857-349f9e75(71aad1f40a7f93beb35426da0c83fe26).
Jan 15, 2021 12:29:18 AM org.apache.flink.runtime.jobmaster.slotpool.SlotPoolImpl suspend
INFO: Suspending SlotPool.
Jan 15, 2021 12:29:18 AM org.apache.flink.runtime.jobmaster.JobMaster dissolveResourceManagerConnection
INFO: Close ResourceManager connection 479a8e6da9710660b33164442b101804: Stopping JobMaster
for job BeamApp-jenkins-0115002857-349f9e75(71aad1f40a7f93beb35426da0c83fe26)..
Jan 15, 2021 12:29:18 AM org.apache.flink.runtime.taskexecutor.slot.TaskSlotTableImpl freeSlotInternal
INFO: Free slot TaskSlot(index:0, state:ACTIVE, resource profile: ResourceProfile{managedMemory=128.000mb
(134217728 bytes), networkMemory=64.000mb (67108864 bytes)}, allocationId: d3c0e17a790641fe344a0e22336e6371,
jobId: 71aad1f40a7f93beb35426da0c83fe26).
Jan 15, 2021 12:29:18 AM org.apache.flink.runtime.jobmaster.slotpool.SlotPoolImpl close
INFO: Stopping SlotPool.
Jan 15, 2021 12:29:18 AM org.apache.flink.runtime.resourcemanager.ResourceManager closeJobManagerConnection
INFO: Disconnect job manager 8ac7252ed3a7b9b7a5daa67ae23d4799@akka://flink/user/rpc/jobmanager_3
for job 71aad1f40a7f93beb35426da0c83fe26 from the resource manager.
Jan 15, 2021 12:29:18 AM org.apache.flink.runtime.taskexecutor.DefaultJobLeaderService removeJob
INFO: Remove job 71aad1f40a7f93beb35426da0c83fe26 from job leader monitoring.
Jan 15, 2021 12:29:18 AM org.apache.flink.runtime.taskexecutor.TaskExecutor disconnectJobManagerConnection
INFO: Close JobManager connection for job 71aad1f40a7f93beb35426da0c83fe26.

> Task :sdks:python:test-suites:portable:py37:testUberJarFlinkRunnerSaveMainSession
Jan 15, 2021 12:29:17 AM org.apache.beam.runners.fnexecution.control.DefaultJobBundleFactory$WrappedSdkHarnessClient
close
WARNING: Error cleaning up servers urn: "beam:env:docker:v1"
payload: "\n$apache/beam_python3.7_sdk:2.28.0.dev"
capabilities: "beam:coder:bytes:v1"
capabilities: "beam:coder:string_utf8:v1"
capabilities: "beam:coder:kv:v1"
capabilities: "beam:coder:bool:v1"
capabilities: "beam:coder:varint:v1"
capabilities: "beam:coder:double:v1"
capabilities: "beam:coder:iterable:v1"
capabilities: "beam:coder:timer:v1"
capabilities: "beam:coder:interval_window:v1"
capabilities: "beam:coder:length_prefix:v1"
capabilities: "beam:coder:global_window:v1"
capabilities: "beam:coder:windowed_value:v1"
capabilities: "beam:coder:param_windowed_value:v1"
capabilities: "beam:coder:state_backed_iterable:v1"
capabilities: "beam:coder:row:v1"
capabilities: "beam:coder:sharded_key:v1"
capabilities: "beam:protocol:progress_reporting:v0"
capabilities: "beam:protocol:worker_status:v1"
capabilities: "beam:combinefn:packed_python:v1"
capabilities: "beam:version:sdk_base:apache/beam_python3.7_sdk:2.28.0.dev"
capabilities: "beam:transform:sdf_truncate_sized_restrictions:v1"
dependencies {
  type_urn: "beam:artifact:type:file:v1"
  type_payload: "\n\253\001classpath://BEAM-PIPELINE/pipeline/artifacts/job-7f1ef2db-0e5d-4f9f-9eab-7accbf0381d8/c5641798fb1ed014f6b291c9700104b5517c7e1015cbae513df97e9857363e37-pickled_main_session"
  role_urn: "beam:artifact:role:staging_to:v1"
  role_payload: "\n\024pickled_main_session"
}

java.io.IOException: Received exit code 1 for command 'docker kill e65fdb95424773d614eb00479c68a82d0ff80fade763b104358e73cdb8f3d6b6'.
stderr: Error response from daemon: Cannot kill container: e65fdb95424773d614eb00479c68a82d0ff80fade763b104358e73cdb8f3d6b6:
Container e65fdb95424773d614eb00479c68a82d0ff80fade763b104358e73cdb8f3d6b6 is not running
	at org.apache.beam.runners.fnexecution.environment.DockerCommand.runShortCommand(DockerCommand.java:237)
	at org.apache.beam.runners.fnexecution.environment.DockerCommand.runShortCommand(DockerCommand.java:171)
	at org.apache.beam.runners.fnexecution.environment.DockerCommand.killContainer(DockerCommand.java:151)
	at org.apache.beam.runners.fnexecution.environment.DockerContainerEnvironment.close(DockerContainerEnvironment.java:93)
	at org.apache.beam.runners.fnexecution.control.DefaultJobBundleFactory$WrappedSdkHarnessClient.$closeResource(DefaultJobBundleFactory.java:642)
	at org.apache.beam.runners.fnexecution.control.DefaultJobBundleFactory$WrappedSdkHarnessClient.close(DefaultJobBundleFactory.java:642)
	at org.apache.beam.runners.fnexecution.control.DefaultJobBundleFactory$WrappedSdkHarnessClient.unref(DefaultJobBundleFactory.java:658)
	at org.apache.beam.runners.fnexecution.control.DefaultJobBundleFactory$WrappedSdkHarnessClient.access$400(DefaultJobBundleFactory.java:589)
	at org.apache.beam.runners.fnexecution.control.DefaultJobBundleFactory.lambda$createEnvironmentCaches$3(DefaultJobBundleFactory.java:212)
	at org.apache.beam.vendor.guava.v26_0_jre.com.google.common.cache.LocalCache.processPendingNotifications(LocalCache.java:1809)
	at org.apache.beam.vendor.guava.v26_0_jre.com.google.common.cache.LocalCache$Segment.runUnlockedCleanup(LocalCache.java:3462)
	at org.apache.beam.vendor.guava.v26_0_jre.com.google.common.cache.LocalCache$Segment.postWriteCleanup(LocalCache.java:3438)
	at org.apache.beam.vendor.guava.v26_0_jre.com.google.common.cache.LocalCache$Segment.clear(LocalCache.java:3215)
	at org.apache.beam.vendor.guava.v26_0_jre.com.google.common.cache.LocalCache.clear(LocalCache.java:4270)
	at org.apache.beam.vendor.guava.v26_0_jre.com.google.common.cache.LocalCache$LocalManualCache.invalidateAll(LocalCache.java:4909)
	at org.apache.beam.runners.fnexecution.control.DefaultJobBundleFactory.close(DefaultJobBundleFactory.java:319)
	at org.apache.beam.runners.fnexecution.control.DefaultExecutableStageContext.close(DefaultExecutableStageContext.java:43)
	at org.apache.beam.runners.fnexecution.control.ReferenceCountingExecutableStageContextFactory$WrappedContext.closeActual(ReferenceCountingExecutableStageContextFactory.java:212)
	at org.apache.beam.runners.fnexecution.control.ReferenceCountingExecutableStageContextFactory$WrappedContext.access$200(ReferenceCountingExecutableStageContextFactory.java:188)
	at org.apache.beam.runners.fnexecution.control.ReferenceCountingExecutableStageContextFactory.release(ReferenceCountingExecutableStageContextFactory.java:177)
	at org.apache.beam.runners.fnexecution.control.ReferenceCountingExecutableStageContextFactory.scheduleRelease(ReferenceCountingExecutableStageContextFactory.java:136)
	at org.apache.beam.runners.fnexecution.control.ReferenceCountingExecutableStageContextFactory.access$300(ReferenceCountingExecutableStageContextFactory.java:48)
	at org.apache.beam.runners.fnexecution.control.ReferenceCountingExecutableStageContextFactory$WrappedContext.close(ReferenceCountingExecutableStageContextFactory.java:208)
	at org.apache.beam.runners.flink.translation.functions.FlinkExecutableStageFunction.$closeResource(FlinkExecutableStageFunction.java:268)
	at org.apache.beam.runners.flink.translation.functions.FlinkExecutableStageFunction.close(FlinkExecutableStageFunction.java:373)
	at org.apache.flink.api.common.functions.util.FunctionUtils.closeFunction(FunctionUtils.java:43)
	at org.apache.flink.runtime.operators.BatchTask.run(BatchTask.java:511)
	at org.apache.flink.runtime.operators.BatchTask.invoke(BatchTask.java:373)
	at org.apache.flink.runtime.taskmanager.Task.doRun(Task.java:722)
	at org.apache.flink.runtime.taskmanager.Task.run(Task.java:547)
	at java.lang.Thread.run(Thread.java:748)

Jan 15, 2021 12:29:17 AM org.apache.flink.runtime.taskmanager.Task transitionState
INFO: MapPartition (MapPartition at [3]assert_that/{Group, Unkey, Match}) (1/1)#0 (b3b6c723546f91b046c6d3835c5e95cb)
switched from RUNNING to FINISHED.
Jan 15, 2021 12:29:17 AM org.apache.flink.runtime.taskmanager.Task doRun
INFO: Freeing task resources for MapPartition (MapPartition at [3]assert_that/{Group, Unkey,
Match}) (1/1)#0 (b3b6c723546f91b046c6d3835c5e95cb).
Jan 15, 2021 12:29:17 AM org.apache.flink.runtime.taskmanager.Task transitionState
INFO: DataSink (DiscardingOutput) (1/1)#0 (764ca1e98127b59cdd38bb6637ebbfe9) switched from
RUNNING to FINISHED.
Jan 15, 2021 12:29:17 AM org.apache.flink.runtime.taskmanager.Task doRun
INFO: Freeing task resources for DataSink (DiscardingOutput) (1/1)#0 (764ca1e98127b59cdd38bb6637ebbfe9).
Jan 15, 2021 12:29:17 AM org.apache.flink.runtime.taskexecutor.TaskExecutor unregisterTaskAndNotifyFinalState
INFO: Un-registering task and sending final execution state FINISHED to JobManager for task
MapPartition (MapPartition at [3]assert_that/{Group, Unkey, Match}) (1/1)#0 b3b6c723546f91b046c6d3835c5e95cb.
Jan 15, 2021 12:29:17 AM org.apache.flink.runtime.taskexecutor.TaskExecutor unregisterTaskAndNotifyFinalState
INFO: Un-registering task and sending final execution state FINISHED to JobManager for task
DataSink (DiscardingOutput) (1/1)#0 764ca1e98127b59cdd38bb6637ebbfe9.
Jan 15, 2021 12:29:17 AM org.apache.flink.runtime.executiongraph.Execution transitionState
INFO: MapPartition (MapPartition at [3]assert_that/{Group, Unkey, Match}) (1/1) (b3b6c723546f91b046c6d3835c5e95cb)
switched from RUNNING to FINISHED.
Jan 15, 2021 12:29:17 AM org.apache.flink.runtime.executiongraph.Execution transitionState
INFO: DataSink (DiscardingOutput) (1/1) (764ca1e98127b59cdd38bb6637ebbfe9) switched from RUNNING
to FINISHED.
Jan 15, 2021 12:29:17 AM org.apache.flink.runtime.executiongraph.ExecutionGraph transitionState
INFO: Job BeamApp-jenkins-0115002856-ac8839bf (505886763cbbdf777bf414f829ca5358) switched
from state RUNNING to FINISHED.
Jan 15, 2021 12:29:17 AM org.apache.flink.runtime.dispatcher.Dispatcher jobReachedGloballyTerminalState
INFO: Job 505886763cbbdf777bf414f829ca5358 reached globally terminal state FINISHED.
Jan 15, 2021 12:29:17 AM org.apache.flink.runtime.jobmaster.JobMaster onStop
INFO: Stopping the JobMaster for job BeamApp-jenkins-0115002856-ac8839bf(505886763cbbdf777bf414f829ca5358).
Jan 15, 2021 12:29:17 AM org.apache.flink.runtime.jobmaster.slotpool.SlotPoolImpl suspend
INFO: Suspending SlotPool.
Jan 15, 2021 12:29:17 AM org.apache.flink.runtime.jobmaster.JobMaster dissolveResourceManagerConnection
INFO: Close ResourceManager connection fd7ba6a2798367ce69531e0c661ff48a: Stopping JobMaster
for job BeamApp-jenkins-0115002856-ac8839bf(505886763cbbdf777bf414f829ca5358)..
Jan 15, 2021 12:29:17 AM org.apache.flink.runtime.taskexecutor.slot.TaskSlotTableImpl freeSlotInternal
INFO: Free slot TaskSlot(index:0, state:ACTIVE, resource profile: ResourceProfile{managedMemory=128.000mb
(134217728 bytes), networkMemory=64.000mb (67108864 bytes)}, allocationId: 8dbf4a077e9f96f9b698630ed70a01d3,
jobId: 505886763cbbdf777bf414f829ca5358).
Jan 15, 2021 12:29:17 AM org.apache.flink.runtime.resourcemanager.ResourceManager closeJobManagerConnection
INFO: Disconnect job manager b9af6f882c393ff259b4af929aa7468a@akka://flink/user/rpc/jobmanager_3
for job 505886763cbbdf777bf414f829ca5358 from the resource manager.
Jan 15, 2021 12:29:17 AM org.apache.flink.runtime.jobmaster.slotpool.SlotPoolImpl close
INFO: Stopping SlotPool.
Jan 15, 2021 12:29:17 AM org.apache.flink.runtime.taskexecutor.DefaultJobLeaderService removeJob
INFO: Remove job 505886763cbbdf777bf414f829ca5358 from job leader monitoring.
Jan 15, 2021 12:29:17 AM org.apache.flink.runtime.taskexecutor.TaskExecutor disconnectJobManagerConnection
INFO: Close JobManager connection for job 505886763cbbdf777bf414f829ca5358.
INFO:apache_beam.runners.portability.portable_runner:Job state changed to DONE

kill %1 || echo "Failed to shut down Flink mini cluster"

rm -rf "$ENV_DIR"

>>> SUCCESS
if [[ "$TEST_EXIT_CODE" -eq 0 ]]; then
  echo ">>> SUCCESS"
else
  echo ">>> FAILURE"
fi
exit $TEST_EXIT_CODE

> Task :sdks:python:test-suites:portable:py36:testUberJarFlinkRunnerSaveMainSession
INFO:apache_beam.runners.portability.portable_runner:Job state changed to DONE

kill %1 || echo "Failed to shut down Flink mini cluster"

rm -rf "$ENV_DIR"

if [[ "$TEST_EXIT_CODE" -eq 0 ]]; then
>>> SUCCESS
  echo ">>> SUCCESS"
else
  echo ">>> FAILURE"
fi
exit $TEST_EXIT_CODE

FAILURE: Build completed with 2 failures.

1: Task failed with an exception.
-----------
* Where:
Script '<https://ci-beam.apache.org/job/beam_PostCommit_PortableJar_Flink/ws/src/sdks/python/test-suites/portable/common.gradle'>
line: 210

* What went wrong:
Execution failed for task ':sdks:python:test-suites:portable:py37:testJavaJarCreatorFlinkRunner'.
> Process 'command 'sh'' finished with non-zero exit value 1

* Try:
Run with --stacktrace option to get the stack trace. Run with --info or --debug option to
get more log output. Run with --scan to get full insights.
==============================================================================

2: Task failed with an exception.
-----------
* Where:
Script '<https://ci-beam.apache.org/job/beam_PostCommit_PortableJar_Flink/ws/src/sdks/python/test-suites/portable/common.gradle'>
line: 210

* What went wrong:
Execution failed for task ':sdks:python:test-suites:portable:py36:testJavaJarCreatorFlinkRunner'.
> Process 'command 'sh'' finished with non-zero exit value 1

* Try:
Run with --stacktrace option to get the stack trace. Run with --info or --debug option to
get more log output. Run with --scan to get full insights.
==============================================================================

* Get more help at https://help.gradle.org

Deprecated Gradle features were used in this build, making it incompatible with Gradle 7.0.
Use '--warning-mode all' to show the individual deprecation warnings.
See https://docs.gradle.org/6.7.1/userguide/command_line_interface.html#sec:command_line_warnings

BUILD FAILED in 28m 59s
160 actionable tasks: 146 executed, 11 from cache, 3 up-to-date
Gradle was unable to watch the file system for changes. The inotify watches limit is too low.

Publishing build scan...
https://gradle.com/s/fzmni57qln5wy

Build step 'Invoke Gradle script' changed build result to FAILURE
Build step 'Invoke Gradle script' marked build as failure

---------------------------------------------------------------------
To unsubscribe, e-mail: builds-unsubscribe@beam.apache.org
For additional commands, e-mail: builds-help@beam.apache.org


Mime
View raw message