beam-builds mailing list archives

Site index · List index
Message view « Date » · « Thread »
Top « Date » · « Thread »
From Apache Jenkins Server <jenk...@builds.apache.org>
Subject Build failed in Jenkins: beam_PostCommit_Java_ValidatesRunner_SparkStructuredStreaming #2606
Date Thu, 28 Jan 2021 00:28:18 GMT
See <https://ci-beam.apache.org/job/beam_PostCommit_Java_ValidatesRunner_SparkStructuredStreaming/2606/display/redirect?page=changes>

Changes:

[sonam.ramchand] Enabled strict dependency on flink runner

[sonam.ramchand] Added new line

[sonam.ramchand] removed checker-qual

[sonam.ramchand] Removed flink-clients dep

[sonam.ramchand] set enableStrictDependencies:true

[sonam.ramchand] made flink-clients runtimeOnly

[noreply] Remove stray colon.

[zyichi] [BEAM-11679] Override PubsubUnboundedSource transform for dataflow

[zyichi] Populate PubsubMessage message id

[zyichi] Enable tests

[zyichi] Exclude failing FhirIO ITs

[zyichi] Include runner v2 IT tests in java post commit

[Ismaël Mejía] [BEAM-11697] Upgrade Flink runner to Flink versions 1.12.1 and 1.11.3

[shehzaad] strict dependency checking on sdks/io/amazon-web-services*

[shehzaad] move amazon-web-services* changes to another PR

[shehzaad] undo previous erroneous commit

[shehzaad] better use of variables

[randomstep] [BEAM-8725] bump snappy-java to 1.1.8.4

[nielm] Add BigDecimal support for SpannerIO

[noreply] [BEAM-11695] Remove translations.pack_combiners from default optimizers

[Kyle Weaver] [BEAM-11689] Add public.nexus.pentaho.org to offline repositories.

[Chamikara Madhusanka Jayalath] Moving to 2.29.0-SNAPSHOT on master branch.

[noreply] [BEAM-11531] Add pd.to_datetime, handle DeferredBase args in

[Andrew Pilloud] [BEAM-11165] Async ZetaSQL Calc

[noreply] [BEAM-11695] Combiner packing in Dataflow (#13763)


------------------------------------------
[...truncated 32.35 KB...]
> Task :sdks:java:testing:test-utils:compileJava
> Task :sdks:java:extensions:protobuf:compileJava
> Task :sdks:java:io:hadoop-common:classes
> Task :sdks:java:io:hadoop-common:jar

> Task :sdks:java:io:common:compileTestJava
Note: Some input files use or override a deprecated API.
Note: Recompile with -Xlint:deprecation for details.

> Task :sdks:java:io:common:testClasses
> Task :sdks:java:io:common:testJar
> Task :sdks:java:testing:test-utils:classes
> Task :sdks:java:testing:test-utils:jar
> Task :sdks:java:io:hadoop-format:compileJava

> Task :sdks:java:fn-execution:compileJava
Note: <https://ci-beam.apache.org/job/beam_PostCommit_Java_ValidatesRunner_SparkStructuredStreaming/ws/src/sdks/java/fn-execution/src/main/java/org/apache/beam/sdk/fn/data/BeamFnDataSizeBasedBufferingOutboundObserver.java>
uses or overrides a deprecated API.
Note: Recompile with -Xlint:deprecation for details.
Note: Some input files use unchecked or unsafe operations.
Note: Recompile with -Xlint:unchecked for details.
Unable to watch the file system for changes. The inotify watches limit is too low.

> Task :sdks:java:fn-execution:classes
> Task :sdks:java:fn-execution:jar
> Task :sdks:java:testing:test-utils:compileTestJava
> Task :sdks:java:testing:test-utils:testClasses
> Task :sdks:java:testing:test-utils:testJar

> Task :sdks:java:io:jdbc:compileJava
Note: <https://ci-beam.apache.org/job/beam_PostCommit_Java_ValidatesRunner_SparkStructuredStreaming/ws/src/sdks/java/io/jdbc/src/main/java/org/apache/beam/sdk/io/jdbc/JdbcIO.java>
uses or overrides a deprecated API.
Note: Recompile with -Xlint:deprecation for details.
Note: Some input files use unchecked or unsafe operations.
Note: Recompile with -Xlint:unchecked for details.

> Task :sdks:java:io:jdbc:classes
> Task :sdks:java:io:jdbc:jar
> Task :runners:core-construction-java:compileJava
> Task :sdks:java:io:hadoop-format:classes
> Task :sdks:java:io:hadoop-format:jar

> Task :vendor:sdks-java-extensions-protobuf:compileJava
Note: Some input files use or override a deprecated API.
Note: Recompile with -Xlint:deprecation for details.
Note: Some input files use unchecked or unsafe operations.
Note: Recompile with -Xlint:unchecked for details.

> Task :vendor:sdks-java-extensions-protobuf:classes

> Task :sdks:java:extensions:protobuf:compileJava
Note: Some input files use or override a deprecated API.
Note: Recompile with -Xlint:deprecation for details.
Note: Some input files use unchecked or unsafe operations.
Note: Recompile with -Xlint:unchecked for details.

> Task :sdks:java:extensions:protobuf:classes
> Task :sdks:java:extensions:protobuf:jar
> Task :vendor:sdks-java-extensions-protobuf:shadowJar FROM-CACHE

> Task :sdks:java:core:compileTestJava
Note: Some input files use or override a deprecated API.
Note: Recompile with -Xlint:deprecation for details.
Note: Some input files use unchecked or unsafe operations.
Note: Recompile with -Xlint:unchecked for details.

> Task :sdks:java:core:testClasses
> Task :sdks:java:core:shadowTestJar

> Task :runners:core-construction-java:compileJava
Note: Some input files use or override a deprecated API.
Note: Recompile with -Xlint:deprecation for details.
Note: Some input files use unchecked or unsafe operations.
Note: Recompile with -Xlint:unchecked for details.

> Task :runners:core-construction-java:classes
> Task :runners:core-construction-java:jar
> Task :runners:core-java:compileJava
Note: Some input files use or override a deprecated API.
Note: Recompile with -Xlint:deprecation for details.
Note: Some input files use unchecked or unsafe operations.
Note: Recompile with -Xlint:unchecked for details.

> Task :runners:core-java:classes
> Task :runners:core-java:jar
> Task :sdks:java:extensions:google-cloud-platform-core:compileJava
> Task :runners:core-java:compileTestJava

> Task :sdks:java:extensions:google-cloud-platform-core:compileJava
Note: Some input files use or override a deprecated API.
Note: Recompile with -Xlint:deprecation for details.

> Task :sdks:java:extensions:google-cloud-platform-core:classes
> Task :sdks:java:extensions:google-cloud-platform-core:jar
> Task :sdks:java:harness:compileJava

> Task :runners:core-java:compileTestJava
Note: Some input files use or override a deprecated API.
Note: Recompile with -Xlint:deprecation for details.
Note: Some input files use unchecked or unsafe operations.
Note: Recompile with -Xlint:unchecked for details.

> Task :runners:core-java:testClasses
> Task :runners:core-java:testJar

> Task :sdks:java:harness:compileJava
Note: Some input files use or override a deprecated API.
Note: Recompile with -Xlint:deprecation for details.
Note: Some input files use unchecked or unsafe operations.
Note: Recompile with -Xlint:unchecked for details.

> Task :sdks:java:harness:classes
> Task :sdks:java:harness:jar
> Task :sdks:java:harness:shadowJar
> Task :runners:java-fn-execution:compileJava
Note: Some input files use or override a deprecated API.
Note: Recompile with -Xlint:deprecation for details.
Note: Some input files use unchecked or unsafe operations.
Note: Recompile with -Xlint:unchecked for details.

> Task :runners:java-fn-execution:classes
> Task :runners:java-fn-execution:jar

> Task :sdks:java:expansion-service:compileJava
Note: <https://ci-beam.apache.org/job/beam_PostCommit_Java_ValidatesRunner_SparkStructuredStreaming/ws/src/sdks/java/expansion-service/src/main/java/org/apache/beam/sdk/expansion/service/ExpansionService.java>
uses unchecked or unsafe operations.
Note: Recompile with -Xlint:unchecked for details.

> Task :sdks:java:expansion-service:classes
> Task :sdks:java:expansion-service:jar
> Task :runners:direct-java:compileJava
> Task :sdks:java:extensions:ml:compileJava
> Task :sdks:java:io:google-cloud-platform:compileJava
> Task :sdks:java:io:kafka:compileJava
> Task :runners:java-job-service:compileJava
> Task :sdks:java:extensions:ml:classes
> Task :sdks:java:extensions:ml:jar

> Task :runners:java-job-service:compileJava
Note: <https://ci-beam.apache.org/job/beam_PostCommit_Java_ValidatesRunner_SparkStructuredStreaming/ws/src/runners/java-job-service/src/main/java/org/apache/beam/runners/jobsubmission/PortablePipelineJarCreator.java>
uses unchecked or unsafe operations.
Note: Recompile with -Xlint:unchecked for details.

> Task :runners:java-job-service:classes
> Task :runners:java-job-service:jar
> Task :runners:spark:compileJava

> Task :sdks:java:io:kafka:compileJava
Note: Some input files use or override a deprecated API.
Note: Recompile with -Xlint:deprecation for details.
Note: Some input files use unchecked or unsafe operations.
Note: Recompile with -Xlint:unchecked for details.

> Task :sdks:java:io:kafka:classes
> Task :sdks:java:io:kafka:jar

> Task :runners:direct-java:compileJava
Note: Some input files use or override a deprecated API.
Note: Recompile with -Xlint:deprecation for details.
Note: Some input files use unchecked or unsafe operations.
Note: Recompile with -Xlint:unchecked for details.

> Task :runners:direct-java:classes
> Task :runners:direct-java:shadowJar

> Task :runners:spark:compileJava
Note: Some input files use or override a deprecated API.
Note: Recompile with -Xlint:deprecation for details.
Note: Some input files use unchecked or unsafe operations.
Note: Recompile with -Xlint:unchecked for details.

> Task :runners:spark:classes
> Task :runners:spark:jar
> Task :runners:spark:compileTestJava
Note: Some input files use or override a deprecated API.
Note: Recompile with -Xlint:deprecation for details.
Note: Some input files use unchecked or unsafe operations.
Note: Recompile with -Xlint:unchecked for details.

> Task :runners:spark:testClasses
> Task :runners:spark:testJar

> Task :sdks:java:io:google-cloud-platform:compileJava
Note: Some input files use or override a deprecated API.
Note: Recompile with -Xlint:deprecation for details.
Note: Some input files use unchecked or unsafe operations.
Note: Recompile with -Xlint:unchecked for details.

> Task :sdks:java:io:google-cloud-platform:classes
> Task :sdks:java:io:google-cloud-platform:jar
> Task :examples:java:compileJava
Note: Some input files use or override a deprecated API.
Note: Recompile with -Xlint:deprecation for details.
Note: Some input files use unchecked or unsafe operations.
Note: Recompile with -Xlint:unchecked for details.

> Task :examples:java:classes
> Task :examples:java:jar

> Task :examples:java:compileTestJava
Note: Some input files use or override a deprecated API.
Note: Recompile with -Xlint:deprecation for details.
Note: Some input files use unchecked or unsafe operations.
Note: Recompile with -Xlint:unchecked for details.

> Task :examples:java:testClasses
> Task :examples:java:testJar

> Task :sdks:java:io:hadoop-format:compileTestJava
Note: Some input files use or override a deprecated API.
Note: Recompile with -Xlint:deprecation for details.

> Task :sdks:java:io:hadoop-format:testClasses
> Task :runners:spark:validatesStructuredStreamingRunnerBatch

org.apache.beam.sdk.transforms.GroupByKeyTest > org.apache.beam.sdk.transforms.GroupByKeyTest$BasicTests.testGroupByKeyWithBadEqualsHashCode
FAILED
    org.apache.beam.sdk.Pipeline$PipelineExecutionException at GroupByKeyTest.java:452
        Caused by: java.lang.IllegalAccessError at null:-1

org.apache.beam.sdk.transforms.GroupByKeyTest > org.apache.beam.sdk.transforms.GroupByKeyTest$BasicTests.testLargeKeys100MB
FAILED
    org.apache.beam.sdk.Pipeline$PipelineExecutionException at GroupByKeyTest.java:482
        Caused by: java.lang.OutOfMemoryError at null:-1

199 tests completed, 2 failed, 1 skipped

> Task :runners:spark:validatesStructuredStreamingRunnerBatch FAILED

FAILURE: Build failed with an exception.

* What went wrong:
Execution failed for task ':runners:spark:validatesStructuredStreamingRunnerBatch'.
> Process 'Gradle Test Executor 229' finished with non-zero exit value 52
  This problem might be caused by incorrect test process configuration.
  Please refer to the test execution section in the User Manual at https://docs.gradle.org/6.8/userguide/java_testing.html#sec:test_execution

* Try:
Run with --stacktrace option to get the stack trace. Run with --info or --debug option to
get more log output. Run with --scan to get full insights.

* Get more help at https://help.gradle.org

Deprecated Gradle features were used in this build, making it incompatible with Gradle 7.0.
Use '--warning-mode all' to show the individual deprecation warnings.
See https://docs.gradle.org/6.8/userguide/command_line_interface.html#sec:command_line_warnings

BUILD FAILED in 27m 51s
115 actionable tasks: 108 executed, 7 from cache
Gradle was unable to watch the file system for changes. The inotify watches limit is too low.

Publishing build scan...
https://gradle.com/s/tbenadz46pqme

Build step 'Invoke Gradle script' changed build result to FAILURE
Build step 'Invoke Gradle script' marked build as failure

---------------------------------------------------------------------
To unsubscribe, e-mail: builds-unsubscribe@beam.apache.org
For additional commands, e-mail: builds-help@beam.apache.org


Mime
View raw message