beam-builds mailing list archives

Site index · List index
Message view « Date » · « Thread »
Top « Date » · « Thread »
From Apache Jenkins Server <jenk...@builds.apache.org>
Subject Build failed in Jenkins: beam_PostCommit_Go_VR_Flink #4289
Date Thu, 21 Jan 2021 12:29:00 GMT
See <https://ci-beam.apache.org/job/beam_PostCommit_Go_VR_Flink/4289/display/redirect>

Changes:


------------------------------------------
[...truncated 269.67 KB...]
        urn: "beam:coder:length_prefix:v1"
      >
      component_coder_ids: "c13"
    >
  >
  coders: <
    key: "c15"
    value: <
      spec: <
        urn: "beam:coder:iterable:v1"
      >
      component_coder_ids: "c14"
    >
  >
  coders: <
    key: "c16"
    value: <
      spec: <
        urn: "beam:coder:kv:v1"
      >
      component_coder_ids: "c7"
      component_coder_ids: "c15"
    >
  >
  coders: <
    key: "c17"
    value: <
      spec: <
        urn: "beam:coder:kv:v1"
      >
      component_coder_ids: "c3"
      component_coder_ids: "c3"
    >
  >
  coders: <
    key: "c18"
    value: <
      spec: <
        urn: "beam:coder:iterable:v1"
      >
      component_coder_ids: "c3"
    >
  >
  coders: <
    key: "c19"
    value: <
      spec: <
        urn: "beam:coder:kv:v1"
      >
      component_coder_ids: "c3"
      component_coder_ids: "c18"
    >
  >
  coders: <
    key: "c2"
    value: <
      spec: <
        urn: "beam:go:coder:custom:v1"
        payload: "Cgd2YXJpbnR6EgIIAhqFAQpxZ2l0aHViLmNvbS9hcGFjaGUvYmVhbS9zZGtzL2dvL3Rlc3QvdmVuZG9yL2dpdGh1Yi5jb20vYXBhY2hlL2JlYW0vc2Rrcy9nby9wa2cvYmVhbS9jb3JlL3J1bnRpbWUvY29kZXJ4LmVuY1ZhckludFoSEAgWIgQIGUAPKgYIFBICCAgikQEKcWdpdGh1Yi5jb20vYXBhY2hlL2JlYW0vc2Rrcy9nby90ZXN0L3ZlbmRvci9naXRodWIuY29tL2FwYWNoZS9iZWFtL3Nka3MvZ28vcGtnL2JlYW0vY29yZS9ydW50aW1lL2NvZGVyeC5kZWNWYXJJbnRaEhwIFiIECBlAAyIGCBQSAggIKgQIGUAPKgQIGUAB"
      >
    >
  >
  coders: <
    key: "c3"
    value: <
      spec: <
        urn: "beam:coder:length_prefix:v1"
      >
      component_coder_ids: "c2"
    >
  >
  coders: <
    key: "c4"
    value: <
      spec: <
        urn: "beam:coder:kv:v1"
      >
      component_coder_ids: "c3"
      component_coder_ids: "c0"
    >
  >
  coders: <
    key: "c5"
    value: <
      spec: <
        urn: "beam:coder:iterable:v1"
      >
      component_coder_ids: "c0"
    >
  >
  coders: <
    key: "c6"
    value: <
      spec: <
        urn: "beam:coder:kv:v1"
      >
      component_coder_ids: "c3"
      component_coder_ids: "c5"
    >
  >
  coders: <
    key: "c7"
    value: <
      spec: <
        urn: "beam:coder:string_utf8:v1"
      >
    >
  >
  coders: <
    key: "c8"
    value: <
      spec: <
        urn: "beam:coder:kv:v1"
      >
      component_coder_ids: "c7"
      component_coder_ids: "c3"
    >
  >
  coders: <
    key: "c9"
    value: <
      spec: <
        urn: "beam:coder:kv:v1"
      >
      component_coder_ids: "c7"
      component_coder_ids: "c7"
    >
  >
  environments: <
    key: "go"
    value: <
      urn: "beam:env:docker:v1"
      payload: "\nAus.gcr.io/apache-beam-testing/jenkins/beam_go_sdk:20210121-120554"
      capabilities: "beam:protocol:progress_reporting:v0"
      capabilities: "beam:protocol:multi_core_bundle_processing:v1"
      capabilities: "beam:version:sdk_base:go"
      capabilities: "beam:coder:bytes:v1"
      capabilities: "beam:coder:bool:v1"
      capabilities: "beam:coder:varint:v1"
      capabilities: "beam:coder:double:v1"
      capabilities: "beam:coder:string_utf8:v1"
      capabilities: "beam:coder:length_prefix:v1"
      capabilities: "beam:coder:kv:v1"
      capabilities: "beam:coder:iterable:v1"
      capabilities: "beam:coder:state_backed_iterable:v1"
      capabilities: "beam:coder:windowed_value:v1"
      capabilities: "beam:coder:global_window:v1"
      capabilities: "beam:coder:interval_window:v1"
      dependencies: <
        type_urn: "beam:artifact:type:go_worker_binary:v1"
        role_urn: "beam:artifact:role:staging_to:v1"
        role_payload: "\n\006worker"
      >
    >
  >
>
root_transform_ids: "e5"
root_transform_ids: "e3"
root_transform_ids: "e1"
root_transform_ids: "s1"
root_transform_ids: "e11_reshuffle"
root_transform_ids: "e12"
root_transform_ids: "s5"
root_transform_ids: "s3"
root_transform_ids: "s4"
root_transform_ids: "s2"
2021/01/21 12:28:55 Test reshuffle:reshufflekv failed: 	connecting to job service
failed to dial server at localhost:40749
	caused by:
context deadline exceeded
2021/01/21 12:28:55 Result: 11 tests failed

if [[ ! -z "$JOB_PORT" ]]; then
  # Shut down the job server
  kill %1 || echo "Failed to shut down job server"
fi

if [[ "$PUSH_CONTAINER_TO_GCR" = 'yes' ]]; then
  # Delete the container locally and remotely
  docker rmi $CONTAINER:$TAG || echo "Failed to remove container"
  gcloud --quiet container images delete $CONTAINER:$TAG || echo "Failed to delete container"

  # Clean up tempdir
  rm -rf $TMPDIR
fi
Untagged: us.gcr.io/apache-beam-testing/jenkins/beam_go_sdk:20210121-120554
Untagged: us.gcr.io/apache-beam-testing/jenkins/beam_go_sdk@sha256:154ca8e633f68268611672f81c8132bf2b8bf54d60b6ad40f2e826633a7c80e2
Deleted: sha256:85ee9d1a50a668a250b67c55e584ee596c37b5b4b327ff2452d7978d1eb355ef
Deleted: sha256:9d909060b4f8b70bc7c91a551b3b8f3c1f61701e3018c84470583749996c5d22
Deleted: sha256:9a2c16c26e9913410a772e5416993984882fb1bbc02985f4efa29831f574b04d
Deleted: sha256:115e2a5c2a2b16252023003c88585e3050de192720675a9046a73d796cb9aad8
Deleted: sha256:a18a5959dafd114c91861d07c24ccb2e6b784ac07ac61832715d3097ab3b30b8
Deleted: sha256:e28759678162a80928d40de4b34bad77280b3ca9b0ee09a1af135e63d6aa1856
Deleted: sha256:1aa1d89897481625dd35124e8dddafc32e82d33f2a011899794e56f53bb0d288
Deleted: sha256:78964e29a1e5aa26caa475c3643faa0f6d90ba5d3c75d7e3ee34a270a7154723
Deleted: sha256:c32ac2f7b5bd157984226d4a5a251afd1ab861ead08096449f5d57c20861c103
Deleted: sha256:d6ecebb796b55f75291099b18bc02216a71d991e6e600cdd253b3754dea7206a
Deleted: sha256:135c83948ecef238804aee1cc83163c5da3a209d62a98c13a4ff9bca332d3735
Deleted: sha256:8f247754df73a1acc7a079eeb8cde4ecc3a3bb7da59182b0cceca8f3e25d81ef
Deleted: sha256:8cc1d98c7a60f859acf9133fba5252a6a18d5908de48cbcc65eea31a60395373
Deleted: sha256:b33986987b0515307a99522a4c9865896eba7ab984e9cc388a957f7b22e0119c
Deleted: sha256:29b0c518b5bab815a0f68010bd3c081a55934a00973031f310972c8516f1e97f
Deleted: sha256:c4ce9ee30e4bc54f376619fc9284165590662fea3dbd56d0a164484be98c706e
Deleted: sha256:369e4a241ab34cf2becc89886b1dc948f4cd69a1b4d7856716369edb6d16d41c
Digests:
- us.gcr.io/apache-beam-testing/jenkins/beam_go_sdk@sha256:154ca8e633f68268611672f81c8132bf2b8bf54d60b6ad40f2e826633a7c80e2
  Associated tags:
 - 20210121-120554
Tags:
- us.gcr.io/apache-beam-testing/jenkins/beam_go_sdk:20210121-120554
Deleted [us.gcr.io/apache-beam-testing/jenkins/beam_go_sdk:20210121-120554].
Deleted [us.gcr.io/apache-beam-testing/jenkins/beam_go_sdk@sha256:154ca8e633f68268611672f81c8132bf2b8bf54d60b6ad40f2e826633a7c80e2].

if [[ "$TEST_EXIT_CODE" -eq 0 ]]; then
  echo ">>> SUCCESS"
else
  echo ">>> FAILURE"
fi
>>> FAILURE
exit $TEST_EXIT_CODE

> Task :sdks:go:test:flinkValidatesRunner FAILED

FAILURE: Build failed with an exception.

* Where:
Build file '<https://ci-beam.apache.org/job/beam_PostCommit_Go_VR_Flink/ws/src/sdks/go/test/build.gradle'>
line: 150

* What went wrong:
Execution failed for task ':sdks:go:test:flinkValidatesRunner'.
> Process 'command 'sh'' finished with non-zero exit value 1

* Try:
Run with --stacktrace option to get the stack trace. Run with --info or --debug option to
get more log output. Run with --scan to get full insights.

* Get more help at https://help.gradle.org

Deprecated Gradle features were used in this build, making it incompatible with Gradle 7.0.
Use '--warning-mode all' to show the individual deprecation warnings.
See https://docs.gradle.org/6.8/userguide/command_line_interface.html#sec:command_line_warnings

BUILD FAILED in 28m 36s
130 actionable tasks: 88 executed, 42 from cache

Publishing build scan...
https://gradle.com/s/ycf7qygyb45is

Build step 'Invoke Gradle script' changed build result to FAILURE
Build step 'Invoke Gradle script' marked build as failure

---------------------------------------------------------------------
To unsubscribe, e-mail: builds-unsubscribe@beam.apache.org
For additional commands, e-mail: builds-help@beam.apache.org


Mime
View raw message