beam-builds mailing list archives

Site index · List index
Message view « Date » · « Thread »
Top « Date » · « Thread »
From Apache Jenkins Server <jenk...@builds.apache.org>
Subject Build failed in Jenkins: beam_PostCommit_Go_VR_Flink #4313
Date Wed, 27 Jan 2021 12:29:25 GMT
See <https://ci-beam.apache.org/job/beam_PostCommit_Go_VR_Flink/4313/display/redirect>

Changes:


------------------------------------------
[...truncated 269.41 KB...]
        urn: "beam:coder:length_prefix:v1"
      >
      component_coder_ids: "c13"
    >
  >
  coders: <
    key: "c15"
    value: <
      spec: <
        urn: "beam:coder:iterable:v1"
      >
      component_coder_ids: "c14"
    >
  >
  coders: <
    key: "c16"
    value: <
      spec: <
        urn: "beam:coder:kv:v1"
      >
      component_coder_ids: "c7"
      component_coder_ids: "c15"
    >
  >
  coders: <
    key: "c17"
    value: <
      spec: <
        urn: "beam:coder:kv:v1"
      >
      component_coder_ids: "c3"
      component_coder_ids: "c3"
    >
  >
  coders: <
    key: "c18"
    value: <
      spec: <
        urn: "beam:coder:iterable:v1"
      >
      component_coder_ids: "c3"
    >
  >
  coders: <
    key: "c19"
    value: <
      spec: <
        urn: "beam:coder:kv:v1"
      >
      component_coder_ids: "c3"
      component_coder_ids: "c18"
    >
  >
  coders: <
    key: "c2"
    value: <
      spec: <
        urn: "beam:go:coder:custom:v1"
        payload: "Cgd2YXJpbnR6EgIIAhqFAQpxZ2l0aHViLmNvbS9hcGFjaGUvYmVhbS9zZGtzL2dvL3Rlc3QvdmVuZG9yL2dpdGh1Yi5jb20vYXBhY2hlL2JlYW0vc2Rrcy9nby9wa2cvYmVhbS9jb3JlL3J1bnRpbWUvY29kZXJ4LmVuY1ZhckludFoSEAgWIgQIGUAPKgYIFBICCAgikQEKcWdpdGh1Yi5jb20vYXBhY2hlL2JlYW0vc2Rrcy9nby90ZXN0L3ZlbmRvci9naXRodWIuY29tL2FwYWNoZS9iZWFtL3Nka3MvZ28vcGtnL2JlYW0vY29yZS9ydW50aW1lL2NvZGVyeC5kZWNWYXJJbnRaEhwIFiIECBlAAyIGCBQSAggIKgQIGUAPKgQIGUAB"
      >
    >
  >
  coders: <
    key: "c3"
    value: <
      spec: <
        urn: "beam:coder:length_prefix:v1"
      >
      component_coder_ids: "c2"
    >
  >
  coders: <
    key: "c4"
    value: <
      spec: <
        urn: "beam:coder:kv:v1"
      >
      component_coder_ids: "c3"
      component_coder_ids: "c0"
    >
  >
  coders: <
    key: "c5"
    value: <
      spec: <
        urn: "beam:coder:iterable:v1"
      >
      component_coder_ids: "c0"
    >
  >
  coders: <
    key: "c6"
    value: <
      spec: <
        urn: "beam:coder:kv:v1"
      >
      component_coder_ids: "c3"
      component_coder_ids: "c5"
    >
  >
  coders: <
    key: "c7"
    value: <
      spec: <
        urn: "beam:coder:string_utf8:v1"
      >
    >
  >
  coders: <
    key: "c8"
    value: <
      spec: <
        urn: "beam:coder:kv:v1"
      >
      component_coder_ids: "c7"
      component_coder_ids: "c3"
    >
  >
  coders: <
    key: "c9"
    value: <
      spec: <
        urn: "beam:coder:kv:v1"
      >
      component_coder_ids: "c7"
      component_coder_ids: "c7"
    >
  >
  environments: <
    key: "go"
    value: <
      urn: "beam:env:docker:v1"
      payload: "\nAus.gcr.io/apache-beam-testing/jenkins/beam_go_sdk:20210127-120458"
      capabilities: "beam:protocol:progress_reporting:v0"
      capabilities: "beam:protocol:multi_core_bundle_processing:v1"
      capabilities: "beam:version:sdk_base:go"
      capabilities: "beam:coder:bytes:v1"
      capabilities: "beam:coder:bool:v1"
      capabilities: "beam:coder:varint:v1"
      capabilities: "beam:coder:double:v1"
      capabilities: "beam:coder:string_utf8:v1"
      capabilities: "beam:coder:length_prefix:v1"
      capabilities: "beam:coder:kv:v1"
      capabilities: "beam:coder:iterable:v1"
      capabilities: "beam:coder:state_backed_iterable:v1"
      capabilities: "beam:coder:windowed_value:v1"
      capabilities: "beam:coder:global_window:v1"
      capabilities: "beam:coder:interval_window:v1"
      dependencies: <
        type_urn: "beam:artifact:type:go_worker_binary:v1"
        role_urn: "beam:artifact:role:staging_to:v1"
        role_payload: "\n\006worker"
      >
    >
  >
>
root_transform_ids: "e1"
root_transform_ids: "e3"
root_transform_ids: "e5"
root_transform_ids: "s1"
root_transform_ids: "e11_reshuffle"
root_transform_ids: "e12"
root_transform_ids: "s4"
root_transform_ids: "s2"
root_transform_ids: "s5"
root_transform_ids: "s3"
2021/01/27 12:29:20 Test reshuffle:reshufflekv failed: 	connecting to job service
failed to dial server at localhost:45175
	caused by:
context deadline exceeded
2021/01/27 12:29:20 Result: 11 tests failed

if [[ ! -z "$JOB_PORT" ]]; then
  # Shut down the job server
  kill %1 || echo "Failed to shut down job server"
fi

if [[ "$PUSH_CONTAINER_TO_GCR" = 'yes' ]]; then
  # Delete the container locally and remotely
  docker rmi $CONTAINER:$TAG || echo "Failed to remove container"
  gcloud --quiet container images delete $CONTAINER:$TAG || echo "Failed to delete container"

  # Clean up tempdir
  rm -rf $TMPDIR
fi
Untagged: us.gcr.io/apache-beam-testing/jenkins/beam_go_sdk:20210127-120458
Untagged: us.gcr.io/apache-beam-testing/jenkins/beam_go_sdk@sha256:43706ca5fde9a21930e8501015e3d1ef2aca227053e3aa4b67b0f023b30b5cf1
Deleted: sha256:26c6574b1a081263d1c32112d4a5f03bf0f4d1ab62cd783ca3f59dfcd6afa0c8
Deleted: sha256:eafece8bed1bce62f29487d5c842832bb669ba85a5b9a495c6de11003ce00ef6
Deleted: sha256:3af52b47838657dec7b19f891e5e00779a6da00c0bd2140026b99f478276795a
Deleted: sha256:27dadb56c90f181eaa6ef8633693de7f2e8711c22c06e2a3f943ef116d524310
Deleted: sha256:fbbdc2b0372fce198b68be411fe7bf313ecf1b73e7680175aa93596f56d28096
Deleted: sha256:6f7220b6253fb0e60fd9dc9d6b7c77231b270291a9666d63154d2b4a1876f2a5
Deleted: sha256:f09b61b8d72faebf5d0bc3527f9718968436040f5b4085b6876709c91a3ec25e
Deleted: sha256:73d481cd8a0616446e6738035840391155dc84ad0508c1f55b2bec9583b519de
Deleted: sha256:9832526e7a42c4e0267af9670e535e20de33942aed8734bc106c499ffd0f3a37
Deleted: sha256:e1926938c1075bfa8da9d60c2079ed17c2241378911034145a65c10c90cfff67
Deleted: sha256:d04f130c66e3c2f743d78259f236ffe39f749b0c6173ae6311553d689e61838f
Deleted: sha256:526f0fc962e57eb09f8c830b8d5e7cedb63df2125fcc36d51e34bf51c3ece94b
Deleted: sha256:5adcf2ea34eb511d6c1a86721ede19c5d13d23d2970c2f4fd2bc0415cb7a1bf5
Deleted: sha256:64ddd3db5201fbc9b6a3615cfe750bb8315af26a9dc6bc8b6bded46c7dd178c2
Deleted: sha256:28e51be743f1d2ac9fd7662728544614c917b9c372681ccb30fe596ace4c8d94
Deleted: sha256:610170a3b82f8c8f6b9923ce66e9a56d51db350495a15a2db838a6227e83d714
Deleted: sha256:31a622139815fc4eb991469e2746d1b15d14b718889b3a0cf37ade24798812d9
Digests:
- us.gcr.io/apache-beam-testing/jenkins/beam_go_sdk@sha256:43706ca5fde9a21930e8501015e3d1ef2aca227053e3aa4b67b0f023b30b5cf1
  Associated tags:
 - 20210127-120458
Tags:
- us.gcr.io/apache-beam-testing/jenkins/beam_go_sdk:20210127-120458
Deleted [us.gcr.io/apache-beam-testing/jenkins/beam_go_sdk:20210127-120458].
Deleted [us.gcr.io/apache-beam-testing/jenkins/beam_go_sdk@sha256:43706ca5fde9a21930e8501015e3d1ef2aca227053e3aa4b67b0f023b30b5cf1].

if [[ "$TEST_EXIT_CODE" -eq 0 ]]; then
>>> FAILURE
  echo ">>> SUCCESS"
else
  echo ">>> FAILURE"
fi
exit $TEST_EXIT_CODE

> Task :sdks:go:test:flinkValidatesRunner FAILED

FAILURE: Build failed with an exception.

* Where:
Build file '<https://ci-beam.apache.org/job/beam_PostCommit_Go_VR_Flink/ws/src/sdks/go/test/build.gradle'>
line: 150

* What went wrong:
Execution failed for task ':sdks:go:test:flinkValidatesRunner'.
> Process 'command 'sh'' finished with non-zero exit value 1

* Try:
Run with --stacktrace option to get the stack trace. Run with --info or --debug option to
get more log output. Run with --scan to get full insights.

* Get more help at https://help.gradle.org

Deprecated Gradle features were used in this build, making it incompatible with Gradle 7.0.
Use '--warning-mode all' to show the individual deprecation warnings.
See https://docs.gradle.org/6.8/userguide/command_line_interface.html#sec:command_line_warnings

BUILD FAILED in 29m 3s
130 actionable tasks: 88 executed, 42 from cache

Publishing build scan...
https://gradle.com/s/i43xvfpbvkhio

Build step 'Invoke Gradle script' changed build result to FAILURE
Build step 'Invoke Gradle script' marked build as failure

---------------------------------------------------------------------
To unsubscribe, e-mail: builds-unsubscribe@beam.apache.org
For additional commands, e-mail: builds-help@beam.apache.org


Mime
View raw message