beam-builds mailing list archives

Site index · List index
Message view « Date » · « Thread »
Top « Date » · « Thread »
From Apache Jenkins Server <jenk...@builds.apache.org>
Subject Build failed in Jenkins: beam_PostCommit_Java #7085
Date Fri, 15 Jan 2021 00:50:56 GMT
See <https://ci-beam.apache.org/job/beam_PostCommit_Java/7085/display/redirect?page=changes>

Changes:

[sonam.ramchand] Enabled strict dependency

[sonam.ramchand] removed * depdendency

[sonam.ramchand] enabled strict dependency check to false

[sonam.ramchand] Fixed checker-qual issue

[sonam.ramchand] removed * dep

[sonam.ramchand] Fixed requested changes

[sonam.ramchand] autovalue_version variable added

[Kyle Weaver] Alphabetize dependency lists.

[tobiasz.kedzierski] Add gradle-command-action as submodule

[noreply] Make DataCatalogTableProvider.createDataCatalogClient public (#13752)

[noreply] [BEAM-11637] Use accumulators properly in BitAnd. (#13745)


------------------------------------------
[...truncated 51.14 KB...]
> Task :runners:core-java:testClasses UP-TO-DATE
> Task :runners:core-java:testJar
> Task :sdks:java:extensions:sorter:compileJava
> Task :sdks:java:extensions:zetasketch:compileJava
> Task :sdks:java:harness:shadowJar FROM-CACHE
> Task :sdks:java:io:synthetic:compileJava
> Task :sdks:java:io:hadoop-common:compileTestJava
> Task :sdks:java:io:kinesis:compileJava
> Task :sdks:java:io:hadoop-file-system:compileTestJava
> Task :sdks:java:extensions:google-cloud-platform-core:integrationTestKms
> Task :sdks:java:extensions:google-cloud-platform-core:postCommit

> Task :sdks:java:io:hadoop-common:compileTestJava
Note: <https://ci-beam.apache.org/job/beam_PostCommit_Java/ws/src/sdks/java/io/hadoop-common/src/test/java/org/apache/beam/sdk/io/hadoop/SerializableConfigurationTest.java>
uses or overrides a deprecated API.
Note: Recompile with -Xlint:deprecation for details.

> Task :sdks:java:io:hadoop-common:testClasses
> Task :sdks:java:io:hadoop-common:hadoopVersion2101Test FROM-CACHE
> Task :sdks:java:io:hadoop-common:hadoopVersion285Test FROM-CACHE
> Task :sdks:java:io:hadoop-common:hadoopVersion292Test FROM-CACHE
> Task :sdks:java:io:hadoop-common:hadoopVersion321Test FROM-CACHE
> Task :sdks:java:io:hadoop-common:hadoopVersionsTest UP-TO-DATE
> Task :sdks:java:io:hadoop-common:jar
> Task :sdks:java:io:hadoop-format:compileJava FROM-CACHE
> Task :sdks:java:io:hadoop-format:classes UP-TO-DATE
> Task :sdks:java:io:parquet:compileJava FROM-CACHE
> Task :sdks:java:io:parquet:classes UP-TO-DATE
> Task :runners:java-fn-execution:compileJava
> Task :runners:java-fn-execution:compileJava FROM-CACHE
> Task :runners:java-fn-execution:classes UP-TO-DATE
> Task :runners:java-fn-execution:jar
> Task :sdks:java:expansion-service:compileJava FROM-CACHE
> Task :sdks:java:expansion-service:classes UP-TO-DATE
> Task :sdks:java:expansion-service:jar
> Task :runners:java-job-service:compileJava FROM-CACHE
> Task :runners:java-job-service:classes UP-TO-DATE
> Task :runners:direct-java:compileJava FROM-CACHE
> Task :runners:direct-java:classes UP-TO-DATE
> Task :sdks:java:extensions:ml:compileJava FROM-CACHE
> Task :sdks:java:extensions:ml:classes UP-TO-DATE
> Task :runners:java-job-service:jar
> Task :sdks:java:io:kafka:compileJava FROM-CACHE
> Task :sdks:java:io:kafka:classes UP-TO-DATE
> Task :sdks:java:extensions:ml:jar
> Task :runners:direct-java:shadowJar FROM-CACHE
> Task :sdks:java:io:kafka:jar
> Task :sdks:java:io:google-cloud-platform:compileJava FROM-CACHE
> Task :sdks:java:io:google-cloud-platform:classes UP-TO-DATE
> Task :sdks:java:io:google-cloud-platform:jar
> Task :runners:google-cloud-dataflow-java:compileJava FROM-CACHE
> Task :runners:google-cloud-dataflow-java:classes
> Task :examples:java:compileJava FROM-CACHE
> Task :examples:java:classes UP-TO-DATE
> Task :runners:google-cloud-dataflow-java:jar
> Task :examples:java:jar
> Task :sdks:java:io:google-cloud-platform:compileTestJava FROM-CACHE
> Task :sdks:java:io:google-cloud-platform:testClasses
> Task :examples:java:compileTestJava FROM-CACHE
> Task :examples:java:testClasses
> Task :examples:java:testJar
> Task :sdks:java:io:hadoop-format:compileTestJava FROM-CACHE
> Task :sdks:java:io:hadoop-format:testClasses
> Task :runners:google-cloud-dataflow-java:worker:legacy-worker:compileJava FROM-CACHE
> Task :runners:google-cloud-dataflow-java:worker:legacy-worker:classes UP-TO-DATE
> Task :sdks:java:io:google-cloud-platform:testJar
> Task :sdks:java:io:hcatalog:compileJava
> Task :sdks:java:io:parquet:compileTestJava

> Task :sdks:java:io:synthetic:compileJava
Note: <https://ci-beam.apache.org/job/beam_PostCommit_Java/ws/src/sdks/java/io/synthetic/src/main/java/org/apache/beam/sdk/io/synthetic/SyntheticBoundedSource.java>
uses or overrides a deprecated API.
Note: Recompile with -Xlint:deprecation for details.

> Task :runners:spark:compileJava
> Task :sdks:java:extensions:ml:compileTestJava
> Task :sdks:java:io:hadoop-format:runHadoopFormatIO2101ElasticIT
> Task :runners:google-cloud-dataflow-java:worker:legacy-worker:shadowJar
> Task :sdks:java:io:google-cloud-platform:integrationTest
> Task :sdks:java:extensions:sorter:classes

> Task :sdks:java:io:hadoop-file-system:compileTestJava
Note: Some input files use or override a deprecated API.
Note: Recompile with -Xlint:deprecation for details.

> Task :sdks:java:io:hadoop-file-system:testClasses

> Task :sdks:java:io:hcatalog:compileJava
Note: <https://ci-beam.apache.org/job/beam_PostCommit_Java/ws/src/sdks/java/io/hcatalog/src/main/java/org/apache/beam/sdk/io/hcatalog/SchemaUtils.java>
uses or overrides a deprecated API.
Note: Recompile with -Xlint:deprecation for details.

> Task :runners:google-cloud-dataflow-java:coreSDKJavaLegacyWorkerIntegrationTest NO-SOURCE
> Task :sdks:java:io:hcatalog:classes
> Task :runners:google-cloud-dataflow-java:examplesJavaLegacyWorkerIntegrationTest FROM-CACHE
> Task :runners:google-cloud-dataflow-java:googleCloudPlatformLegacyWorkerIntegrationTest
FROM-CACHE
> Task :runners:google-cloud-dataflow-java:googleCloudPlatformLegacyWorkerKmsIntegrationTest
FROM-CACHE
> Task :runners:google-cloud-dataflow-java:postCommit UP-TO-DATE
> Task :sdks:java:extensions:zetasketch:classes
> Task :sdks:java:extensions:sorter:compileTestJava
> Task :sdks:java:io:hadoop-file-system:hadoopVersion2101Test
> Task :sdks:java:io:parquet:testClasses
> Task :sdks:java:io:parquet:hadoopVersion2101Test FROM-CACHE
> Task :sdks:java:io:parquet:hadoopVersion285Test FROM-CACHE
> Task :sdks:java:io:parquet:hadoopVersion292Test FROM-CACHE
> Task :sdks:java:io:parquet:hadoopVersion321Test FROM-CACHE
> Task :sdks:java:io:parquet:hadoopVersionsTest UP-TO-DATE
> Task :sdks:java:io:synthetic:classes
> Task :sdks:java:io:synthetic:jar
> Task :sdks:java:io:hcatalog:compileTestJava

> Task :sdks:java:extensions:ml:compileTestJava
Note: <https://ci-beam.apache.org/job/beam_PostCommit_Java/ws/src/sdks/java/extensions/ml/src/test/java/org/apache/beam/sdk/extensions/ml/MapStringToDlpRowTest.java>
uses unchecked or unsafe operations.
Note: Recompile with -Xlint:unchecked for details.

> Task :sdks:java:extensions:ml:testClasses
> Task :sdks:java:extensions:zetasketch:compileTestJava
> Task :sdks:java:io:kafka:compileTestJava
> Task :sdks:java:extensions:ml:integrationTest

> Task :sdks:java:extensions:sorter:compileTestJava
Note: Some input files use or override a deprecated API.
Note: Recompile with -Xlint:deprecation for details.

> Task :sdks:java:io:hcatalog:compileTestJava
Note: <https://ci-beam.apache.org/job/beam_PostCommit_Java/ws/src/sdks/java/io/hcatalog/src/test/java/org/apache/beam/sdk/io/hcatalog/HCatalogIOTest.java>
uses or overrides a deprecated API.
Note: Recompile with -Xlint:deprecation for details.
Note: <https://ci-beam.apache.org/job/beam_PostCommit_Java/ws/src/sdks/java/io/hcatalog/src/test/java/org/apache/beam/sdk/io/hcatalog/HCatalogIOTest.java>
uses unchecked or unsafe operations.
Note: Recompile with -Xlint:unchecked for details.

> Task :sdks:java:extensions:sorter:testClasses
> Task :sdks:java:extensions:sorter:hadoopVersion2101Test FROM-CACHE
> Task :sdks:java:extensions:sorter:hadoopVersion285Test FROM-CACHE
> Task :sdks:java:extensions:sorter:hadoopVersion292Test FROM-CACHE
> Task :sdks:java:extensions:sorter:hadoopVersion321Test FROM-CACHE
> Task :sdks:java:extensions:sorter:hadoopVersionsTest UP-TO-DATE
> Task :sdks:java:io:hcatalog:testClasses
> Task :sdks:java:io:hcatalog:hadoopVersion2101Test FROM-CACHE
> Task :sdks:java:io:hcatalog:hadoopVersion285Test FROM-CACHE
> Task :sdks:java:io:hcatalog:hadoopVersion292Test FROM-CACHE
> Task :sdks:java:io:hcatalog:hadoopVersionsTest UP-TO-DATE
> Task :sdks:java:io:kinesis:classes
> Task :sdks:java:io:kinesis:compileTestJava

> Task :sdks:java:extensions:zetasketch:compileTestJava
Note: <https://ci-beam.apache.org/job/beam_PostCommit_Java/ws/src/sdks/java/extensions/zetasketch/src/test/java/org/apache/beam/sdk/extensions/zetasketch/HllCountTest.java>
uses or overrides a deprecated API.
Note: Recompile with -Xlint:deprecation for details.

> Task :sdks:java:extensions:zetasketch:testClasses
> Task :sdks:java:io:hadoop-format:runHadoopFormatIO2101IT
> Task :sdks:java:extensions:zetasketch:integrationTest

> Task :sdks:java:io:kafka:compileTestJava
Note: Some input files use or override a deprecated API.
Note: Recompile with -Xlint:deprecation for details.
Note: Some input files use unchecked or unsafe operations.
Note: Recompile with -Xlint:unchecked for details.

> Task :sdks:java:io:kafka:testClasses
> Task :sdks:java:extensions:ml:postCommit

> Task :sdks:java:io:kinesis:compileTestJava
Note: Some input files use or override a deprecated API.
Note: Recompile with -Xlint:deprecation for details.

> Task :sdks:java:io:kinesis:testClasses
> Task :sdks:java:io:kafka:kafkaVersion01103BatchIT
> Task :sdks:java:io:kinesis:integrationTest
> Task :sdks:java:io:hadoop-file-system:hadoopVersion285Test
> Task :sdks:java:io:hadoop-format:runHadoopFormatIO2101Test
> Task :sdks:java:io:kafka:kafkaVersion01103BatchIT FAILED
> Task :sdks:java:io:kafka:kafkaVersion01103Test

> Task :runners:spark:compileJava
Note: Some input files use or override a deprecated API.
Note: Recompile with -Xlint:deprecation for details.
Note: Some input files use unchecked or unsafe operations.
Note: Recompile with -Xlint:unchecked for details.

> Task :sdks:java:io:hadoop-file-system:hadoopVersion292Test
> Task :runners:spark:classes
> Task :runners:spark:compileTestJava
> Task :sdks:java:io:hadoop-format:runHadoopFormatIO285ElasticIT
> Task :sdks:java:io:kafka:kafkaVersion100BatchIT
> Task :sdks:java:io:hadoop-file-system:hadoopVersion321Test

> Task :runners:spark:compileTestJava
Note: Some input files use or override a deprecated API.
Note: Recompile with -Xlint:deprecation for details.
Note: Some input files use unchecked or unsafe operations.
Note: Recompile with -Xlint:unchecked for details.

> Task :sdks:java:io:kafka:kafkaVersion100Test
> Task :sdks:java:io:hadoop-format:runHadoopFormatIO285IT
> Task :runners:spark:testClasses
> Task :runners:spark:hadoopVersion2101Test
> Task :sdks:java:io:hadoop-file-system:hadoopVersionsTest
> Task :runners:spark:hadoopVersion2101Test FROM-CACHE
> Task :runners:spark:hadoopVersion285Test FROM-CACHE
> Task :runners:spark:hadoopVersion292Test FROM-CACHE
> Task :runners:spark:hadoopVersion321Test FROM-CACHE
> Task :runners:spark:hadoopVersionsTest UP-TO-DATE
> Task :sdks:java:io:hadoop-format:runHadoopFormatIO285Test
> Task :sdks:java:io:kafka:kafkaVersion111BatchIT
> Task :sdks:java:io:kafka:kafkaVersion111Test
> Task :sdks:java:io:kafka:kafkaVersion201BatchIT
> Task :sdks:java:io:hadoop-format:runHadoopFormatIO292ElasticIT
> Task :sdks:java:io:kafka:kafkaVersion201Test
> Task :sdks:java:io:hadoop-format:runHadoopFormatIO292IT
> Task :sdks:java:io:kafka:kafkaVersion211BatchIT
> Task :sdks:java:io:hadoop-format:runHadoopFormatIO292Test
> Task :sdks:java:extensions:zetasketch:postCommit
> Task :sdks:java:io:kafka:kafkaVersion211Test
> Task :sdks:java:io:kafka:kafkaVersion222BatchIT
> Task :sdks:java:io:hadoop-format:runHadoopFormatIO321ElasticIT
> Task :sdks:java:io:google-cloud-platform:integrationTestKms
> Task :sdks:java:io:kafka:kafkaVersion222Test
> Task :sdks:java:io:hadoop-format:runHadoopFormatIO321IT
> Task :sdks:java:io:kafka:kafkaVersion231BatchIT
> Task :sdks:java:io:hadoop-format:runHadoopFormatIO321Test
> Task :sdks:java:io:google-cloud-platform:postCommit
> Task :sdks:java:io:kafka:kafkaVersion231Test
> Task :sdks:java:io:hadoop-format:hadoopVersionsTest
> Task :javaHadoopVersionsTest
> Task :sdks:java:io:kafka:kafkaVersion241BatchIT
> Task :sdks:java:io:kafka:kafkaVersion241Test
> Task :sdks:java:io:kafka:kafkaVersion251BatchIT
> Task :sdks:java:io:kafka:kafkaVersion251Test

FAILURE: Build failed with an exception.

* What went wrong:
Execution failed for task ':sdks:java:io:kafka:kafkaVersion01103BatchIT'.
> Failed to store cache entry for task ':sdks:java:io:kafka:kafkaVersion01103BatchIT'

* Try:
Run with --stacktrace option to get the stack trace. Run with --info or --debug option to
get more log output. Run with --scan to get full insights.

* Get more help at https://help.gradle.org

Deprecated Gradle features were used in this build, making it incompatible with Gradle 7.0.
Use '--warning-mode all' to show the individual deprecation warnings.
See https://docs.gradle.org/6.7.1/userguide/command_line_interface.html#sec:command_line_warnings

BUILD FAILED in 49m 55s
220 actionable tasks: 147 executed, 73 from cache

Publishing build scan...
https://gradle.com/s/6gwj5ljiikuxg

Build step 'Invoke Gradle script' changed build result to FAILURE
Build step 'Invoke Gradle script' marked build as failure

---------------------------------------------------------------------
To unsubscribe, e-mail: builds-unsubscribe@beam.apache.org
For additional commands, e-mail: builds-help@beam.apache.org


Mime
View raw message