beam-builds mailing list archives

Site index · List index
Message view « Date » · « Thread »
Top « Date » · « Thread »
From Apache Jenkins Server <jenk...@builds.apache.org>
Subject Build failed in Jenkins: beam_PostCommit_Java #7138
Date Thu, 28 Jan 2021 09:01:01 GMT
See <https://ci-beam.apache.org/job/beam_PostCommit_Java/7138/display/redirect?page=changes>

Changes:

[zyichi] [BEAM-11699] Correct python environment directly for fnApiJobServerSetup

[noreply] Merge pull request #13496 from [BEAM-11408] Integrate BigQuery sink


------------------------------------------
[...truncated 117.59 KB...]
 ---> Running in 0b82e08c6a42
Removing intermediate container 0b82e08c6a42
 ---> 0602ce5afd92
Step 16/17 : RUN if [ "${pull_licenses}" = "false" ] ; then     rm -rf /opt/apache/beam/third_party_licenses
;    fi
 ---> Running in 2aa89c0c1c02
Removing intermediate container 2aa89c0c1c02
 ---> 49e8e4460f4b
Step 17/17 : ENTRYPOINT ["/opt/apache/beam/boot"]
 ---> Running in c0429cfa5136
Removing intermediate container c0429cfa5136
 ---> 0c7b7d197572
Successfully built 0c7b7d197572
Successfully tagged apache/beam_java8_sdk:2.29.0.dev

> Task :runners:google-cloud-dataflow-java:examplesJavaLegacyWorkerIntegrationTest

***********************************************************
***********************************************************
**********************Set Up Pubsub************************
The Pub/Sub topic has been set up for this example: projects/apache-beam-testing/topics/testpipeline-jenkins-0128061131-6795fdbe
The Pub/Sub subscription has been set up for this example: projects/apache-beam-testing/subscriptions/testpipeline-jenkins-0128061131-6795fdbe
******************Set Up Big Query Table*******************
The BigQuery table has been set up for this example: apache-beam-testing:traffic_max_lane_flow_1611814290678.traffic_max_lane_flow_table
*************************Tear Down*************************
The Pub/Sub topic has been deleted: projects/apache-beam-testing/topics/testpipeline-jenkins-0128061131-6795fdbe
The Pub/Sub subscription has been deleted: projects/apache-beam-testing/subscriptions/testpipeline-jenkins-0128061131-6795fdbe
The BigQuery table might contain the example's output, and it is not deleted automatically:
apache-beam-testing:traffic_max_lane_flow_1611814290678.traffic_max_lane_flow_table
Please go to the Developers Console to delete it manually. Otherwise, you may be charged for
its usage.
***********************************************************
***********************************************************

> Task :sdks:java:io:kafka:kafkaVersion241Test
> Task :sdks:java:io:kafka:kafkaVersion251BatchIT
> Task :sdks:java:io:hadoop-format:runHadoopFormatIO321IT
> Task :sdks:java:io:kafka:kafkaVersion251Test
> Task :sdks:java:io:hadoop-format:runHadoopFormatIO321Test
> Task :sdks:java:io:kafka:kafkaVersionsCompatibilityTest

> Task :sdks:java:io:google-cloud-platform:integrationTest

43 tests completed, 1 failed, 1 skipped

> Task :sdks:java:io:google-cloud-platform:integrationTest FAILED
> Task :sdks:java:io:google-cloud-platform:integrationTestKms
> Task :sdks:java:io:hadoop-format:hadoopVersionsTest
> Task :javaHadoopVersionsTest
> Task :sdks:java:extensions:zetasketch:postCommit

> Task :runners:google-cloud-dataflow-java:examplesJavaLegacyWorkerIntegrationTest

***********************************************************
***********************************************************
*************************Tear Down*************************
The Pub/Sub topic has been deleted: projects/apache-beam-testing/topics/testpipeline-jenkins-0128062320-cdd1681e
The Pub/Sub subscription has been deleted: projects/apache-beam-testing/subscriptions/testpipeline-jenkins-0128062320-cdd1681e
The BigQuery table might contain the example's output, and it is not deleted automatically:
apache-beam-testing:beam_examples.testpipeline_jenkins_0128062320_cdd1681e
Please go to the Developers Console to delete it manually. Otherwise, you may be charged for
its usage.
***********************************************************
***********************************************************

> Task :runners:google-cloud-dataflow-java:googleCloudPlatformLegacyWorkerIntegrationTest
> Task :runners:google-cloud-dataflow-java:googleCloudPlatformLegacyWorkerKmsIntegrationTest
> Task :runners:google-cloud-dataflow-java:postCommit

> Task :runners:google-cloud-dataflow-java:buildAndPushDockerContainer
WARNING: `gcloud docker` will not be supported for Docker client versions above 18.03.

As an alternative, use `gcloud auth configure-docker` to configure `docker` to
use `gcloud` as a credential helper, then use `docker` as you would for non-GCR
registries, e.g. `docker pull gcr.io/project-id/my-image`. Add
`--verbosity=error` to silence this warning: `gcloud docker
--verbosity=error -- pull gcr.io/project-id/my-image`.

See: https://cloud.google.com/container-registry/docs/support/deprecation-notices#gcloud-docker

The push refers to repository [us.gcr.io/apache-beam-testing/java-postcommit-it/java]
d06c8417b780: Preparing
510d43e4babe: Preparing
42ec3ff6941d: Preparing
fa1b62afca5f: Preparing
0ad5890eb52a: Preparing
1c02c6dda79e: Preparing
37792515df41: Preparing
eaf53f2b3825: Preparing
27e364f8fc7a: Preparing
9ddf5ec57ce3: Preparing
9f6820641676: Preparing
25b2e6cfc187: Preparing
7df6dd475950: Preparing
7496c5e8691b: Preparing
aa7af8a465c6: Preparing
ef9a7b8862f4: Preparing
37792515df41: Waiting
9ddf5ec57ce3: Waiting
1c02c6dda79e: Waiting
a1f2f42922b1: Preparing
4762552ad7d8: Preparing
9f6820641676: Waiting
27e364f8fc7a: Waiting
eaf53f2b3825: Waiting
aa7af8a465c6: Waiting
7496c5e8691b: Waiting
7df6dd475950: Waiting
a1f2f42922b1: Waiting
25b2e6cfc187: Waiting
4762552ad7d8: Waiting
ef9a7b8862f4: Waiting
0ad5890eb52a: Pushed
fa1b62afca5f: Pushed
510d43e4babe: Pushed
d06c8417b780: Pushed
37792515df41: Pushed
eaf53f2b3825: Pushed
42ec3ff6941d: Pushed
25b2e6cfc187: Layer already exists
7df6dd475950: Layer already exists
7496c5e8691b: Layer already exists
aa7af8a465c6: Layer already exists
ef9a7b8862f4: Layer already exists
a1f2f42922b1: Layer already exists
4762552ad7d8: Layer already exists
9ddf5ec57ce3: Pushed
9f6820641676: Pushed
1c02c6dda79e: Pushed
27e364f8fc7a: Pushed
20210128000058: digest: sha256:5afd4f1125ca3674df7f9d092b52ea42fb98d2bab9289f9ffc8e520d9526e40e
size: 4098
da77e452c6ed: Preparing
2d9d750b89c5: Preparing
b2c080836de8: Preparing
dc1443a29fe9: Preparing
7a8a5f3634f0: Preparing
f9676403252d: Preparing
0efdc422081f: Preparing
2be8a9c425eb: Preparing
765968b90b34: Preparing
424821f4a97d: Preparing
bff7815b2bcb: Preparing
25b2e6cfc187: Preparing
7df6dd475950: Preparing
7496c5e8691b: Preparing
aa7af8a465c6: Preparing
ef9a7b8862f4: Preparing
f9676403252d: Waiting
a1f2f42922b1: Preparing
0efdc422081f: Waiting
2be8a9c425eb: Waiting
765968b90b34: Waiting
4762552ad7d8: Preparing
424821f4a97d: Waiting
ef9a7b8862f4: Waiting
bff7815b2bcb: Waiting
a1f2f42922b1: Waiting
25b2e6cfc187: Waiting
4762552ad7d8: Waiting
7496c5e8691b: Waiting
aa7af8a465c6: Waiting
da77e452c6ed: Pushed
7a8a5f3634f0: Pushed
dc1443a29fe9: Pushed
2d9d750b89c5: Pushed
b2c080836de8: Pushed
2be8a9c425eb: Pushed
0efdc422081f: Pushed
25b2e6cfc187: Layer already exists
7496c5e8691b: Layer already exists
7df6dd475950: Layer already exists
ef9a7b8862f4: Layer already exists
aa7af8a465c6: Layer already exists
a1f2f42922b1: Layer already exists
4762552ad7d8: Layer already exists
424821f4a97d: Pushed
bff7815b2bcb: Pushed
f9676403252d: Pushed
765968b90b34: Pushed
20210128060100: digest: sha256:d200aefaebe8edf62ca588a86e8fbe6aec72e0fb2b9b2e73b52fb4c0d4119cf8
size: 4098

> Task :runners:google-cloud-dataflow-java:coreSDKJavaRunnerV2IntegrationTest NO-SOURCE
> Task :runners:google-cloud-dataflow-java:examplesJavaRunnerV2IntegrationTest

***********************************************************
***********************************************************
**********************Set Up Pubsub************************
The Pub/Sub topic has been set up for this example: projects/apache-beam-testing/topics/testpipeline-jenkins-0128072901-e3cf90f2
The Pub/Sub subscription has been set up for this example: projects/apache-beam-testing/subscriptions/testpipeline-jenkins-0128072901-e3cf90f2
******************Set Up Big Query Table*******************
The BigQuery table has been set up for this example: apache-beam-testing:traffic_routes_1611818937400.traffic_routes_table
*************************Tear Down*************************
The Pub/Sub topic has been deleted: projects/apache-beam-testing/topics/testpipeline-jenkins-0128072901-e3cf90f2
The Pub/Sub subscription has been deleted: projects/apache-beam-testing/subscriptions/testpipeline-jenkins-0128072901-e3cf90f2
The BigQuery table might contain the example's output, and it is not deleted automatically:
apache-beam-testing:traffic_routes_1611818937400.traffic_routes_table
Please go to the Developers Console to delete it manually. Otherwise, you may be charged for
its usage.
***********************************************************
***********************************************************

***********************************************************
***********************************************************
**********************Set Up Pubsub************************
The Pub/Sub topic has been set up for this example: projects/apache-beam-testing/topics/testpipeline-jenkins-0128075340-d855f614
The Pub/Sub subscription has been set up for this example: projects/apache-beam-testing/subscriptions/testpipeline-jenkins-0128075340-d855f614
******************Set Up Big Query Table*******************
The BigQuery table has been set up for this example: apache-beam-testing:traffic_max_lane_flow_1611820419663.traffic_max_lane_flow_table
*************************Tear Down*************************
The Pub/Sub topic has been deleted: projects/apache-beam-testing/topics/testpipeline-jenkins-0128075340-d855f614
The Pub/Sub subscription has been deleted: projects/apache-beam-testing/subscriptions/testpipeline-jenkins-0128075340-d855f614
The BigQuery table might contain the example's output, and it is not deleted automatically:
apache-beam-testing:traffic_max_lane_flow_1611820419663.traffic_max_lane_flow_table
Please go to the Developers Console to delete it manually. Otherwise, you may be charged for
its usage.
***********************************************************
***********************************************************

> Task :runners:google-cloud-dataflow-java:googleCloudPlatformRunnerV2IntegrationTest

> Task :runners:google-cloud-dataflow-java:cleanUpDockerImages
Untagged: us.gcr.io/apache-beam-testing/java-postcommit-it/java:20210128060100
Untagged: us.gcr.io/apache-beam-testing/java-postcommit-it/java@sha256:d200aefaebe8edf62ca588a86e8fbe6aec72e0fb2b9b2e73b52fb4c0d4119cf8
Digests:
- us.gcr.io/apache-beam-testing/java-postcommit-it/java@sha256:d200aefaebe8edf62ca588a86e8fbe6aec72e0fb2b9b2e73b52fb4c0d4119cf8
  Associated tags:
 - 20210128060100
Tags:
- us.gcr.io/apache-beam-testing/java-postcommit-it/java:20210128060100
Deleted [us.gcr.io/apache-beam-testing/java-postcommit-it/java:20210128060100].
Deleted [us.gcr.io/apache-beam-testing/java-postcommit-it/java@sha256:d200aefaebe8edf62ca588a86e8fbe6aec72e0fb2b9b2e73b52fb4c0d4119cf8].

> Task :runners:google-cloud-dataflow-java:postCommitRunnerV2

FAILURE: Build failed with an exception.

* What went wrong:
Execution failed for task ':sdks:java:io:google-cloud-platform:integrationTest'.
> There were failing tests. See the report at: file://<https://ci-beam.apache.org/job/beam_PostCommit_Java/ws/src/sdks/java/io/google-cloud-platform/build/reports/tests/integrationTest/index.html>

* Try:
Run with --stacktrace option to get the stack trace. Run with --info or --debug option to
get more log output. Run with --scan to get full insights.

* Get more help at https://help.gradle.org

Deprecated Gradle features were used in this build, making it incompatible with Gradle 7.0.
Use '--warning-mode all' to show the individual deprecation warnings.
See https://docs.gradle.org/6.8/userguide/command_line_interface.html#sec:command_line_warnings

BUILD FAILED in 3h 0m 32s
248 actionable tasks: 159 executed, 87 from cache, 2 up-to-date
Gradle was unable to watch the file system for changes. The inotify watches limit is too low.

Publishing build scan...
https://gradle.com/s/yiar5xzxg656u

Build step 'Invoke Gradle script' changed build result to FAILURE
Build step 'Invoke Gradle script' marked build as failure

---------------------------------------------------------------------
To unsubscribe, e-mail: builds-unsubscribe@beam.apache.org
For additional commands, e-mail: builds-help@beam.apache.org


Mime
View raw message