beam-builds mailing list archives

Site index · List index
Message view « Date » · « Thread »
Top « Date » · « Thread »
From Apache Jenkins Server <jenk...@builds.apache.org>
Subject Build failed in Jenkins: beam_BiqQueryIO_Streaming_Performance_Test_Java #1846
Date Sun, 10 Jan 2021 00:44:09 GMT
See <https://ci-beam.apache.org/job/beam_BiqQueryIO_Streaming_Performance_Test_Java/1846/display/redirect>

Changes:


------------------------------------------
[...truncated 275.63 KB...]
> Task :runners:google-cloud-dataflow-java:compileTestJava FROM-CACHE
Watching 1327 directories to track changes
Watching 1327 directories to track changes
Watching 1327 directories to track changes
Watching 1359 directories to track changes
Custom actions are attached to task ':runners:google-cloud-dataflow-java:compileTestJava'.
Build cache key for task ':runners:google-cloud-dataflow-java:compileTestJava' is 6a018f1ec90d1096bc5063225fa976a5
Task ':runners:google-cloud-dataflow-java:compileTestJava' is not up-to-date because:
  No history is available.
Watching 1359 directories to track changes
Watching 1359 directories to track changes
Watching 1359 directories to track changes
Watching 1370 directories to track changes
Watching 1371 directories to track changes
Watching 1372 directories to track changes
Loaded cache entry for task ':runners:google-cloud-dataflow-java:compileTestJava' with cache
key 6a018f1ec90d1096bc5063225fa976a5
:runners:google-cloud-dataflow-java:compileTestJava (Thread[Daemon **** Thread 2,5,main])
completed. Took 0.212 secs.
:runners:google-cloud-dataflow-java:testClasses (Thread[Daemon **** Thread 2,5,main]) started.

> Task :runners:google-cloud-dataflow-java:testClasses UP-TO-DATE
Skipping task ':runners:google-cloud-dataflow-java:testClasses' as it has no actions.
:runners:google-cloud-dataflow-java:testClasses (Thread[Daemon **** Thread 2,5,main]) completed.
Took 0.0 secs.
:runners:google-cloud-dataflow-java:testJar (Thread[Daemon **** Thread 2,5,main]) started.

> Task :runners:google-cloud-dataflow-java:testJar
Watching 1372 directories to track changes
Could not read file path '<https://ci-beam.apache.org/job/beam_BiqQueryIO_Streaming_Performance_Test_Java/ws/src/runners/google-cloud-dataflow-java/build/resources/test'.>
Watching 1372 directories to track changes
Watching 1373 directories to track changes
Caching disabled for task ':runners:google-cloud-dataflow-java:testJar' because:
  Caching has not been enabled for the task
Task ':runners:google-cloud-dataflow-java:testJar' is not up-to-date because:
  No history is available.
Watching 1373 directories to track changes
file or directory '<https://ci-beam.apache.org/job/beam_BiqQueryIO_Streaming_Performance_Test_Java/ws/src/runners/google-cloud-dataflow-java/build/resources/test',>
not found
Watching 1373 directories to track changes
:runners:google-cloud-dataflow-java:testJar (Thread[Daemon **** Thread 2,5,main]) completed.
Took 0.034 secs.
:sdks:java:io:bigquery-io-perf-tests:integrationTest (Thread[Daemon **** Thread 2,5,main])
started.
Gradle Test Executor 1 started executing tests.

> Task :sdks:java:io:bigquery-io-perf-tests:integrationTest
Watching 1373 directories to track changes
Watching 1373 directories to track changes
Watching 1373 directories to track changes
Watching 1373 directories to track changes
Watching 1373 directories to track changes
Custom actions are attached to task ':sdks:java:io:bigquery-io-perf-tests:integrationTest'.
Build cache key for task ':sdks:java:io:bigquery-io-perf-tests:integrationTest' is 5b6b3d450310f64070ce9c90893ef1fd
Task ':sdks:java:io:bigquery-io-perf-tests:integrationTest' is not up-to-date because:
  Task.upToDateWhen is false.
Watching 1373 directories to track changes
Watching 1373 directories to track changes
Starting process 'Gradle Test Executor 1'. Working directory: <https://ci-beam.apache.org/job/beam_BiqQueryIO_Streaming_Performance_Test_Java/ws/src/sdks/java/io/bigquery-io-perf-tests>
Command: /usr/lib/jvm/java-8-openjdk-amd64/bin/java -DbeamTestPipelineOptions=["--project=apache-beam-testing","--tempLocation=gs://temp-storage-for-perf-tests/loadtests","--tempRoot=gs://temp-storage-for-perf-tests/loadtests","--writeMethod=STREAMING_INSERTS","--writeFormat=JSON","--testBigQueryDataset=beam_performance","--testBigQueryTable=bqio_write_10GB_java_stream_0110000724","--metricsBigQueryDataset=beam_performance","--metricsBigQueryTable=bqio_10GB_results_java_stream","--influxMeasurement=bqio_10GB_results_java_stream","--sourceOptions={\"numRecords\":\"10485760\",\"keySizeBytes\":\"1\",\"valueSizeBytes\":\"1024\"}","--runner=DataflowRunner","--maxNumWorkers=5","--numWorkers=5","--autoscalingAlgorithm=NONE","--influxDatabase=beam_test_metrics","--influxHost=http://10.128.0.96:8086","--****HarnessContainerImage=","--dataflowWorkerJar=<https://ci-beam.apache.org/job/beam_BiqQueryIO_Streaming_Performance_Test_Java/ws/src/runners/google-cloud-dataflow-java/****/legacy-****/build/libs/beam-runners-google-cloud-dataflow-java-legacy-****-2.28.0-SNAPSHOT.jar","--region=us-central1"]>
-Djava.security.manager=****.org.gradle.process.internal.****.child.BootstrapSecurityManager
-Dorg.gradle.native=false -Xmx2g -Dfile.encoding=UTF-8 -Duser.country=US -Duser.language=en
-Duser.variant -ea -cp /home/jenkins/.gradle/caches/6.7.1/****Main/gradle-****.jar ****.org.gradle.process.internal.****.GradleWorkerMain
'Gradle Test Executor 1'
Successfully started process 'Gradle Test Executor 1'

org.apache.beam.sdk.bigqueryioperftests.BigQueryIOIT STANDARD_ERROR
    SLF4J: Class path contains multiple SLF4J bindings.
    SLF4J: Found binding in [jar:<https://ci-beam.apache.org/job/beam_BiqQueryIO_Streaming_Performance_Test_Java/ws/src/runners/google-cloud-dataflow-java/****/legacy-****/build/libs/beam-runners-google-cloud-dataflow-java-legacy-****-2.28.0-SNAPSHOT.jar!/org/slf4j/impl/StaticLoggerBinder.class]>
    SLF4J: Found binding in [jar:file:/home/jenkins/.gradle/caches/modules-2/files-2.1/org.slf4j/slf4j-jdk14/1.7.30/d35953dd2fe54ebe39fdf18cfd82fe6eb35b25ed/slf4j-jdk14-1.7.30.jar!/org/slf4j/impl/StaticLoggerBinder.class]
    SLF4J: See http://www.slf4j.org/codes.html#multiple_bindings for an explanation.
    SLF4J: Actual binding is of type [org.slf4j.impl.JDK14LoggerFactory]

org.apache.beam.sdk.bigqueryioperftests.BigQueryIOIT > testWriteThenRead STANDARD_ERROR
    Jan 10, 2021 12:33:36 AM org.apache.beam.runners.dataflow.options.DataflowPipelineOptions$StagingLocationFactory
create
    INFO: No stagingLocation provided, falling back to gcpTempLocation
    Jan 10, 2021 12:33:37 AM org.apache.beam.runners.dataflow.DataflowRunner fromOptions
    INFO: PipelineOptions.filesToStage was not specified. Defaulting to files from the classpath:
will stage 210 files. Enable logging at DEBUG level to see which files will be staged.
    Jan 10, 2021 12:33:39 AM org.apache.beam.runners.dataflow.DataflowRunner run
    INFO: Executing pipeline on the Dataflow Service, which will have billing implications
related to Google Compute Engine usage and other Google Cloud Services.
    Jan 10, 2021 12:33:41 AM org.apache.beam.runners.dataflow.util.PackageUtil stageClasspathElements
    INFO: Uploading 211 files from PipelineOptions.filesToStage to staging location to prepare
for execution.
    Jan 10, 2021 12:33:41 AM org.apache.beam.runners.dataflow.util.PackageUtil$PackageAttributes
forFileToStage
    INFO: Staging custom dataflow-****.jar as beam-runners-google-cloud-dataflow-java-legacy-****-2.28.0-SNAPSHOT-1fgWxwJCYcO_EdocXYPBJd4CsR-cKZCern5xBMu8AkI.jar
    Jan 10, 2021 12:33:41 AM org.apache.beam.runners.dataflow.util.PackageUtil tryStagePackage
    INFO: Uploading /tmp/test5738736103823724244.zip to gs://temp-storage-for-perf-tests/loadtests/staging/test-39QAx_nlxVCqLAwnHzY9Wo-EozljAIh-TMSTh_UjxZI.jar
    Jan 10, 2021 12:33:42 AM org.apache.beam.runners.dataflow.util.PackageUtil stageClasspathElements
    INFO: Staging files complete: 210 files cached, 1 files newly uploaded in 1 seconds
    Jan 10, 2021 12:33:42 AM org.apache.beam.runners.dataflow.DataflowPipelineTranslator$Translator
addStep
    INFO: Adding Read from source as step s1
    Jan 10, 2021 12:33:42 AM org.apache.beam.runners.dataflow.DataflowPipelineTranslator$Translator
addStep
    INFO: Adding Gather time as step s2
    Jan 10, 2021 12:33:42 AM org.apache.beam.runners.dataflow.DataflowPipelineTranslator$Translator
addStep
    INFO: Adding Map records as step s3
    Jan 10, 2021 12:33:42 AM org.apache.beam.runners.dataflow.DataflowPipelineTranslator$Translator
addStep
    INFO: Adding Write to BQ/PrepareWrite/ParDo(Anonymous) as step s4
    Jan 10, 2021 12:33:42 AM org.apache.beam.runners.dataflow.DataflowPipelineTranslator$Translator
addStep
    INFO: Adding Write to BQ/StreamingInserts/CreateTables/ParDo(CreateTables) as step s5
    Jan 10, 2021 12:33:42 AM org.apache.beam.runners.dataflow.DataflowPipelineTranslator$Translator
addStep
    INFO: Adding Write to BQ/StreamingInserts/StreamingWriteTables/ShardTableWrites as step
s6
    Jan 10, 2021 12:33:42 AM org.apache.beam.runners.dataflow.DataflowPipelineTranslator$Translator
addStep
    INFO: Adding Write to BQ/StreamingInserts/StreamingWriteTables/TagWithUniqueIds as step
s7
    Jan 10, 2021 12:33:42 AM org.apache.beam.runners.dataflow.DataflowPipelineTranslator$Translator
addStep
    INFO: Adding Write to BQ/StreamingInserts/StreamingWriteTables/Reshuffle/Window.Into()/Window.Assign
as step s8
    Jan 10, 2021 12:33:42 AM org.apache.beam.runners.dataflow.DataflowPipelineTranslator$Translator
addStep
    INFO: Adding Write to BQ/StreamingInserts/StreamingWriteTables/Reshuffle/GroupByKey as
step s9
    Jan 10, 2021 12:33:42 AM org.apache.beam.runners.dataflow.DataflowPipelineTranslator$Translator
addStep
    INFO: Adding Write to BQ/StreamingInserts/StreamingWriteTables/Reshuffle/ExpandIterable
as step s10
    Jan 10, 2021 12:33:42 AM org.apache.beam.runners.dataflow.DataflowPipelineTranslator$Translator
addStep
    INFO: Adding Write to BQ/StreamingInserts/StreamingWriteTables/GlobalWindow/Window.Assign
as step s11
    Jan 10, 2021 12:33:42 AM org.apache.beam.runners.dataflow.DataflowPipelineTranslator$Translator
addStep
    INFO: Adding Write to BQ/StreamingInserts/StreamingWriteTables/StreamingWrite as step
s12
    Jan 10, 2021 12:33:42 AM org.apache.beam.runners.dataflow.DataflowRunner run
    INFO: Staging pipeline description to gs://temp-storage-for-perf-tests/loadtests/staging/
    Jan 10, 2021 12:33:43 AM org.apache.beam.runners.dataflow.util.PackageUtil tryStagePackage
    INFO: Uploading <109328 bytes, hash ea0510bf1afee4b9c5ad71a8ba7466df15313541b50ed6a2dadcb0efa505c758>
to gs://temp-storage-for-perf-tests/loadtests/staging/pipeline-6gUQvxr-5LnFrXGounRm3xUxNUG1Dtai2tyw76UFx1g.pb
    Jan 10, 2021 12:33:43 AM org.apache.beam.runners.dataflow.DataflowRunner run
    INFO: Dataflow SDK version: 2.28.0-SNAPSHOT
    Jan 10, 2021 12:33:45 AM org.apache.beam.runners.dataflow.DataflowRunner run
    INFO: To access the Dataflow monitoring console, please navigate to https://console.cloud.google.com/dataflow/jobs/us-central1/2021-01-09_16_33_43-11753662216449048333?project=apache-beam-testing
    Jan 10, 2021 12:33:45 AM org.apache.beam.runners.dataflow.DataflowRunner run
    INFO: Submitted job: 2021-01-09_16_33_43-11753662216449048333
    Jan 10, 2021 12:33:45 AM org.apache.beam.runners.dataflow.DataflowRunner run
    INFO: To cancel the job using the 'gcloud' tool, run:
    > gcloud dataflow jobs --project=apache-beam-testing cancel --region=us-central1 2021-01-09_16_33_43-11753662216449048333
    Jan 10, 2021 12:33:45 AM org.apache.beam.runners.dataflow.util.MonitoringUtil$LoggingHandler
process
    WARNING: 2021-01-10T00:33:43.309Z: The requested max number of ****s (5) is ignored as
autoscaling is explicitly disabled (autoscalingAlgorithm=NONE).
    Jan 10, 2021 12:33:52 AM org.apache.beam.runners.dataflow.util.MonitoringUtil$LoggingHandler
process
    INFO: 2021-01-10T00:33:50.718Z: Worker configuration: n1-standard-1 in us-central1-f.
    Jan 10, 2021 12:33:52 AM org.apache.beam.runners.dataflow.util.MonitoringUtil$LoggingHandler
process
    INFO: 2021-01-10T00:33:51.303Z: Expanding CoGroupByKey operations into optimizable parts.
    Jan 10, 2021 12:33:52 AM org.apache.beam.runners.dataflow.util.MonitoringUtil$LoggingHandler
process
    INFO: 2021-01-10T00:33:51.375Z: Expanding GroupByKey operations into optimizable parts.
    Jan 10, 2021 12:33:52 AM org.apache.beam.runners.dataflow.util.MonitoringUtil$LoggingHandler
process
    INFO: 2021-01-10T00:33:51.403Z: Lifting ValueCombiningMappingFns into MergeBucketsMappingFns
    Jan 10, 2021 12:33:52 AM org.apache.beam.runners.dataflow.util.MonitoringUtil$LoggingHandler
process
    INFO: 2021-01-10T00:33:51.509Z: Fusing adjacent ParDo, Read, Write, and Flatten operations
    Jan 10, 2021 12:33:52 AM org.apache.beam.runners.dataflow.util.MonitoringUtil$LoggingHandler
process
    INFO: 2021-01-10T00:33:51.538Z: Fusing consumer Gather time into Read from source
    Jan 10, 2021 12:33:52 AM org.apache.beam.runners.dataflow.util.MonitoringUtil$LoggingHandler
process
    INFO: 2021-01-10T00:33:51.561Z: Fusing consumer Map records into Gather time
    Jan 10, 2021 12:33:52 AM org.apache.beam.runners.dataflow.util.MonitoringUtil$LoggingHandler
process
    INFO: 2021-01-10T00:33:51.582Z: Fusing consumer Write to BQ/PrepareWrite/ParDo(Anonymous)
into Map records
    Jan 10, 2021 12:33:52 AM org.apache.beam.runners.dataflow.util.MonitoringUtil$LoggingHandler
process
    INFO: 2021-01-10T00:33:51.606Z: Fusing consumer Write to BQ/StreamingInserts/CreateTables/ParDo(CreateTables)
into Write to BQ/PrepareWrite/ParDo(Anonymous)
    Jan 10, 2021 12:33:52 AM org.apache.beam.runners.dataflow.util.MonitoringUtil$LoggingHandler
process
    INFO: 2021-01-10T00:33:51.628Z: Fusing consumer Write to BQ/StreamingInserts/StreamingWriteTables/ShardTableWrites
into Write to BQ/StreamingInserts/CreateTables/ParDo(CreateTables)
    Jan 10, 2021 12:33:52 AM org.apache.beam.runners.dataflow.util.MonitoringUtil$LoggingHandler
process
    INFO: 2021-01-10T00:33:51.671Z: Fusing consumer Write to BQ/StreamingInserts/StreamingWriteTables/TagWithUniqueIds
into Write to BQ/StreamingInserts/StreamingWriteTables/ShardTableWrites
    Jan 10, 2021 12:33:52 AM org.apache.beam.runners.dataflow.util.MonitoringUtil$LoggingHandler
process
    INFO: 2021-01-10T00:33:51.694Z: Fusing consumer Write to BQ/StreamingInserts/StreamingWriteTables/Reshuffle/Window.Into()/Window.Assign
into Write to BQ/StreamingInserts/StreamingWriteTables/TagWithUniqueIds
    Jan 10, 2021 12:33:52 AM org.apache.beam.runners.dataflow.util.MonitoringUtil$LoggingHandler
process
    INFO: 2021-01-10T00:33:51.720Z: Fusing consumer Write to BQ/StreamingInserts/StreamingWriteTables/Reshuffle/GroupByKey/Reify
into Write to BQ/StreamingInserts/StreamingWriteTables/Reshuffle/Window.Into()/Window.Assign
    Jan 10, 2021 12:33:52 AM org.apache.beam.runners.dataflow.util.MonitoringUtil$LoggingHandler
process
    INFO: 2021-01-10T00:33:51.752Z: Fusing consumer Write to BQ/StreamingInserts/StreamingWriteTables/Reshuffle/GroupByKey/Write
into Write to BQ/StreamingInserts/StreamingWriteTables/Reshuffle/GroupByKey/Reify
    Jan 10, 2021 12:33:52 AM org.apache.beam.runners.dataflow.util.MonitoringUtil$LoggingHandler
process
    INFO: 2021-01-10T00:33:51.784Z: Fusing consumer Write to BQ/StreamingInserts/StreamingWriteTables/Reshuffle/GroupByKey/GroupByWindow
into Write to BQ/StreamingInserts/StreamingWriteTables/Reshuffle/GroupByKey/Read
    Jan 10, 2021 12:33:52 AM org.apache.beam.runners.dataflow.util.MonitoringUtil$LoggingHandler
process
    INFO: 2021-01-10T00:33:51.818Z: Fusing consumer Write to BQ/StreamingInserts/StreamingWriteTables/Reshuffle/ExpandIterable
into Write to BQ/StreamingInserts/StreamingWriteTables/Reshuffle/GroupByKey/GroupByWindow
    Jan 10, 2021 12:33:52 AM org.apache.beam.runners.dataflow.util.MonitoringUtil$LoggingHandler
process
    INFO: 2021-01-10T00:33:51.850Z: Fusing consumer Write to BQ/StreamingInserts/StreamingWriteTables/GlobalWindow/Window.Assign
into Write to BQ/StreamingInserts/StreamingWriteTables/Reshuffle/ExpandIterable
    Jan 10, 2021 12:33:52 AM org.apache.beam.runners.dataflow.util.MonitoringUtil$LoggingHandler
process
    INFO: 2021-01-10T00:33:51.885Z: Fusing consumer Write to BQ/StreamingInserts/StreamingWriteTables/StreamingWrite
into Write to BQ/StreamingInserts/StreamingWriteTables/GlobalWindow/Window.Assign
    Jan 10, 2021 12:33:52 AM org.apache.beam.runners.dataflow.util.MonitoringUtil$LoggingHandler
process
    INFO: 2021-01-10T00:33:52.267Z: Executing operation Write to BQ/StreamingInserts/StreamingWriteTables/Reshuffle/GroupByKey/Create
    Jan 10, 2021 12:33:52 AM org.apache.beam.runners.dataflow.util.MonitoringUtil$LoggingHandler
process
    INFO: 2021-01-10T00:33:52.343Z: Starting 5 ****s in us-central1-f...
    Jan 10, 2021 12:33:52 AM org.apache.beam.runners.dataflow.util.MonitoringUtil$LoggingHandler
process
    INFO: 2021-01-10T00:33:52.391Z: Finished operation Write to BQ/StreamingInserts/StreamingWriteTables/Reshuffle/GroupByKey/Create
    Jan 10, 2021 12:33:55 AM org.apache.beam.runners.dataflow.util.MonitoringUtil$LoggingHandler
process
    INFO: 2021-01-10T00:33:52.524Z: Executing operation Read from source+Gather time+Map records+Write
to BQ/PrepareWrite/ParDo(Anonymous)+Write to BQ/StreamingInserts/CreateTables/ParDo(CreateTables)+Write
to BQ/StreamingInserts/StreamingWriteTables/ShardTableWrites+Write to BQ/StreamingInserts/StreamingWriteTables/TagWithUniqueIds+Write
to BQ/StreamingInserts/StreamingWriteTables/Reshuffle/Window.Into()/Window.Assign+Write to
BQ/StreamingInserts/StreamingWriteTables/Reshuffle/GroupByKey/Reify+Write to BQ/StreamingInserts/StreamingWriteTables/Reshuffle/GroupByKey/Write
    Jan 10, 2021 12:34:09 AM org.apache.beam.runners.dataflow.util.MonitoringUtil$LoggingHandler
process
    INFO: 2021-01-10T00:34:09.620Z: Your project already contains 100 Dataflow-created metric
descriptors, so new user metrics of the form custom.googleapis.com/* will not be created.
However, all user metrics are also available in the metric dataflow.googleapis.com/job/user_counter.
If you rely on the custom metrics, you can delete old / unused metric descriptors. See https://developers.google.com/apis-explorer/#p/monitoring/v3/monitoring.projects.metricDescriptors.list
and https://developers.google.com/apis-explorer/#p/monitoring/v3/monitoring.projects.metricDescriptors.delete
    Jan 10, 2021 12:34:19 AM org.apache.beam.runners.dataflow.util.MonitoringUtil$LoggingHandler
process
    INFO: 2021-01-10T00:34:18.797Z: Autoscaling: Raised the number of ****s to 4 based on
the rate of progress in the currently running stage(s).
    Jan 10, 2021 12:34:19 AM org.apache.beam.runners.dataflow.util.MonitoringUtil$LoggingHandler
process
    INFO: 2021-01-10T00:34:18.832Z: Resized **** pool to 4, though goal was 5.  This could
be a quota issue.
    Jan 10, 2021 12:34:31 AM org.apache.beam.runners.dataflow.util.MonitoringUtil$LoggingHandler
process
    INFO: 2021-01-10T00:34:29.123Z: Autoscaling: Raised the number of ****s to 5 based on
the rate of progress in the currently running stage(s).
    Jan 10, 2021 12:34:46 AM org.apache.beam.runners.dataflow.util.MonitoringUtil$LoggingHandler
process
    INFO: 2021-01-10T00:34:45.060Z: Workers have started successfully.
    Jan 10, 2021 12:34:46 AM org.apache.beam.runners.dataflow.util.MonitoringUtil$LoggingHandler
process
    INFO: 2021-01-10T00:34:45.090Z: Workers have started successfully.
    Jan 10, 2021 12:36:45 AM org.apache.beam.runners.dataflow.util.MonitoringUtil$LoggingHandler
process
    INFO: 2021-01-10T00:36:45.030Z: Finished operation Read from source+Gather time+Map records+Write
to BQ/PrepareWrite/ParDo(Anonymous)+Write to BQ/StreamingInserts/CreateTables/ParDo(CreateTables)+Write
to BQ/StreamingInserts/StreamingWriteTables/ShardTableWrites+Write to BQ/StreamingInserts/StreamingWriteTables/TagWithUniqueIds+Write
to BQ/StreamingInserts/StreamingWriteTables/Reshuffle/Window.Into()/Window.Assign+Write to
BQ/StreamingInserts/StreamingWriteTables/Reshuffle/GroupByKey/Reify+Write to BQ/StreamingInserts/StreamingWriteTables/Reshuffle/GroupByKey/Write
    Jan 10, 2021 12:36:45 AM org.apache.beam.runners.dataflow.util.MonitoringUtil$LoggingHandler
process
    INFO: 2021-01-10T00:36:45.091Z: Executing operation Write to BQ/StreamingInserts/StreamingWriteTables/Reshuffle/GroupByKey/Close
    Jan 10, 2021 12:36:45 AM org.apache.beam.runners.dataflow.util.MonitoringUtil$LoggingHandler
process
    INFO: 2021-01-10T00:36:45.131Z: Finished operation Write to BQ/StreamingInserts/StreamingWriteTables/Reshuffle/GroupByKey/Close
    Jan 10, 2021 12:36:45 AM org.apache.beam.runners.dataflow.util.MonitoringUtil$LoggingHandler
process
    INFO: 2021-01-10T00:36:45.184Z: Executing operation Write to BQ/StreamingInserts/StreamingWriteTables/Reshuffle/GroupByKey/Read+Write
to BQ/StreamingInserts/StreamingWriteTables/Reshuffle/GroupByKey/GroupByWindow+Write to BQ/StreamingInserts/StreamingWriteTables/Reshuffle/ExpandIterable+Write
to BQ/StreamingInserts/StreamingWriteTables/GlobalWindow/Window.Assign+Write to BQ/StreamingInserts/StreamingWriteTables/StreamingWrite

org.apache.beam.sdk.bigqueryioperftests.BigQueryIOIT > testWriteThenRead SKIPPED
Watching 1375 directories to track changes
Watching 1377 directories to track changes
Watching 1378 directories to track changes

> Task :sdks:java:io:bigquery-io-perf-tests:integrationTest FAILED
:sdks:java:io:bigquery-io-perf-tests:integrationTest (Thread[Daemon **** Thread 2,5,main])
completed. Took 10 mins 35.257 secs.

FAILURE: Build failed with an exception.

* What went wrong:
Execution failed for task ':sdks:java:io:bigquery-io-perf-tests:integrationTest'.
> Process 'Gradle Test Executor 1' finished with non-zero exit value 143
  This problem might be caused by incorrect test process configuration.
  Please refer to the test execution section in the User Manual at https://docs.gradle.org/6.7.1/userguide/java_testing.html#sec:test_execution

* Try:
Run with --stacktrace option to get the stack trace. Run with --debug option to get more log
output. Run with --scan to get full insights.

* Get more help at https://help.gradle.org

Deprecated Gradle features were used in this build, making it incompatible with Gradle 7.0.
Use '--warning-mode all' to show the individual deprecation warnings.
See https://docs.gradle.org/6.7.1/userguide/command_line_interface.html#sec:command_line_warnings

BUILD FAILED in 10m 50s
109 actionable tasks: 65 executed, 44 from cache
Watching 1378 directories to track changes
The message received from the daemon indicates that the daemon has disappeared.
Build request sent: Build{id=71021e6a-ae14-4f97-93e5-71ad860a731b, currentDir=<https://ci-beam.apache.org/job/beam_BiqQueryIO_Streaming_Performance_Test_Java/ws/src}>
Attempting to read last messages from the daemon log...
Daemon pid: 4529
  log file: /home/jenkins/.gradle/daemon/6.7.1/daemon-4529.out.log
----- Last  20 lines from daemon log file - daemon-4529.out.log -----

* What went wrong:
Execution failed for task ':sdks:java:io:bigquery-io-perf-tests:integrationTest'.
> Process 'Gradle Test Executor 1' finished with non-zero exit value 143
  This problem might be caused by incorrect test process configuration.
  Please refer to the test execution section in the User Manual at https://docs.gradle.org/6.7.1/userguide/java_testing.html#sec:test_execution

* Try:
Run with --stacktrace option to get the stack trace. Run with --debug option to get more log
output. Run with --scan to get full insights.

* Get more help at https://help.gradle.org

Deprecated Gradle features were used in this build, making it incompatible with Gradle 7.0.
Use '--warning-mode all' to show the individual deprecation warnings.
See https://docs.gradle.org/6.7.1/userguide/command_line_interface.html#sec:command_line_warnings

BUILD FAILED in 10m 50s
109 actionable tasks: 65 executed, 44 from cache
Watching 1378 directories to track changes
Daemon vm is shutting down... The daemon has exited normally or was terminated in response
to a user interrupt.
----- End of the daemon log -----


FAILURE: Build failed with an exception.

* What went wrong:
Gradle build daemon disappeared unexpectedly (it may have been killed or may have crashed)

* Try:
Run with --stacktrace option to get the stack trace. Run with --debug option to get more log
output. Run with --scan to get full insights.

* Get more help at https://help.gradle.org
Build step 'Invoke Gradle script' changed build result to FAILURE
Build step 'Invoke Gradle script' marked build as failure

---------------------------------------------------------------------
To unsubscribe, e-mail: builds-unsubscribe@beam.apache.org
For additional commands, e-mail: builds-help@beam.apache.org


Mime
View raw message