beam-builds mailing list archives

Site index · List index
Message view « Date » · « Thread »
Top « Date » · « Thread »
From Apache Jenkins Server <jenk...@builds.apache.org>
Subject Build failed in Jenkins: beam_LoadTests_Java_CoGBK_SparkStructuredStreaming_Batch #290
Date Sat, 30 Jan 2021 14:05:31 GMT
See <https://ci-beam.apache.org/job/beam_LoadTests_Java_CoGBK_SparkStructuredStreaming_Batch/290/display/redirect?page=changes>

Changes:

[sonam.ramchand] Implemented BIT_XOR for Zetasql dialect

[sonam.ramchand] replaced integer with Bigint type

[sonam.ramchand] added int32 field in testcase

[sonam.ramchand] INT32 to INT64

[sonam.ramchand] fixed spotless checks

[sonam.ramchand] SQL_Java11 PreCommit issue fixed

[sonam.ramchand] removed * dependencies

[sonam.ramchand] removed * dependencies from zetasql test file

[sonam.ramchand] removed * dependency from SQloperators.java

[sonam.ramchand] Fixed check style violations

[sonam.ramchand] fixed checkstyle violations from sqloperators table

[sonam.ramchand] fixed violations from beambuiltinagg file

[Kyle Weaver] [BEAM-11634] Give JobInvoker threads unique names.

[Ismaël Mejía] [website] Clarify JIRA priority for security issues (CVEs)

[sonam.ramchand] bit_Xor to support bytes as well

[sonam.ramchand] deleted extra introduced class

[sonam.ramchand] added meaningful name for unit test

[Kyle Weaver] [BEAM-10925] Load user-provided jars in CalcFn.

[kileysok] Disable Gradle module metadata generation

[Ismaël Mejía] [BEAM-11658] Match .snappy files into the given (de)compressor

[Kyle Weaver] [BEAM-10925] Fix code style

[noreply] [BEAM-11415] Enabling new ValidatesRunner framework on Jenkins. (#13684)

[Kyle Weaver] Wrap classloader creation in doPrivileged block.

[Kyle Weaver] [BEAM-10925] Add rule to replace Calc with BeamCalcRel for ZetaSQL UDFs.

[Kyle Weaver] [BEAM-10925] Add Java UDFs to UserFunctionDefinitions holder.

[Kyle Weaver] [BEAM-10925] Add optional jar path field to ZetaSqlScalarFunctionImpl.

[Kyle Weaver] Add javadoc comment to JavaScalarFunction::getJarPath.

[noreply] [BEAM-5214] Update java quickstart (#13833)


------------------------------------------
Started by timer
Running as SYSTEM
[EnvInject] - Loading node environment variables.
Building remotely on apache-beam-jenkins-15 (beam) in workspace <https://ci-beam.apache.org/job/beam_LoadTests_Java_CoGBK_SparkStructuredStreaming_Batch/ws/>
No credentials specified
Wiping out workspace first.
Cloning the remote Git repository
Cloning repository https://github.com/apache/beam.git
 > git init <https://ci-beam.apache.org/job/beam_LoadTests_Java_CoGBK_SparkStructuredStreaming_Batch/ws/src>
# timeout=10
Fetching upstream changes from https://github.com/apache/beam.git
 > git --version # timeout=10
 > git fetch --tags --progress https://github.com/apache/beam.git +refs/heads/*:refs/remotes/origin/*
# timeout=10
 > git config remote.origin.url https://github.com/apache/beam.git # timeout=10
 > git config --add remote.origin.fetch +refs/heads/*:refs/remotes/origin/* # timeout=10
 > git config remote.origin.url https://github.com/apache/beam.git # timeout=10
Fetching upstream changes from https://github.com/apache/beam.git
 > git fetch --tags --progress https://github.com/apache/beam.git +refs/heads/*:refs/remotes/origin/*
+refs/pull/${ghprbPullId}/*:refs/remotes/origin/pr/${ghprbPullId}/* # timeout=10
 > git rev-parse origin/master^{commit} # timeout=10
Checking out Revision bf5810a311737573827b8e8d24ad910b5d4e77fb (origin/master)
 > git config core.sparsecheckout # timeout=10
 > git checkout -f bf5810a311737573827b8e8d24ad910b5d4e77fb # timeout=10
Commit message: "Merge pull request #13819: [website] Clarify JIRA priority for security issues
(CVEs)"
 > git rev-list --no-walk 623a9c09bf3dd1a483b0631eb8ece2125c5c79ec # timeout=10
No emails were triggered.
[EnvInject] - Executing scripts and injecting environment variables after the SCM step.
[EnvInject] - Injecting as environment variables the properties content 
SPARK_LOCAL_IP=127.0.0.1
SETUPTOOLS_USE_DISTUTILS=stdlib

[EnvInject] - Variables injected successfully.
[beam_LoadTests_Java_CoGBK_SparkStructuredStreaming_Batch] $ /bin/bash -xe /tmp/jenkins4823029495389443300.sh
+ echo '*** Load test: CoGBK 2GB 100  byte records - single key ***'
*** Load test: CoGBK 2GB 100  byte records - single key ***
[Gradle] - Launching build.
[src] $ <https://ci-beam.apache.org/job/beam_LoadTests_Java_CoGBK_SparkStructuredStreaming_Batch/ws/src/gradlew>
-PloadTest.mainClass=org.apache.beam.sdk.loadtests.CoGroupByKeyLoadTest -Prunner=:runners:spark:2
-PwithDataflowWorkerJar=false '-PloadTest.args=--project=apache-beam-testing --appName=load_tests_Java_SparkStructuredStreaming_batch_CoGBK_1
--tempLocation=gs://temp-storage-for-perf-tests/loadtests --publishToBigQuery=true --bigQueryDataset=load_test
--bigQueryTable=java_sparkstructuredstreaming_batch_CoGBK_1 --influxMeasurement=java_batch_cogbk_1
--publishToInfluxDB=true --sourceOptions={"numRecords":20000000,"keySizeBytes":10,"valueSizeBytes":90,"numHotKeys":1}
--coSourceOptions={"numRecords":2000000,"keySizeBytes":10,"valueSizeBytes":90,"numHotKeys":1000}
--iterations=1 --streaming=false --influxDatabase=beam_test_metrics --influxHost=http://10.128.0.96:8086
--runner=SparkStructuredStreamingRunner' --continue --max-****s=12 -Dorg.gradle.jvmargs=-Xms2g
-Dorg.gradle.jvmargs=-Xmx4g -Pdocker-pull-licenses :sdks:java:testing:load-tests:run
Starting a Gradle Daemon (subsequent builds will be faster)
> Task :buildSrc:compileJava NO-SOURCE
> Task :buildSrc:compileGroovy FROM-CACHE
> Task :buildSrc:pluginDescriptors
> Task :buildSrc:processResources
> Task :buildSrc:classes
> Task :buildSrc:jar
> Task :buildSrc:assemble
> Task :buildSrc:spotlessGroovy FROM-CACHE
> Task :buildSrc:spotlessGroovyCheck UP-TO-DATE
> Task :buildSrc:spotlessGroovyGradle FROM-CACHE
> Task :buildSrc:spotlessGroovyGradleCheck UP-TO-DATE
> Task :buildSrc:spotlessCheck UP-TO-DATE
> Task :buildSrc:pluginUnderTestMetadata
> Task :buildSrc:compileTestJava NO-SOURCE
> Task :buildSrc:compileTestGroovy NO-SOURCE
> Task :buildSrc:processTestResources NO-SOURCE
> Task :buildSrc:testClasses UP-TO-DATE
> Task :buildSrc:test NO-SOURCE
> Task :buildSrc:validatePlugins FROM-CACHE
> Task :buildSrc:check UP-TO-DATE
> Task :buildSrc:build
Configuration on demand is an incubating feature.

FAILURE: Build failed with an exception.

* Where:
Build file '<https://ci-beam.apache.org/job/beam_LoadTests_Java_CoGBK_SparkStructuredStreaming_Batch/ws/src/sdks/java/testing/load-tests/build.gradle'>
line: 78

* What went wrong:
A problem occurred evaluating project ':sdks:java:testing:load-tests'.
> Project with path ':runners:spark:2' could not be found in project ':sdks:java:testing:load-tests'.

* Try:
Run with --stacktrace option to get the stack trace. Run with --info or --debug option to
get more log output. Run with --scan to get full insights.

* Get more help at https://help.gradle.org

Deprecated Gradle features were used in this build, making it incompatible with Gradle 7.0.
Use '--warning-mode all' to show the individual deprecation warnings.
See https://docs.gradle.org/6.8/userguide/command_line_interface.html#sec:command_line_warnings

BUILD FAILED in 11s

Publishing build scan...
https://gradle.com/s/zz4u4g7wrp5hw

Build step 'Invoke Gradle script' changed build result to FAILURE
Build step 'Invoke Gradle script' marked build as failure

---------------------------------------------------------------------
To unsubscribe, e-mail: builds-unsubscribe@beam.apache.org
For additional commands, e-mail: builds-help@beam.apache.org


Mime
View raw message