beam-builds mailing list archives

Site index · List index
Message view « Date » · « Thread »
Top « Date » · « Thread »
From Apache Jenkins Server <jenk...@builds.apache.org>
Subject Build failed in Jenkins: beam_PostCommit_XVR_Dataflow #223
Date Thu, 07 Jan 2021 12:17:20 GMT
See <https://ci-beam.apache.org/job/beam_PostCommit_XVR_Dataflow/223/display/redirect>

Changes:


------------------------------------------
[...truncated 98.14 KB...]
    | beam.Map(lambda x: "{}:{}".format(x[0], ','.join(sorted(x[1])))))
  File "<https://ci-beam.apache.org/job/beam_PostCommit_XVR_Dataflow/ws/src/sdks/python/apache_beam/transforms/ptransform.py",>
line 572, in __ror__
    result = p.apply(self, pvalueish, label)
  File "<https://ci-beam.apache.org/job/beam_PostCommit_XVR_Dataflow/ws/src/sdks/python/apache_beam/pipeline.py",>
line 691, in apply
    pvalueish_result = self.runner.apply(transform, pvalueish, self._options)
  File "<https://ci-beam.apache.org/job/beam_PostCommit_XVR_Dataflow/ws/src/sdks/python/apache_beam/runners/dataflow/dataflow_runner.py",>
line 151, in apply
    return super(DataflowRunner, self).apply(transform, input, options)
  File "<https://ci-beam.apache.org/job/beam_PostCommit_XVR_Dataflow/ws/src/sdks/python/apache_beam/runners/runner.py",>
line 188, in apply
    return m(transform, input, options)
  File "<https://ci-beam.apache.org/job/beam_PostCommit_XVR_Dataflow/ws/src/sdks/python/apache_beam/runners/runner.py",>
line 218, in apply_PTransform
    return transform.expand(input)
  File "<https://ci-beam.apache.org/job/beam_PostCommit_XVR_Dataflow/ws/src/sdks/python/apache_beam/transforms/external.py",>
line 316, in expand
    response = service.Expand(request)
  File "<https://ci-beam.apache.org/job/beam_PostCommit_XVR_Dataflow/ws/src/build/gradleenv/1922375555/lib/python3.6/site-packages/grpc/_channel.py",>
line 923, in __call__
    return _end_unary_response_blocking(state, call, False, None)
  File "<https://ci-beam.apache.org/job/beam_PostCommit_XVR_Dataflow/ws/src/build/gradleenv/1922375555/lib/python3.6/site-packages/grpc/_channel.py",>
line 826, in _end_unary_response_blocking
    raise _InactiveRpcError(state)
grpc._channel._InactiveRpcError: <_InactiveRpcError of RPC that terminated with:
	status = StatusCode.UNIMPLEMENTED
	details = "Method not found!"
	debug_error_string = "{"created":"@1610021831.276933114","description":"Error received from
peer ipv4:127.0.0.1:18091","file":"src/core/lib/surface/call.cc","file_line":1062,"grpc_message":"Method
not found!","grpc_status":12}"
>

======================================================================
ERROR: test_group_by_key (apache_beam.transforms.validate_runner_xlang_test.ValidateRunnerXlangTest)
----------------------------------------------------------------------
Traceback (most recent call last):
  File "<https://ci-beam.apache.org/job/beam_PostCommit_XVR_Dataflow/ws/src/sdks/python/apache_beam/transforms/validate_runner_xlang_test.py",>
line 265, in test_group_by_key
    test_pipeline or self.create_pipeline())
  File "<https://ci-beam.apache.org/job/beam_PostCommit_XVR_Dataflow/ws/src/sdks/python/apache_beam/transforms/validate_runner_xlang_test.py",>
line 143, in run_group_by_key
    | beam.Map(lambda x: "{}:{}".format(x[0], ','.join(sorted(x[1])))))
  File "<https://ci-beam.apache.org/job/beam_PostCommit_XVR_Dataflow/ws/src/sdks/python/apache_beam/pvalue.py",>
line 141, in __or__
    return self.pipeline.apply(ptransform, self)
  File "<https://ci-beam.apache.org/job/beam_PostCommit_XVR_Dataflow/ws/src/sdks/python/apache_beam/pipeline.py",>
line 691, in apply
    pvalueish_result = self.runner.apply(transform, pvalueish, self._options)
  File "<https://ci-beam.apache.org/job/beam_PostCommit_XVR_Dataflow/ws/src/sdks/python/apache_beam/runners/dataflow/dataflow_runner.py",>
line 151, in apply
    return super(DataflowRunner, self).apply(transform, input, options)
  File "<https://ci-beam.apache.org/job/beam_PostCommit_XVR_Dataflow/ws/src/sdks/python/apache_beam/runners/runner.py",>
line 188, in apply
    return m(transform, input, options)
  File "<https://ci-beam.apache.org/job/beam_PostCommit_XVR_Dataflow/ws/src/sdks/python/apache_beam/runners/runner.py",>
line 218, in apply_PTransform
    return transform.expand(input)
  File "<https://ci-beam.apache.org/job/beam_PostCommit_XVR_Dataflow/ws/src/sdks/python/apache_beam/transforms/external.py",>
line 316, in expand
    response = service.Expand(request)
  File "<https://ci-beam.apache.org/job/beam_PostCommit_XVR_Dataflow/ws/src/build/gradleenv/1922375555/lib/python3.6/site-packages/grpc/_channel.py",>
line 923, in __call__
    return _end_unary_response_blocking(state, call, False, None)
  File "<https://ci-beam.apache.org/job/beam_PostCommit_XVR_Dataflow/ws/src/build/gradleenv/1922375555/lib/python3.6/site-packages/grpc/_channel.py",>
line 826, in _end_unary_response_blocking
    raise _InactiveRpcError(state)
grpc._channel._InactiveRpcError: <_InactiveRpcError of RPC that terminated with:
	status = StatusCode.UNIMPLEMENTED
	details = "Method not found!"
	debug_error_string = "{"created":"@1610021831.317320522","description":"Error received from
peer ipv4:127.0.0.1:18091","file":"src/core/lib/surface/call.cc","file_line":1062,"grpc_message":"Method
not found!","grpc_status":12}"
>

======================================================================
ERROR: test_combine_globally (apache_beam.transforms.validate_runner_xlang_test.ValidateRunnerXlangTest)
----------------------------------------------------------------------
Traceback (most recent call last):
  File "<https://ci-beam.apache.org/job/beam_PostCommit_XVR_Dataflow/ws/src/sdks/python/apache_beam/transforms/validate_runner_xlang_test.py",>
line 273, in test_combine_globally
    test_pipeline or self.create_pipeline())
  File "<https://ci-beam.apache.org/job/beam_PostCommit_XVR_Dataflow/ws/src/sdks/python/apache_beam/transforms/validate_runner_xlang_test.py",>
line 184, in run_combine_globally
    TEST_COMGL_URN, None, self.expansion_service))
  File "<https://ci-beam.apache.org/job/beam_PostCommit_XVR_Dataflow/ws/src/sdks/python/apache_beam/pvalue.py",>
line 141, in __or__
    return self.pipeline.apply(ptransform, self)
  File "<https://ci-beam.apache.org/job/beam_PostCommit_XVR_Dataflow/ws/src/sdks/python/apache_beam/pipeline.py",>
line 691, in apply
    pvalueish_result = self.runner.apply(transform, pvalueish, self._options)
  File "<https://ci-beam.apache.org/job/beam_PostCommit_XVR_Dataflow/ws/src/sdks/python/apache_beam/runners/dataflow/dataflow_runner.py",>
line 151, in apply
    return super(DataflowRunner, self).apply(transform, input, options)
  File "<https://ci-beam.apache.org/job/beam_PostCommit_XVR_Dataflow/ws/src/sdks/python/apache_beam/runners/runner.py",>
line 188, in apply
    return m(transform, input, options)
  File "<https://ci-beam.apache.org/job/beam_PostCommit_XVR_Dataflow/ws/src/sdks/python/apache_beam/runners/runner.py",>
line 218, in apply_PTransform
    return transform.expand(input)
  File "<https://ci-beam.apache.org/job/beam_PostCommit_XVR_Dataflow/ws/src/sdks/python/apache_beam/transforms/external.py",>
line 316, in expand
    response = service.Expand(request)
  File "<https://ci-beam.apache.org/job/beam_PostCommit_XVR_Dataflow/ws/src/build/gradleenv/1922375555/lib/python3.6/site-packages/grpc/_channel.py",>
line 923, in __call__
    return _end_unary_response_blocking(state, call, False, None)
  File "<https://ci-beam.apache.org/job/beam_PostCommit_XVR_Dataflow/ws/src/build/gradleenv/1922375555/lib/python3.6/site-packages/grpc/_channel.py",>
line 826, in _end_unary_response_blocking
    raise _InactiveRpcError(state)
grpc._channel._InactiveRpcError: <_InactiveRpcError of RPC that terminated with:
	status = StatusCode.UNIMPLEMENTED
	details = "Method not found!"
	debug_error_string = "{"created":"@1610021831.364302257","description":"Error received from
peer ipv4:127.0.0.1:18091","file":"src/core/lib/surface/call.cc","file_line":1062,"grpc_message":"Method
not found!","grpc_status":12}"
>

======================================================================
ERROR: test_combine_per_key (apache_beam.transforms.validate_runner_xlang_test.ValidateRunnerXlangTest)
----------------------------------------------------------------------
Traceback (most recent call last):
  File "<https://ci-beam.apache.org/job/beam_PostCommit_XVR_Dataflow/ws/src/sdks/python/apache_beam/transforms/validate_runner_xlang_test.py",>
line 277, in test_combine_per_key
    test_pipeline or self.create_pipeline())
  File "<https://ci-beam.apache.org/job/beam_PostCommit_XVR_Dataflow/ws/src/sdks/python/apache_beam/transforms/validate_runner_xlang_test.py",>
line 203, in run_combine_per_key
    TEST_COMPK_URN, None, self.expansion_service))
  File "<https://ci-beam.apache.org/job/beam_PostCommit_XVR_Dataflow/ws/src/sdks/python/apache_beam/pvalue.py",>
line 141, in __or__
    return self.pipeline.apply(ptransform, self)
  File "<https://ci-beam.apache.org/job/beam_PostCommit_XVR_Dataflow/ws/src/sdks/python/apache_beam/pipeline.py",>
line 691, in apply
    pvalueish_result = self.runner.apply(transform, pvalueish, self._options)
  File "<https://ci-beam.apache.org/job/beam_PostCommit_XVR_Dataflow/ws/src/sdks/python/apache_beam/runners/dataflow/dataflow_runner.py",>
line 151, in apply
    return super(DataflowRunner, self).apply(transform, input, options)
  File "<https://ci-beam.apache.org/job/beam_PostCommit_XVR_Dataflow/ws/src/sdks/python/apache_beam/runners/runner.py",>
line 188, in apply
    return m(transform, input, options)
  File "<https://ci-beam.apache.org/job/beam_PostCommit_XVR_Dataflow/ws/src/sdks/python/apache_beam/runners/runner.py",>
line 218, in apply_PTransform
    return transform.expand(input)
  File "<https://ci-beam.apache.org/job/beam_PostCommit_XVR_Dataflow/ws/src/sdks/python/apache_beam/transforms/external.py",>
line 316, in expand
    response = service.Expand(request)
  File "<https://ci-beam.apache.org/job/beam_PostCommit_XVR_Dataflow/ws/src/build/gradleenv/1922375555/lib/python3.6/site-packages/grpc/_channel.py",>
line 923, in __call__
    return _end_unary_response_blocking(state, call, False, None)
  File "<https://ci-beam.apache.org/job/beam_PostCommit_XVR_Dataflow/ws/src/build/gradleenv/1922375555/lib/python3.6/site-packages/grpc/_channel.py",>
line 826, in _end_unary_response_blocking
    raise _InactiveRpcError(state)
grpc._channel._InactiveRpcError: <_InactiveRpcError of RPC that terminated with:
	status = StatusCode.UNIMPLEMENTED
	details = "Method not found!"
	debug_error_string = "{"created":"@1610021831.401960229","description":"Error received from
peer ipv4:127.0.0.1:18091","file":"src/core/lib/surface/call.cc","file_line":1062,"grpc_message":"Method
not found!","grpc_status":12}"
>

======================================================================
ERROR: test_multi_input_output_with_sideinput (apache_beam.transforms.validate_runner_xlang_test.ValidateRunnerXlangTest)
----------------------------------------------------------------------
Traceback (most recent call last):
  File "<https://ci-beam.apache.org/job/beam_PostCommit_XVR_Dataflow/ws/src/sdks/python/apache_beam/transforms/validate_runner_xlang_test.py",>
line 261, in test_multi_input_output_with_sideinput
    test_pipeline or self.create_pipeline())
  File "<https://ci-beam.apache.org/job/beam_PostCommit_XVR_Dataflow/ws/src/sdks/python/apache_beam/transforms/validate_runner_xlang_test.py",>
line 122, in run_multi_input_output_with_sideinput
    TEST_MULTI_URN, None, self.expansion_service)
  File "<https://ci-beam.apache.org/job/beam_PostCommit_XVR_Dataflow/ws/src/sdks/python/apache_beam/transforms/ptransform.py",>
line 572, in __ror__
    result = p.apply(self, pvalueish, label)
  File "<https://ci-beam.apache.org/job/beam_PostCommit_XVR_Dataflow/ws/src/sdks/python/apache_beam/pipeline.py",>
line 691, in apply
    pvalueish_result = self.runner.apply(transform, pvalueish, self._options)
  File "<https://ci-beam.apache.org/job/beam_PostCommit_XVR_Dataflow/ws/src/sdks/python/apache_beam/runners/dataflow/dataflow_runner.py",>
line 151, in apply
    return super(DataflowRunner, self).apply(transform, input, options)
  File "<https://ci-beam.apache.org/job/beam_PostCommit_XVR_Dataflow/ws/src/sdks/python/apache_beam/runners/runner.py",>
line 188, in apply
    return m(transform, input, options)
  File "<https://ci-beam.apache.org/job/beam_PostCommit_XVR_Dataflow/ws/src/sdks/python/apache_beam/runners/runner.py",>
line 218, in apply_PTransform
    return transform.expand(input)
  File "<https://ci-beam.apache.org/job/beam_PostCommit_XVR_Dataflow/ws/src/sdks/python/apache_beam/transforms/external.py",>
line 316, in expand
    response = service.Expand(request)
  File "<https://ci-beam.apache.org/job/beam_PostCommit_XVR_Dataflow/ws/src/build/gradleenv/1922375555/lib/python3.6/site-packages/grpc/_channel.py",>
line 923, in __call__
    return _end_unary_response_blocking(state, call, False, None)
  File "<https://ci-beam.apache.org/job/beam_PostCommit_XVR_Dataflow/ws/src/build/gradleenv/1922375555/lib/python3.6/site-packages/grpc/_channel.py",>
line 826, in _end_unary_response_blocking
    raise _InactiveRpcError(state)
grpc._channel._InactiveRpcError: <_InactiveRpcError of RPC that terminated with:
	status = StatusCode.UNIMPLEMENTED
	details = "Method not found!"
	debug_error_string = "{"created":"@1610021831.432100221","description":"Error received from
peer ipv4:127.0.0.1:18091","file":"src/core/lib/surface/call.cc","file_line":1062,"grpc_message":"Method
not found!","grpc_status":12}"
>

======================================================================
ERROR: test_prefix (apache_beam.transforms.validate_runner_xlang_test.ValidateRunnerXlangTest)
----------------------------------------------------------------------
Traceback (most recent call last):
  File "<https://ci-beam.apache.org/job/beam_PostCommit_XVR_Dataflow/ws/src/sdks/python/apache_beam/transforms/validate_runner_xlang_test.py",>
line 257, in test_prefix
    test_pipeline or self.create_pipeline())
  File "<https://ci-beam.apache.org/job/beam_PostCommit_XVR_Dataflow/ws/src/sdks/python/apache_beam/transforms/validate_runner_xlang_test.py",>
line 101, in run_prefix
    self.expansion_service))
  File "<https://ci-beam.apache.org/job/beam_PostCommit_XVR_Dataflow/ws/src/sdks/python/apache_beam/pvalue.py",>
line 141, in __or__
    return self.pipeline.apply(ptransform, self)
  File "<https://ci-beam.apache.org/job/beam_PostCommit_XVR_Dataflow/ws/src/sdks/python/apache_beam/pipeline.py",>
line 691, in apply
    pvalueish_result = self.runner.apply(transform, pvalueish, self._options)
  File "<https://ci-beam.apache.org/job/beam_PostCommit_XVR_Dataflow/ws/src/sdks/python/apache_beam/runners/dataflow/dataflow_runner.py",>
line 151, in apply
    return super(DataflowRunner, self).apply(transform, input, options)
  File "<https://ci-beam.apache.org/job/beam_PostCommit_XVR_Dataflow/ws/src/sdks/python/apache_beam/runners/runner.py",>
line 188, in apply
    return m(transform, input, options)
  File "<https://ci-beam.apache.org/job/beam_PostCommit_XVR_Dataflow/ws/src/sdks/python/apache_beam/runners/runner.py",>
line 218, in apply_PTransform
    return transform.expand(input)
  File "<https://ci-beam.apache.org/job/beam_PostCommit_XVR_Dataflow/ws/src/sdks/python/apache_beam/transforms/external.py",>
line 316, in expand
    response = service.Expand(request)
  File "<https://ci-beam.apache.org/job/beam_PostCommit_XVR_Dataflow/ws/src/build/gradleenv/1922375555/lib/python3.6/site-packages/grpc/_channel.py",>
line 923, in __call__
    return _end_unary_response_blocking(state, call, False, None)
  File "<https://ci-beam.apache.org/job/beam_PostCommit_XVR_Dataflow/ws/src/build/gradleenv/1922375555/lib/python3.6/site-packages/grpc/_channel.py",>
line 826, in _end_unary_response_blocking
    raise _InactiveRpcError(state)
grpc._channel._InactiveRpcError: <_InactiveRpcError of RPC that terminated with:
	status = StatusCode.UNIMPLEMENTED
	details = "Method not found!"
	debug_error_string = "{"created":"@1610021831.451296476","description":"Error received from
peer ipv4:127.0.0.1:18091","file":"src/core/lib/surface/call.cc","file_line":1062,"grpc_message":"Method
not found!","grpc_status":12}"
>

======================================================================
ERROR: test_partition (apache_beam.transforms.validate_runner_xlang_test.ValidateRunnerXlangTest)
----------------------------------------------------------------------
Traceback (most recent call last):
  File "<https://ci-beam.apache.org/job/beam_PostCommit_XVR_Dataflow/ws/src/sdks/python/apache_beam/transforms/validate_runner_xlang_test.py",>
line 285, in test_partition
    test_pipeline or self.create_pipeline())
  File "<https://ci-beam.apache.org/job/beam_PostCommit_XVR_Dataflow/ws/src/sdks/python/apache_beam/transforms/validate_runner_xlang_test.py",>
line 238, in run_partition
    TEST_PARTITION_URN, None, self.expansion_service))
  File "<https://ci-beam.apache.org/job/beam_PostCommit_XVR_Dataflow/ws/src/sdks/python/apache_beam/pvalue.py",>
line 141, in __or__
    return self.pipeline.apply(ptransform, self)
  File "<https://ci-beam.apache.org/job/beam_PostCommit_XVR_Dataflow/ws/src/sdks/python/apache_beam/pipeline.py",>
line 691, in apply
    pvalueish_result = self.runner.apply(transform, pvalueish, self._options)
  File "<https://ci-beam.apache.org/job/beam_PostCommit_XVR_Dataflow/ws/src/sdks/python/apache_beam/runners/dataflow/dataflow_runner.py",>
line 151, in apply
    return super(DataflowRunner, self).apply(transform, input, options)
  File "<https://ci-beam.apache.org/job/beam_PostCommit_XVR_Dataflow/ws/src/sdks/python/apache_beam/runners/runner.py",>
line 188, in apply
    return m(transform, input, options)
  File "<https://ci-beam.apache.org/job/beam_PostCommit_XVR_Dataflow/ws/src/sdks/python/apache_beam/runners/runner.py",>
line 218, in apply_PTransform
    return transform.expand(input)
  File "<https://ci-beam.apache.org/job/beam_PostCommit_XVR_Dataflow/ws/src/sdks/python/apache_beam/transforms/external.py",>
line 316, in expand
    response = service.Expand(request)
  File "<https://ci-beam.apache.org/job/beam_PostCommit_XVR_Dataflow/ws/src/build/gradleenv/1922375555/lib/python3.6/site-packages/grpc/_channel.py",>
line 923, in __call__
    return _end_unary_response_blocking(state, call, False, None)
  File "<https://ci-beam.apache.org/job/beam_PostCommit_XVR_Dataflow/ws/src/build/gradleenv/1922375555/lib/python3.6/site-packages/grpc/_channel.py",>
line 826, in _end_unary_response_blocking
    raise _InactiveRpcError(state)
grpc._channel._InactiveRpcError: <_InactiveRpcError of RPC that terminated with:
	status = StatusCode.UNIMPLEMENTED
	details = "Method not found!"
	debug_error_string = "{"created":"@1610021831.506992437","description":"Error received from
peer ipv4:127.0.0.1:18091","file":"src/core/lib/surface/call.cc","file_line":1062,"grpc_message":"Method
not found!","grpc_status":12}"
>

----------------------------------------------------------------------
XML: nosetests-xlangValidateRunner.xml
----------------------------------------------------------------------
XML: <https://ci-beam.apache.org/job/beam_PostCommit_XVR_Dataflow/ws/src/sdks/python/nosetests.xml>
----------------------------------------------------------------------
Ran 8 tests in 6.604s

FAILED (errors=8)

> Task :runners:google-cloud-dataflow-java:validatesCrossLanguageRunnerPythonUsingJava
FAILED
> Task :runners:google-cloud-dataflow-java:validatesCrossLanguageRunnerCleanup

> Task :runners:google-cloud-dataflow-java:cleanUpDockerImages
Digests:
- us.gcr.io/apache-beam-testing/java-postcommit-it/java@sha256:16f5746e07e3124ae71d41d46044656f97cde88d89355dcf1de294319db3dd21
  Associated tags:
 - 20210107120108
Tags:
- us.gcr.io/apache-beam-testing/java-postcommit-it/java:20210107120108
Deleted [us.gcr.io/apache-beam-testing/java-postcommit-it/java:20210107120108].
Deleted [us.gcr.io/apache-beam-testing/java-postcommit-it/java@sha256:16f5746e07e3124ae71d41d46044656f97cde88d89355dcf1de294319db3dd21].

FAILURE: Build failed with an exception.

* What went wrong:
Execution failed for task ':runners:google-cloud-dataflow-java:validatesCrossLanguageRunnerPythonUsingJava'.
> Process 'command 'sh'' finished with non-zero exit value 1

* Try:
Run with --stacktrace option to get the stack trace. Run with --info or --debug option to
get more log output. Run with --scan to get full insights.

* Get more help at https://help.gradle.org

Deprecated Gradle features were used in this build, making it incompatible with Gradle 7.0.
Use '--warning-mode all' to show the individual deprecation warnings.
See https://docs.gradle.org/6.7.1/userguide/command_line_interface.html#sec:command_line_warnings

BUILD FAILED in 16m 51s
116 actionable tasks: 86 executed, 26 from cache, 4 up-to-date
Gradle was unable to watch the file system for changes. The inotify watches limit is too low.

Publishing build scan...
https://gradle.com/s/iholhorqntlaw

Build step 'Invoke Gradle script' changed build result to FAILURE
Build step 'Invoke Gradle script' marked build as failure

---------------------------------------------------------------------
To unsubscribe, e-mail: builds-unsubscribe@beam.apache.org
For additional commands, e-mail: builds-help@beam.apache.org


Mime
View raw message