beam-builds mailing list archives

Site index · List index
Message view « Date » · « Thread »
Top « Date » · « Thread »
From Apache Jenkins Server <jenk...@builds.apache.org>
Subject Build failed in Jenkins: beam_PostCommit_Java #7139
Date Thu, 28 Jan 2021 13:41:10 GMT
See <https://ci-beam.apache.org/job/beam_PostCommit_Java/7139/display/redirect>

Changes:


------------------------------------------
[...truncated 112.99 KB...]
> Task :sdks:java:container:resolveBuildDependencies
Resolving ./github.com/apache/beam/sdks/go@<https://ci-beam.apache.org/job/beam_PostCommit_Java/ws/src/sdks/go>

> Task :sdks:java:container:installDependencies

> Task :sdks:java:container:buildLinuxAmd64
Unable to watch the file system for changes. The inotify watches limit is too low.

> Task :sdks:java:container:goBuild
> Task :sdks:java:container:java8:copySdkHarnessLauncher
> Task :sdks:java:container:java8:dockerPrepare
> Task :sdks:java:io:kafka:kafkaVersion222BatchIT

> Task :sdks:java:container:java8:docker
 ---> 1a5bc835d4c8
Step 9/17 : ADD target/kafka-clients.jar /opt/apache/beam/jars/
 ---> 8361b797f938
Step 10/17 : ADD target/linux_amd64/boot /opt/apache/beam/
 ---> 513537918103
Step 11/17 : COPY target/LICENSE /opt/apache/beam/
 ---> 19239e680c97
Step 12/17 : COPY target/NOTICE /opt/apache/beam/
 ---> ec985b58fad8
Step 13/17 : ADD target/third_party_licenses /opt/apache/beam/third_party_licenses/
 ---> d846dd5cb0b3
Step 14/17 : COPY target/LICENSE target/go-licenses/* /opt/apache/beam/third_party_licenses/golang/
 ---> 33929310f69d
Step 15/17 : RUN rm /opt/apache/beam/third_party_licenses/golang/LICENSE
 ---> Running in c89229b8d78e
Removing intermediate container c89229b8d78e
 ---> 2de099410aad
Step 16/17 : RUN if [ "${pull_licenses}" = "false" ] ; then     rm -rf /opt/apache/beam/third_party_licenses
;    fi
 ---> Running in 7ad6232dab90
Removing intermediate container 7ad6232dab90
 ---> 006e0b8fa48d
Step 17/17 : ENTRYPOINT ["/opt/apache/beam/boot"]
 ---> Running in a18628d3d988
Removing intermediate container a18628d3d988
 ---> e4eee22f9e72
Successfully built e4eee22f9e72
Successfully tagged apache/beam_java8_sdk:2.29.0.dev

> Task :runners:google-cloud-dataflow-java:buildAndPushDockerContainer
WARNING: `gcloud docker` will not be supported for Docker client versions above 18.03.

As an alternative, use `gcloud auth configure-docker` to configure `docker` to
use `gcloud` as a credential helper, then use `docker` as you would for non-GCR
registries, e.g. `docker pull gcr.io/project-id/my-image`. Add
`--verbosity=error` to silence this warning: `gcloud docker
--verbosity=error -- pull gcr.io/project-id/my-image`.

See: https://cloud.google.com/container-registry/docs/support/deprecation-notices#gcloud-docker

The push refers to repository [us.gcr.io/apache-beam-testing/java-postcommit-it/java]
d06c8417b780: Preparing
510d43e4babe: Preparing
42ec3ff6941d: Preparing
fa1b62afca5f: Preparing
0ad5890eb52a: Preparing
1c02c6dda79e: Preparing
37792515df41: Preparing
eaf53f2b3825: Preparing
27e364f8fc7a: Preparing
9ddf5ec57ce3: Preparing
9f6820641676: Preparing
25b2e6cfc187: Preparing
7df6dd475950: Preparing
7496c5e8691b: Preparing
aa7af8a465c6: Preparing
ef9a7b8862f4: Preparing
a1f2f42922b1: Preparing
4762552ad7d8: Preparing
1c02c6dda79e: Waiting
37792515df41: Waiting
eaf53f2b3825: Waiting
27e364f8fc7a: Waiting
9ddf5ec57ce3: Waiting
9f6820641676: Waiting
25b2e6cfc187: Waiting
7df6dd475950: Waiting
7496c5e8691b: Waiting
aa7af8a465c6: Waiting
ef9a7b8862f4: Waiting
a1f2f42922b1: Waiting
4762552ad7d8: Waiting
510d43e4babe: Layer already exists
fa1b62afca5f: Layer already exists
42ec3ff6941d: Layer already exists
d06c8417b780: Layer already exists
0ad5890eb52a: Layer already exists
1c02c6dda79e: Layer already exists
eaf53f2b3825: Layer already exists
27e364f8fc7a: Layer already exists
9ddf5ec57ce3: Layer already exists
9f6820641676: Layer already exists
37792515df41: Layer already exists
25b2e6cfc187: Layer already exists
7df6dd475950: Layer already exists
7496c5e8691b: Layer already exists
aa7af8a465c6: Layer already exists
a1f2f42922b1: Layer already exists
ef9a7b8862f4: Layer already exists
4762552ad7d8: Layer already exists
20210128000058: digest: sha256:5afd4f1125ca3674df7f9d092b52ea42fb98d2bab9289f9ffc8e520d9526e40e
size: 4098
61c922d70aee: Preparing
d80e5a1fcc2e: Preparing
6d03ea0921ba: Preparing
98aa4e95d6cf: Preparing
a4cac1fecf5b: Preparing
b5071313b3de: Preparing
03163c6de48c: Preparing
9481d107a665: Preparing
57fdae9d6298: Preparing
057be54a6746: Preparing
13990ff3262c: Preparing
25b2e6cfc187: Preparing
7df6dd475950: Preparing
7496c5e8691b: Preparing
aa7af8a465c6: Preparing
ef9a7b8862f4: Preparing
a1f2f42922b1: Preparing
4762552ad7d8: Preparing
b5071313b3de: Waiting
03163c6de48c: Waiting
9481d107a665: Waiting
57fdae9d6298: Waiting
057be54a6746: Waiting
13990ff3262c: Waiting
25b2e6cfc187: Waiting
7df6dd475950: Waiting
7496c5e8691b: Waiting
aa7af8a465c6: Waiting
ef9a7b8862f4: Waiting
a1f2f42922b1: Waiting
4762552ad7d8: Waiting
98aa4e95d6cf: Pushed
61c922d70aee: Pushed
a4cac1fecf5b: Pushed
d80e5a1fcc2e: Pushed
9481d107a665: Pushed
03163c6de48c: Pushed
6d03ea0921ba: Pushed
25b2e6cfc187: Layer already exists
aa7af8a465c6: Layer already exists
7df6dd475950: Layer already exists
7496c5e8691b: Layer already exists
a1f2f42922b1: Layer already exists
ef9a7b8862f4: Layer already exists
4762552ad7d8: Layer already exists
057be54a6746: Pushed
13990ff3262c: Pushed
b5071313b3de: Pushed

> Task :sdks:java:io:hadoop-format:runHadoopFormatIO292IT

> Task :runners:google-cloud-dataflow-java:buildAndPushDockerContainer
57fdae9d6298: Pushed
20210128120045: digest: sha256:49f4dc1a4720deb6434e8949031814de815de7fa254180a874cc2f13ec3d279f
size: 4098

> Task :runners:google-cloud-dataflow-java:coreSDKJavaRunnerV2IntegrationTest NO-SOURCE
> Task :sdks:java:io:kafka:kafkaVersion222Test
> Task :runners:google-cloud-dataflow-java:examplesJavaRunnerV2IntegrationTest

> Task :sdks:java:io:google-cloud-platform:integrationTest

org.apache.beam.sdk.io.gcp.healthcare.FhirIOWriteIT > testFhirIO_Import[STU3] FAILED
    org.apache.beam.sdk.Pipeline$PipelineExecutionException at FhirIOWriteIT.java:139
        Caused by: java.lang.AssertionError at FhirIOWriteIT.java:137
            Caused by: java.lang.AssertionError at MatcherAssert.java:18

> Task :sdks:java:io:hadoop-format:runHadoopFormatIO292Test
> Task :sdks:java:io:kafka:kafkaVersion231BatchIT
> Task :sdks:java:io:kafka:kafkaVersion231Test
> Task :sdks:java:io:hadoop-format:runHadoopFormatIO321ElasticIT
> Task :sdks:java:io:kafka:kafkaVersion241BatchIT
> Task :sdks:java:io:kafka:kafkaVersion241Test
> Task :sdks:java:io:hadoop-format:runHadoopFormatIO321IT
> Task :sdks:java:io:kafka:kafkaVersion251BatchIT

> Task :sdks:java:io:google-cloud-platform:integrationTest

43 tests completed, 1 failed, 1 skipped

> Task :sdks:java:io:google-cloud-platform:integrationTest FAILED
> Task :sdks:java:io:hadoop-format:runHadoopFormatIO321Test
> Task :sdks:java:io:kafka:kafkaVersion251Test
> Task :sdks:java:io:kafka:kafkaVersionsCompatibilityTest
> Task :sdks:java:io:google-cloud-platform:integrationTestKms
> Task :sdks:java:io:hadoop-format:hadoopVersionsTest
> Task :javaHadoopVersionsTest
> Task :sdks:java:extensions:zetasketch:postCommit

> Task :runners:google-cloud-dataflow-java:examplesJavaRunnerV2IntegrationTest

***********************************************************
***********************************************************
**********************Set Up Pubsub************************
The Pub/Sub topic has been set up for this example: projects/apache-beam-testing/topics/testpipeline-jenkins-0128123642-b286e3eb
The Pub/Sub subscription has been set up for this example: projects/apache-beam-testing/subscriptions/testpipeline-jenkins-0128123642-b286e3eb
******************Set Up Big Query Table*******************
The BigQuery table has been set up for this example: apache-beam-testing:traffic_max_lane_flow_1611837401926.traffic_max_lane_flow_table
*************************Tear Down*************************
The Pub/Sub topic has been deleted: projects/apache-beam-testing/topics/testpipeline-jenkins-0128123642-b286e3eb
The Pub/Sub subscription has been deleted: projects/apache-beam-testing/subscriptions/testpipeline-jenkins-0128123642-b286e3eb
The BigQuery table might contain the example's output, and it is not deleted automatically:
apache-beam-testing:traffic_max_lane_flow_1611837401926.traffic_max_lane_flow_table
Please go to the Developers Console to delete it manually. Otherwise, you may be charged for
its usage.
***********************************************************
***********************************************************

> Task :runners:google-cloud-dataflow-java:googleCloudPlatformRunnerV2IntegrationTest

> Task :runners:google-cloud-dataflow-java:cleanUpDockerImages
Untagged: us.gcr.io/apache-beam-testing/java-postcommit-it/java:20210128120045
Untagged: us.gcr.io/apache-beam-testing/java-postcommit-it/java@sha256:49f4dc1a4720deb6434e8949031814de815de7fa254180a874cc2f13ec3d279f
Digests:
- us.gcr.io/apache-beam-testing/java-postcommit-it/java@sha256:49f4dc1a4720deb6434e8949031814de815de7fa254180a874cc2f13ec3d279f
  Associated tags:
 - 20210128120045
Tags:
- us.gcr.io/apache-beam-testing/java-postcommit-it/java:20210128120045
Deleted [us.gcr.io/apache-beam-testing/java-postcommit-it/java:20210128120045].
Deleted [us.gcr.io/apache-beam-testing/java-postcommit-it/java@sha256:49f4dc1a4720deb6434e8949031814de815de7fa254180a874cc2f13ec3d279f].

> Task :runners:google-cloud-dataflow-java:postCommitRunnerV2

FAILURE: Build failed with an exception.

* What went wrong:
Execution failed for task ':sdks:java:io:google-cloud-platform:integrationTest'.
> There were failing tests. See the report at: file://<https://ci-beam.apache.org/job/beam_PostCommit_Java/ws/src/sdks/java/io/google-cloud-platform/build/reports/tests/integrationTest/index.html>

* Try:
Run with --stacktrace option to get the stack trace. Run with --info or --debug option to
get more log output. Run with --scan to get full insights.

* Get more help at https://help.gradle.org

Deprecated Gradle features were used in this build, making it incompatible with Gradle 7.0.
Use '--warning-mode all' to show the individual deprecation warnings.
See https://docs.gradle.org/6.8/userguide/command_line_interface.html#sec:command_line_warnings

BUILD FAILED in 1h 40m 47s
248 actionable tasks: 156 executed, 90 from cache, 2 up-to-date
Gradle was unable to watch the file system for changes. The inotify watches limit is too low.

Publishing build scan...
https://gradle.com/s/kznue2sjbgxwk

Build step 'Invoke Gradle script' changed build result to FAILURE
Build step 'Invoke Gradle script' marked build as failure

---------------------------------------------------------------------
To unsubscribe, e-mail: builds-unsubscribe@beam.apache.org
For additional commands, e-mail: builds-help@beam.apache.org


Mime
View raw message