beam-builds mailing list archives

Site index · List index
Message view « Date » · « Thread »
Top « Date » · « Thread »
From Apache Jenkins Server <jenk...@builds.apache.org>
Subject Build failed in Jenkins: beam_PostCommit_Go_VR_Flink #4265
Date Fri, 15 Jan 2021 12:29:29 GMT
See <https://ci-beam.apache.org/job/beam_PostCommit_Go_VR_Flink/4265/display/redirect>

Changes:


------------------------------------------
[...truncated 269.28 KB...]
      >
      component_coder_ids: "c13"
    >
  >
  coders: <
    key: "c15"
    value: <
      spec: <
        urn: "beam:coder:iterable:v1"
      >
      component_coder_ids: "c14"
    >
  >
  coders: <
    key: "c16"
    value: <
      spec: <
        urn: "beam:coder:kv:v1"
      >
      component_coder_ids: "c7"
      component_coder_ids: "c15"
    >
  >
  coders: <
    key: "c17"
    value: <
      spec: <
        urn: "beam:coder:kv:v1"
      >
      component_coder_ids: "c3"
      component_coder_ids: "c3"
    >
  >
  coders: <
    key: "c18"
    value: <
      spec: <
        urn: "beam:coder:iterable:v1"
      >
      component_coder_ids: "c3"
    >
  >
  coders: <
    key: "c19"
    value: <
      spec: <
        urn: "beam:coder:kv:v1"
      >
      component_coder_ids: "c3"
      component_coder_ids: "c18"
    >
  >
  coders: <
    key: "c2"
    value: <
      spec: <
        urn: "beam:go:coder:custom:v1"
        payload: "Cgd2YXJpbnR6EgIIAhqFAQpxZ2l0aHViLmNvbS9hcGFjaGUvYmVhbS9zZGtzL2dvL3Rlc3QvdmVuZG9yL2dpdGh1Yi5jb20vYXBhY2hlL2JlYW0vc2Rrcy9nby9wa2cvYmVhbS9jb3JlL3J1bnRpbWUvY29kZXJ4LmVuY1ZhckludFoSEAgWIgQIGUAPKgYIFBICCAgikQEKcWdpdGh1Yi5jb20vYXBhY2hlL2JlYW0vc2Rrcy9nby90ZXN0L3ZlbmRvci9naXRodWIuY29tL2FwYWNoZS9iZWFtL3Nka3MvZ28vcGtnL2JlYW0vY29yZS9ydW50aW1lL2NvZGVyeC5kZWNWYXJJbnRaEhwIFiIECBlAAyIGCBQSAggIKgQIGUAPKgQIGUAB"
      >
    >
  >
  coders: <
    key: "c3"
    value: <
      spec: <
        urn: "beam:coder:length_prefix:v1"
      >
      component_coder_ids: "c2"
    >
  >
  coders: <
    key: "c4"
    value: <
      spec: <
        urn: "beam:coder:kv:v1"
      >
      component_coder_ids: "c3"
      component_coder_ids: "c0"
    >
  >
  coders: <
    key: "c5"
    value: <
      spec: <
        urn: "beam:coder:iterable:v1"
      >
      component_coder_ids: "c0"
    >
  >
  coders: <
    key: "c6"
    value: <
      spec: <
        urn: "beam:coder:kv:v1"
      >
      component_coder_ids: "c3"
      component_coder_ids: "c5"
    >
  >
  coders: <
    key: "c7"
    value: <
      spec: <
        urn: "beam:coder:string_utf8:v1"
      >
    >
  >
  coders: <
    key: "c8"
    value: <
      spec: <
        urn: "beam:coder:kv:v1"
      >
      component_coder_ids: "c7"
      component_coder_ids: "c3"
    >
  >
  coders: <
    key: "c9"
    value: <
      spec: <
        urn: "beam:coder:kv:v1"
      >
      component_coder_ids: "c7"
      component_coder_ids: "c7"
    >
  >
  environments: <
    key: "go"
    value: <
      urn: "beam:env:docker:v1"
      payload: "\nAus.gcr.io/apache-beam-testing/jenkins/beam_go_sdk:20210115-120626"
      capabilities: "beam:protocol:progress_reporting:v0"
      capabilities: "beam:protocol:multi_core_bundle_processing:v1"
      capabilities: "beam:version:sdk_base:go"
      capabilities: "beam:coder:bytes:v1"
      capabilities: "beam:coder:bool:v1"
      capabilities: "beam:coder:varint:v1"
      capabilities: "beam:coder:double:v1"
      capabilities: "beam:coder:string_utf8:v1"
      capabilities: "beam:coder:length_prefix:v1"
      capabilities: "beam:coder:kv:v1"
      capabilities: "beam:coder:iterable:v1"
      capabilities: "beam:coder:state_backed_iterable:v1"
      capabilities: "beam:coder:windowed_value:v1"
      capabilities: "beam:coder:global_window:v1"
      capabilities: "beam:coder:interval_window:v1"
      dependencies: <
        type_urn: "beam:artifact:type:go_worker_binary:v1"
        role_urn: "beam:artifact:role:staging_to:v1"
        role_payload: "\n\006worker"
      >
    >
  >
>
root_transform_ids: "e5"
root_transform_ids: "e1"
root_transform_ids: "e3"
root_transform_ids: "s1"
root_transform_ids: "e11_reshuffle"
root_transform_ids: "e12"
root_transform_ids: "s5"
root_transform_ids: "s4"
root_transform_ids: "s3"
root_transform_ids: "s2"
2021/01/15 12:29:25 Test reshuffle:reshufflekv failed: 	connecting to job service
failed to dial server at localhost:38079
	caused by:
context deadline exceeded
2021/01/15 12:29:25 Result: 11 tests failed

if [[ ! -z "$JOB_PORT" ]]; then
  # Shut down the job server
  kill %1 || echo "Failed to shut down job server"
fi

if [[ "$PUSH_CONTAINER_TO_GCR" = 'yes' ]]; then
  # Delete the container locally and remotely
  docker rmi $CONTAINER:$TAG || echo "Failed to remove container"
  gcloud --quiet container images delete $CONTAINER:$TAG || echo "Failed to delete container"

  # Clean up tempdir
  rm -rf $TMPDIR
fi
Untagged: us.gcr.io/apache-beam-testing/jenkins/beam_go_sdk:20210115-120626
Untagged: us.gcr.io/apache-beam-testing/jenkins/beam_go_sdk@sha256:413496f84ec167b9f6ed71469ff60927fe1db8c195424fb3172c00c2af5316cd
Deleted: sha256:3b70b7f2c7b21fc3fc8a5eee167b793e9ea88b1a2a8c705239b8d1be72df12a2
Deleted: sha256:0819f4f6d930183112714f1518ae65e2fe6e6c000a1c11f88e5f5426afbcb4d9
Deleted: sha256:91e4a9e3fe88da177cd2935bd5d509008bb1669c894371a9ce0be1f7c243d101
Deleted: sha256:7022b0e27c3e6ef3243daa429a4ba2e537b61af81cac0a7be06ed774c8505071
Deleted: sha256:d0ee508340bda1e146970d1b5be35fcdcea4825f93e404186f1ecfae29d1dce7
Deleted: sha256:b5f021d68df92962dcc7dc704007cfb5d44ce8ba56c4eb683a1aee10f28a42bb
Deleted: sha256:968fd798c02ad79d7f1ceff7e5b9054c086a48f7691bf8f94db70dd0b285aa06
Deleted: sha256:f631a95d670444c1d0e24968c8aaf1a345f09ffdfb052c43881152f269a1d456
Deleted: sha256:487789c55c83e3b03bed9e979d0c55c29e7e5e485d4ba73fca32747c8d053dc3
Deleted: sha256:ce3c8d9193bd72a16207223c25d33bdaaf3745eb92def194be7f633deab9c508
Deleted: sha256:fb1c5d0bbbc49680be3a73232403f7067f26f910442372c7e6f5a28ae71671c2
Deleted: sha256:63c1dda62470e367ca76f68a0c2a29923c927f680c27759b8bb64704e9740ff1
Deleted: sha256:2b42b047ca77a889edf945c67735da84cbeebd7737b9d6d762459bc7f618816c
Deleted: sha256:eb2160732ea3b226bde9e5a835c190559a9cbe086f4508fe5913b047b8c73c68
Deleted: sha256:fbea7491bd629484716a57c9aa9f33522c45d1c16e0f2ef2c16c6c41bb0bf58b
Deleted: sha256:1d53b3f0ffc58487afe0a37ee5cc7a46a53b6857d4dd22f840024cc2aa303f92
Deleted: sha256:cb90639c1db9f1b31dd5c577e0df4587d8ebbb2f3a1cffd095ea56e1f206f521
Digests:
- us.gcr.io/apache-beam-testing/jenkins/beam_go_sdk@sha256:413496f84ec167b9f6ed71469ff60927fe1db8c195424fb3172c00c2af5316cd
  Associated tags:
 - 20210115-120626
Tags:
- us.gcr.io/apache-beam-testing/jenkins/beam_go_sdk:20210115-120626
Deleted [us.gcr.io/apache-beam-testing/jenkins/beam_go_sdk:20210115-120626].
Deleted [us.gcr.io/apache-beam-testing/jenkins/beam_go_sdk@sha256:413496f84ec167b9f6ed71469ff60927fe1db8c195424fb3172c00c2af5316cd].

if [[ "$TEST_EXIT_CODE" -eq 0 ]]; then
  echo ">>> SUCCESS"
>>> FAILURE
else
  echo ">>> FAILURE"
fi
exit $TEST_EXIT_CODE

> Task :sdks:go:test:flinkValidatesRunner FAILED

FAILURE: Build failed with an exception.

* Where:
Build file '<https://ci-beam.apache.org/job/beam_PostCommit_Go_VR_Flink/ws/src/sdks/go/test/build.gradle'>
line: 150

* What went wrong:
Execution failed for task ':sdks:go:test:flinkValidatesRunner'.
> Process 'command 'sh'' finished with non-zero exit value 1

* Try:
Run with --stacktrace option to get the stack trace. Run with --info or --debug option to
get more log output. Run with --scan to get full insights.

* Get more help at https://help.gradle.org

Deprecated Gradle features were used in this build, making it incompatible with Gradle 7.0.
Use '--warning-mode all' to show the individual deprecation warnings.
See https://docs.gradle.org/6.7.1/userguide/command_line_interface.html#sec:command_line_warnings

BUILD FAILED in 29m 3s
130 actionable tasks: 88 executed, 42 from cache
Gradle was unable to watch the file system for changes. The inotify watches limit is too low.

Publishing build scan...
https://gradle.com/s/xubmmsimacmcw

Build step 'Invoke Gradle script' changed build result to FAILURE
Build step 'Invoke Gradle script' marked build as failure

---------------------------------------------------------------------
To unsubscribe, e-mail: builds-unsubscribe@beam.apache.org
For additional commands, e-mail: builds-help@beam.apache.org


Mime
View raw message