beam-builds mailing list archives

Site index · List index
Message view « Date » · « Thread »
Top « Date » · « Thread »
From Apache Jenkins Server <jenk...@builds.apache.org>
Subject Build failed in Jenkins: beam_PostCommit_Website_Publish #7304
Date Sun, 31 Jan 2021 06:01:25 GMT
See <https://ci-beam.apache.org/job/beam_PostCommit_Website_Publish/7304/display/redirect>

Changes:


------------------------------------------
Started by timer
Running as SYSTEM
[EnvInject] - Loading node environment variables.
Building remotely on websites2 (gitbox-websites git-websites svn-websites) in workspace <https://ci-beam.apache.org/job/beam_PostCommit_Website_Publish/ws/>
No credentials specified
Wiping out workspace first.
Cloning the remote Git repository
Cloning repository https://github.com/apache/beam.git
 > git init <https://ci-beam.apache.org/job/beam_PostCommit_Website_Publish/ws/src>
# timeout=10
Fetching upstream changes from https://github.com/apache/beam.git
 > git --version # timeout=10
 > git fetch --tags --progress -- https://github.com/apache/beam.git +refs/heads/*:refs/remotes/origin/*
# timeout=10
 > git config remote.origin.url https://github.com/apache/beam.git # timeout=10
 > git config --add remote.origin.fetch +refs/heads/*:refs/remotes/origin/* # timeout=10
 > git config remote.origin.url https://github.com/apache/beam.git # timeout=10
Fetching upstream changes from https://github.com/apache/beam.git
 > git fetch --tags --progress -- https://github.com/apache/beam.git +refs/heads/*:refs/remotes/origin/*
+refs/pull/${ghprbPullId}/*:refs/remotes/origin/pr/${ghprbPullId}/* # timeout=10
 > git rev-parse origin/master^{commit} # timeout=10
Checking out Revision bf5810a311737573827b8e8d24ad910b5d4e77fb (origin/master)
 > git config core.sparsecheckout # timeout=10
 > git checkout -f bf5810a311737573827b8e8d24ad910b5d4e77fb # timeout=10
Commit message: "Merge pull request #13819: [website] Clarify JIRA priority for security issues
(CVEs)"
 > git rev-list --no-walk bf5810a311737573827b8e8d24ad910b5d4e77fb # timeout=10
No emails were triggered.
[EnvInject] - Executing scripts and injecting environment variables after the SCM step.
[EnvInject] - Injecting as environment variables the properties content 
SPARK_LOCAL_IP=127.0.0.1
SETUPTOOLS_USE_DISTUTILS=stdlib

[EnvInject] - Variables injected successfully.
[Gradle] - Launching build.
[src] $ <https://ci-beam.apache.org/job/beam_PostCommit_Website_Publish/ws/src/gradlew>
--continue --max-workers=12 -Dorg.gradle.jvmargs=-Xms2g -Dorg.gradle.jvmargs=-Xmx4g -Pdocker-pull-licenses
:website:clean :website:publishWebsite
To honour the JVM settings for this build a single-use Daemon process will be forked. See
https://docs.gradle.org/6.8/userguide/gradle_daemon.html#sec:disabling_the_daemon.
Daemon will be stopped at the end of the build 
> Task :buildSrc:compileJava NO-SOURCE
> Task :buildSrc:compileGroovy FROM-CACHE
> Task :buildSrc:pluginDescriptors
> Task :buildSrc:processResources
> Task :buildSrc:classes
> Task :buildSrc:jar
> Task :buildSrc:assemble
> Task :buildSrc:spotlessGroovy FROM-CACHE
> Task :buildSrc:spotlessGroovyCheck UP-TO-DATE
> Task :buildSrc:spotlessGroovyGradle FROM-CACHE
> Task :buildSrc:spotlessGroovyGradleCheck UP-TO-DATE
> Task :buildSrc:spotlessCheck UP-TO-DATE
> Task :buildSrc:pluginUnderTestMetadata
> Task :buildSrc:compileTestJava NO-SOURCE
> Task :buildSrc:compileTestGroovy NO-SOURCE
> Task :buildSrc:processTestResources NO-SOURCE
> Task :buildSrc:testClasses UP-TO-DATE
> Task :buildSrc:test NO-SOURCE
> Task :buildSrc:validatePlugins FROM-CACHE
> Task :buildSrc:check UP-TO-DATE
> Task :buildSrc:build
Configuration on demand is an incubating feature.
> Task :website:cleanWebsite UP-TO-DATE
> Task :website:clean UP-TO-DATE

> Task :website:buildDockerImage
Sending build context to Docker daemon  49.08MB
Step 1/8 : FROM debian:stretch-slim
 ---> 546475075b6c
Step 2/8 : SHELL ["/bin/bash", "-o", "pipefail", "-e", "-u", "-x", "-c"]
 ---> Using cache
 ---> e31d5f4554f5
Step 3/8 : ENV DEBIAN_FRONTEND=noninteractive     LANGUAGE=C.UTF-8     LANG=C.UTF-8     LC_ALL=C.UTF-8
    LC_CTYPE=C.UTF-8     LC_MESSAGES=C.UTF-8
 ---> Using cache
 ---> 65dcc0e60683
Step 4/8 : RUN apt-get update     && apt-get install -y --no-install-recommends  
      ca-certificates         curl         git         gnupg2         gosu         lynx  
  && apt-get autoremove -yqq --purge     && apt-get clean     && rm
-rf /var/lib/apt/lists/*
 ---> Using cache
 ---> 6a5c5d227339
Step 5/8 : RUN curl -sL https://deb.nodesource.com/setup_10.x | bash -     && apt-get
update     && apt-get install -y --no-install-recommends         nodejs     &&
apt-get autoremove -yqq --purge     && apt-get clean     && rm -rf /var/lib/apt/lists/*
 ---> Using cache
 ---> 82b584b65f7f
Step 6/8 : RUN curl -sS https://dl.yarnpkg.com/debian/pubkey.gpg | apt-key add -     &&
echo "deb https://dl.yarnpkg.com/debian/ stable main" | tee /etc/apt/sources.list.d/yarn.list
    && apt-get update     && apt-get install -y --no-install-recommends yarn
    && apt-get autoremove -yqq --purge     && apt-get clean     &&
rm -rf /var/lib/apt/lists/*
 ---> Using cache
 ---> cdb942668009
Step 7/8 : RUN HUGOHOME="$(mktemp -d)"     && export HUGOHOME     && curl
-sL https://github.com/gohugoio/hugo/releases/download/v0.68.3/hugo_extended_0.68.3_Linux-64bit.tar.gz
> "${HUGOHOME}/hugo.tar.gz"     && tar -xzvf "${HUGOHOME}/hugo.tar.gz" hugo   
 && mv hugo /usr/local/bin/hugo     && chmod +x /usr/local/bin/hugo     &&
rm -r "${HUGOHOME}"
 ---> Using cache
 ---> d013f96dae63
Step 8/8 : WORKDIR /opt/
 ---> Using cache
 ---> a917ce4288c6
Successfully built a917ce4288c6
Successfully tagged beam-website:latest

> Task :website:createDockerContainer

> Task :website:startDockerContainer
82adb88dc70d39ad092b104f55d1c2a37588b12895233c4c17634e905aaf8d95

> Task :website:setupDockerContainer

> Task :website:installDependencies
yarn install v1.22.5
[1/4] Resolving packages...
[2/4] Fetching packages...
info fsevents@2.1.3: The platform "linux" is incompatible with this module.
info "fsevents@2.1.3" is an optional dependency and failed compatibility check. Excluding
it from installation.
[3/4] Linking dependencies...
[4/4] Building fresh packages...
Done in 3.51s.

> Task :website:initGitSubmodules
Submodule '.github/actions/cancel-workflow-runs' (https://github.com/potiuk/cancel-workflow-runs)
registered for path '.github/actions/cancel-workflow-runs'
Submodule '.github/actions/github-push-action' (https://github.com/ad-m/github-push-action)
registered for path '.github/actions/github-push-action'
Submodule '.github/actions/gradle-command-action' (https://github.com/eskatos/gradle-command-action)
registered for path '.github/actions/gradle-command-action'
Submodule 'website/www/site/themes/docsy' (https://github.com/google/docsy.git) registered
for path 'website/www/site/themes/docsy'
Cloning into '/opt/.github/actions/cancel-workflow-runs'...
Cloning into '/opt/.github/actions/github-push-action'...
Cloning into '/opt/.github/actions/gradle-command-action'...
Cloning into '/opt/website/www/site/themes/docsy'...
Submodule path '.github/actions/cancel-workflow-runs': checked out '953e057dc81d3458935a18d1184c386b0f6b5738'
Submodule path '.github/actions/github-push-action': checked out '057a6ba835d986bfe495dd476a6c4db1d5f9503c'
Submodule path '.github/actions/gradle-command-action': checked out '90ccf054e6b9905f30f98c938bce4c6acd323b6b'
Submodule path 'website/www/site/themes/docsy': checked out '8b786354829536454688df1e63b9cad792f68562'
Submodule 'assets/vendor/Font-Awesome' (https://github.com/FortAwesome/Font-Awesome.git) registered
for path 'website/www/site/themes/docsy/assets/vendor/Font-Awesome'
Submodule 'assets/vendor/bootstrap' (https://github.com/twbs/bootstrap.git) registered for
path 'website/www/site/themes/docsy/assets/vendor/bootstrap'
Cloning into '/opt/website/www/site/themes/docsy/assets/vendor/Font-Awesome'...
Cloning into '/opt/website/www/site/themes/docsy/assets/vendor/bootstrap'...
Submodule path 'website/www/site/themes/docsy/assets/vendor/Font-Awesome': checked out '538a5bc4cf7989821d052e3ff919e2bead07021c'
Submodule path 'website/www/site/themes/docsy/assets/vendor/bootstrap': checked out '3b558734382ce58b51e5fc676453bfd53bba9201'

> Task :website:buildCodeSamples
yarn run v1.22.5
$ ./build_code_samples.sh
Working directory: /opt/website/www
Dist directory: ./site/code_samples
mkdir: created directory './site/code_samples'
Done in 0.52s.

> Task :website:buildApacheWebsite
yarn run v1.22.5
$ cross-env HUGO_ENV=production hugo --minify -d ../dist -s site -v -d /opt/build/website/generated-apache-content
--config /opt/website/www/site/config.toml
INFO 2021/01/31 06:01:13 Using config file: 
Building sites … INFO 2021/01/31 06:01:13 syncing static files to /opt/build/website/generated-apache-content/
INFO 2021/01/31 06:01:16 postcss: use config file /opt/website/www/site/themes/docsy/postcss.config.js

  Replace Autoprefixer browsers option to Browserslist config.
  Use browserslist key in package.json or .browserslistrc file.

  Using browsers option can cause errors. Browserslist config 
  can be used for Babel, Autoprefixer, postcss-normalize and other tools.

  If you really need to use option, rename it to overrideBrowserslist.

  Learn more at:
  https://github.com/browserslist/browserslist#readme
  https://twitter.com/browserslist


Browserslist: caniuse-lite is outdated. Please run:
npx browserslist@latest --update-db

                   | EN   
-------------------+------
  Pages            | 317  
  Paginator pages  |   0  
  Non-page files   |   0  
  Static files     | 245  
  Processed images |   0  
  Aliases          | 123  
  Sitemaps         |   1  
  Cleaned          |   0  

Total in 6465 ms
Done in 6.68s.

> Task :website:stopAndRemoveDockerContainer
82adb88dc70d39ad092b104f55d1c2a37588b12895233c4c17634e905aaf8d95

> Task :website:commitWebsite
git fetch --force origin +asf-site:asf-site
>From https://github.com/apache/beam
 * [new branch]            asf-site   -> asf-site

> Task :website:commitWebsite FAILED

FAILURE: Build failed with an exception.

* Where:
Build file '<https://ci-beam.apache.org/job/beam_PostCommit_Website_Publish/ws/src/website/build.gradle'>
line: 275

* What went wrong:
Execution failed for task ':website:commitWebsite'.
> org.eclipse.jgit.api.errors.CheckoutConflictException: Checkout conflict with files:

  website/www/site/static/images/mascot/beam_mascot.ai
  website/www/site/static/images/mascot/big_data.ai
  website/www/site/static/images/mascot/learning_independently.ai
  website/www/site/static/images/mascot/model_sheet.ai

* Try:
Run with --stacktrace option to get the stack trace. Run with --info or --debug option to
get more log output. Run with --scan to get full insights.

* Get more help at https://help.gradle.org

Deprecated Gradle features were used in this build, making it incompatible with Gradle 7.0.
Use '--warning-mode all' to show the individual deprecation warnings.
See https://docs.gradle.org/6.8/userguide/command_line_interface.html#sec:command_line_warnings

BUILD FAILED in 53s
12 actionable tasks: 10 executed, 2 up-to-date

Publishing build scan...
https://gradle.com/s/xwgkgukd4dhem

Build step 'Invoke Gradle script' changed build result to FAILURE
Build step 'Invoke Gradle script' marked build as failure

---------------------------------------------------------------------
To unsubscribe, e-mail: builds-unsubscribe@beam.apache.org
For additional commands, e-mail: builds-help@beam.apache.org


Mime
View raw message