beam-builds mailing list archives

Site index · List index
Message view « Date » · « Thread »
Top « Date » · « Thread »
From Apache Jenkins Server <jenk...@builds.apache.org>
Subject Build failed in Jenkins: beam_PostCommit_Go_VR_Flink #4261
Date Thu, 14 Jan 2021 12:30:39 GMT
See <https://ci-beam.apache.org/job/beam_PostCommit_Go_VR_Flink/4261/display/redirect?page=changes>

Changes:

[noreply] [BEAM-11533] PubSub support Beam DATETIME (SQL TIMESTAMP) type (#13731)


------------------------------------------
[...truncated 274.06 KB...]
      >
      component_coder_ids: "c13"
    >
  >
  coders: <
    key: "c15"
    value: <
      spec: <
        urn: "beam:coder:iterable:v1"
      >
      component_coder_ids: "c14"
    >
  >
  coders: <
    key: "c16"
    value: <
      spec: <
        urn: "beam:coder:kv:v1"
      >
      component_coder_ids: "c7"
      component_coder_ids: "c15"
    >
  >
  coders: <
    key: "c17"
    value: <
      spec: <
        urn: "beam:coder:kv:v1"
      >
      component_coder_ids: "c3"
      component_coder_ids: "c3"
    >
  >
  coders: <
    key: "c18"
    value: <
      spec: <
        urn: "beam:coder:iterable:v1"
      >
      component_coder_ids: "c3"
    >
  >
  coders: <
    key: "c19"
    value: <
      spec: <
        urn: "beam:coder:kv:v1"
      >
      component_coder_ids: "c3"
      component_coder_ids: "c18"
    >
  >
  coders: <
    key: "c2"
    value: <
      spec: <
        urn: "beam:go:coder:custom:v1"
        payload: "Cgd2YXJpbnR6EgIIAhqFAQpxZ2l0aHViLmNvbS9hcGFjaGUvYmVhbS9zZGtzL2dvL3Rlc3QvdmVuZG9yL2dpdGh1Yi5jb20vYXBhY2hlL2JlYW0vc2Rrcy9nby9wa2cvYmVhbS9jb3JlL3J1bnRpbWUvY29kZXJ4LmVuY1ZhckludFoSEAgWIgQIGUAPKgYIFBICCAgikQEKcWdpdGh1Yi5jb20vYXBhY2hlL2JlYW0vc2Rrcy9nby90ZXN0L3ZlbmRvci9naXRodWIuY29tL2FwYWNoZS9iZWFtL3Nka3MvZ28vcGtnL2JlYW0vY29yZS9ydW50aW1lL2NvZGVyeC5kZWNWYXJJbnRaEhwIFiIECBlAAyIGCBQSAggIKgQIGUAPKgQIGUAB"
      >
    >
  >
  coders: <
    key: "c3"
    value: <
      spec: <
        urn: "beam:coder:length_prefix:v1"
      >
      component_coder_ids: "c2"
    >
  >
  coders: <
    key: "c4"
    value: <
      spec: <
        urn: "beam:coder:kv:v1"
      >
      component_coder_ids: "c3"
      component_coder_ids: "c0"
    >
  >
  coders: <
    key: "c5"
    value: <
      spec: <
        urn: "beam:coder:iterable:v1"
      >
      component_coder_ids: "c0"
    >
  >
  coders: <
    key: "c6"
    value: <
      spec: <
        urn: "beam:coder:kv:v1"
      >
      component_coder_ids: "c3"
      component_coder_ids: "c5"
    >
  >
  coders: <
    key: "c7"
    value: <
      spec: <
        urn: "beam:coder:string_utf8:v1"
      >
    >
  >
  coders: <
    key: "c8"
    value: <
      spec: <
        urn: "beam:coder:kv:v1"
      >
      component_coder_ids: "c7"
      component_coder_ids: "c3"
    >
  >
  coders: <
    key: "c9"
    value: <
      spec: <
        urn: "beam:coder:kv:v1"
      >
      component_coder_ids: "c7"
      component_coder_ids: "c7"
    >
  >
  environments: <
    key: "go"
    value: <
      urn: "beam:env:docker:v1"
      payload: "\nAus.gcr.io/apache-beam-testing/jenkins/beam_go_sdk:20210114-120726"
      capabilities: "beam:protocol:progress_reporting:v0"
      capabilities: "beam:protocol:multi_core_bundle_processing:v1"
      capabilities: "beam:version:sdk_base:go"
      capabilities: "beam:coder:bytes:v1"
      capabilities: "beam:coder:bool:v1"
      capabilities: "beam:coder:varint:v1"
      capabilities: "beam:coder:double:v1"
      capabilities: "beam:coder:string_utf8:v1"
      capabilities: "beam:coder:length_prefix:v1"
      capabilities: "beam:coder:kv:v1"
      capabilities: "beam:coder:iterable:v1"
      capabilities: "beam:coder:state_backed_iterable:v1"
      capabilities: "beam:coder:windowed_value:v1"
      capabilities: "beam:coder:global_window:v1"
      capabilities: "beam:coder:interval_window:v1"
      dependencies: <
        type_urn: "beam:artifact:type:go_worker_binary:v1"
        role_urn: "beam:artifact:role:staging_to:v1"
        role_payload: "\n\006worker"
      >
    >
  >
>
root_transform_ids: "e3"
root_transform_ids: "e5"
root_transform_ids: "e1"
root_transform_ids: "s1"
root_transform_ids: "e11_reshuffle"
root_transform_ids: "e12"
root_transform_ids: "s5"
root_transform_ids: "s4"
root_transform_ids: "s3"
root_transform_ids: "s2"
2021/01/14 12:30:33 Test reshuffle:reshufflekv failed: 	connecting to job service
failed to dial server at localhost:59839
	caused by:
context deadline exceeded
2021/01/14 12:30:33 Result: 11 tests failed

if [[ ! -z "$JOB_PORT" ]]; then
  # Shut down the job server
  kill %1 || echo "Failed to shut down job server"
fi

if [[ "$PUSH_CONTAINER_TO_GCR" = 'yes' ]]; then
  # Delete the container locally and remotely
  docker rmi $CONTAINER:$TAG || echo "Failed to remove container"
  gcloud --quiet container images delete $CONTAINER:$TAG || echo "Failed to delete container"

  # Clean up tempdir
  rm -rf $TMPDIR
fi
Untagged: us.gcr.io/apache-beam-testing/jenkins/beam_go_sdk:20210114-120726
Untagged: us.gcr.io/apache-beam-testing/jenkins/beam_go_sdk@sha256:803cd86419faae2b3cf1a2cfd9e1fc1d477b4deb294db062d7985e3aa3dd4838
Deleted: sha256:c16758831d4a07646a5b536173c34b12bf4de312d5839f3c6aa7d561335e9804
Deleted: sha256:c8913f6aba5ca9a6fe972551c971225103f797965a1396e1699547c64759b39a
Deleted: sha256:0f300f02e1a8bf26ebc5a1d7458aed5f4405b072bfd7b5fdcfca4f4376f14204
Deleted: sha256:e348766169fbd7a7a0eddf13057bbd23a7232e0d82fc4e080f216f291d213ff2
Deleted: sha256:6654c78e73798dc0d6a8497e8496c1dff31f69e2eaf0cb71962d17535b3347e4
Deleted: sha256:2f05acec57b3012ea49e462b1eab4a5923c86a60be446a087b8e732b4ed2cdc8
Deleted: sha256:793f82802d75aa4bbb8628b281fa34e0ac43f8709cc02c04e00cc26203f2745d
Deleted: sha256:6369c207e4451deab142a91c528e0ec7eb6bea3c97ce6ff31423d62571764efd
Deleted: sha256:c9794aaf5b1fd84cbcfb2db503eaadbb906df69f009b89be6cd13b629a12e1d6
Deleted: sha256:ed9dc661ba44d4a616d4f57c426aac2a313e6f1e43326f4562df962a00378bfa
Deleted: sha256:b1ce743615ce498e4bd1c2381c4a3b9702074f6c792dc89befd550e7332f509d
Deleted: sha256:6c4b6cec892b19729736528b582723c46b5656391abd8788f5cada020499427a
Deleted: sha256:3823733fcae92c3f4354097cbd06c749ba4f819bdd5abcc777ac3f26657def2c
Deleted: sha256:28bf34ffe7ff101f36f65135accb84caa66b56306ba9ba2bf2c74f35de2f1ab9
Deleted: sha256:1f31c75a49dd25dedbd8fd4f2a099d90d7f7090a2075676746243d2794b198a4
Deleted: sha256:5f849a22e27d69e5ba504fd31c8d96beed2cf4de6332e770e67d2ba7b6803cc4
Deleted: sha256:ef48e6c26ca2cb18d9144c62ac53fcd7bafc0af55b4693f915e7d4407b2cdaa7
Digests:
- us.gcr.io/apache-beam-testing/jenkins/beam_go_sdk@sha256:803cd86419faae2b3cf1a2cfd9e1fc1d477b4deb294db062d7985e3aa3dd4838
  Associated tags:
 - 20210114-120726
Tags:
- us.gcr.io/apache-beam-testing/jenkins/beam_go_sdk:20210114-120726
Deleted [us.gcr.io/apache-beam-testing/jenkins/beam_go_sdk:20210114-120726].
Deleted [us.gcr.io/apache-beam-testing/jenkins/beam_go_sdk@sha256:803cd86419faae2b3cf1a2cfd9e1fc1d477b4deb294db062d7985e3aa3dd4838].

>>> FAILURE
if [[ "$TEST_EXIT_CODE" -eq 0 ]]; then
  echo ">>> SUCCESS"
else
  echo ">>> FAILURE"
fi
exit $TEST_EXIT_CODE

> Task :sdks:go:test:flinkValidatesRunner FAILED

FAILURE: Build failed with an exception.

* Where:
Build file '<https://ci-beam.apache.org/job/beam_PostCommit_Go_VR_Flink/ws/src/sdks/go/test/build.gradle'>
line: 150

* What went wrong:
Execution failed for task ':sdks:go:test:flinkValidatesRunner'.
> Process 'command 'sh'' finished with non-zero exit value 1

* Try:
Run with --stacktrace option to get the stack trace. Run with --info or --debug option to
get more log output. Run with --scan to get full insights.

* Get more help at https://help.gradle.org

Deprecated Gradle features were used in this build, making it incompatible with Gradle 7.0.
Use '--warning-mode all' to show the individual deprecation warnings.
See https://docs.gradle.org/6.7.1/userguide/command_line_interface.html#sec:command_line_warnings

BUILD FAILED in 30m 17s
130 actionable tasks: 99 executed, 31 from cache
Gradle was unable to watch the file system for changes. The inotify watches limit is too low.

Publishing build scan...
https://gradle.com/s/c32nt4jwki6mm

Build step 'Invoke Gradle script' changed build result to FAILURE
Build step 'Invoke Gradle script' marked build as failure

---------------------------------------------------------------------
To unsubscribe, e-mail: builds-unsubscribe@beam.apache.org
For additional commands, e-mail: builds-help@beam.apache.org


Mime
View raw message