beam-builds mailing list archives

Site index · List index
Message view « Date » · « Thread »
Top « Date » · « Thread »
From Apache Jenkins Server <jenk...@builds.apache.org>
Subject Build failed in Jenkins: beam_PostCommit_Python38 #741
Date Thu, 07 Jan 2021 13:18:27 GMT
See <https://ci-beam.apache.org/job/beam_PostCommit_Python38/741/display/redirect>

Changes:


------------------------------------------
[...truncated 19.92 MB...]
 projectId: 'apache-beam-testing'
 stageStates: []
 startTime: '2021-01-07T13:10:56.569259Z'
 steps: []
 tempFiles: []
 type: TypeValueValuesEnum(JOB_TYPE_BATCH, 1)>
INFO:apache_beam.runners.dataflow.internal.apiclient:Created job with id: [2021-01-07_05_10_54-2046044609921854810]
INFO:apache_beam.runners.dataflow.internal.apiclient:Submitted job: 2021-01-07_05_10_54-2046044609921854810
INFO:apache_beam.runners.dataflow.internal.apiclient:To access the Dataflow monitoring console,
please navigate to https://console.cloud.google.com/dataflow/jobs/us-central1/2021-01-07_05_10_54-2046044609921854810?project=apache-beam-testing
INFO:apache_beam.runners.dataflow.dataflow_runner:Job 2021-01-07_05_10_54-2046044609921854810
is in state JOB_STATE_RUNNING
INFO:apache_beam.runners.dataflow.dataflow_runner:2021-01-07T13:10:54.959Z: JOB_MESSAGE_DETAILED:
Autoscaling is enabled for job 2021-01-07_05_10_54-2046044609921854810. The number of workers
will be between 1 and 1000.
INFO:apache_beam.runners.dataflow.dataflow_runner:2021-01-07T13:10:54.959Z: JOB_MESSAGE_DETAILED:
Autoscaling was automatically enabled for job 2021-01-07_05_10_54-2046044609921854810.
INFO:apache_beam.runners.dataflow.dataflow_runner:2021-01-07T13:10:59.423Z: JOB_MESSAGE_BASIC:
Worker configuration: n1-standard-1 in us-central1-f.
INFO:apache_beam.runners.dataflow.dataflow_runner:2021-01-07T13:11:01.035Z: JOB_MESSAGE_DETAILED:
Expanding CoGroupByKey operations into optimizable parts.
INFO:apache_beam.runners.dataflow.dataflow_runner:2021-01-07T13:11:01.071Z: JOB_MESSAGE_DEBUG:
Combiner lifting skipped for step GroupByKey: GroupByKey not followed by a combiner.
INFO:apache_beam.runners.dataflow.dataflow_runner:2021-01-07T13:11:01.108Z: JOB_MESSAGE_DETAILED:
Expanding GroupByKey operations into optimizable parts.
INFO:apache_beam.runners.dataflow.dataflow_runner:2021-01-07T13:11:01.174Z: JOB_MESSAGE_DETAILED:
Lifting ValueCombiningMappingFns into MergeBucketsMappingFns
INFO:apache_beam.runners.dataflow.dataflow_runner:2021-01-07T13:11:01.264Z: JOB_MESSAGE_DEBUG:
Annotating graph with Autotuner information.
INFO:apache_beam.runners.dataflow.dataflow_runner:2021-01-07T13:11:01.306Z: JOB_MESSAGE_DETAILED:
Fusing adjacent ParDo, Read, Write, and Flatten operations
INFO:apache_beam.runners.dataflow.dataflow_runner:2021-01-07T13:11:01.336Z: JOB_MESSAGE_DETAILED:
Fusing consumer metrics into Create/Read
INFO:apache_beam.runners.dataflow.dataflow_runner:2021-01-07T13:11:01.369Z: JOB_MESSAGE_DETAILED:
Fusing consumer map_to_common_key into metrics
INFO:apache_beam.runners.dataflow.dataflow_runner:2021-01-07T13:11:01.391Z: JOB_MESSAGE_DETAILED:
Fusing consumer GroupByKey/Reify into map_to_common_key
INFO:apache_beam.runners.dataflow.dataflow_runner:2021-01-07T13:11:01.424Z: JOB_MESSAGE_DETAILED:
Fusing consumer GroupByKey/Write into GroupByKey/Reify
INFO:apache_beam.runners.dataflow.dataflow_runner:2021-01-07T13:11:01.456Z: JOB_MESSAGE_DETAILED:
Fusing consumer GroupByKey/GroupByWindow into GroupByKey/Read
INFO:apache_beam.runners.dataflow.dataflow_runner:2021-01-07T13:11:01.550Z: JOB_MESSAGE_DETAILED:
Fusing consumer m_out into GroupByKey/GroupByWindow
INFO:apache_beam.runners.dataflow.dataflow_runner:2021-01-07T13:11:01.576Z: JOB_MESSAGE_DEBUG:
Workflow config is missing a default resource spec.
INFO:apache_beam.runners.dataflow.dataflow_runner:2021-01-07T13:11:01.610Z: JOB_MESSAGE_DEBUG:
Adding StepResource setup and teardown to workflow graph.
INFO:apache_beam.runners.dataflow.dataflow_runner:2021-01-07T13:11:01.648Z: JOB_MESSAGE_DEBUG:
Adding workflow start and stop steps.
INFO:apache_beam.runners.dataflow.dataflow_runner:2021-01-07T13:11:01.687Z: JOB_MESSAGE_DEBUG:
Assigning stage ids.
INFO:apache_beam.runners.dataflow.dataflow_runner:2021-01-07T13:11:01.913Z: JOB_MESSAGE_DEBUG:
Executing wait step start13
INFO:apache_beam.runners.dataflow.dataflow_runner:2021-01-07T13:11:02.006Z: JOB_MESSAGE_BASIC:
Executing operation GroupByKey/Create
INFO:apache_beam.runners.dataflow.dataflow_runner:2021-01-07T13:11:02.046Z: JOB_MESSAGE_DEBUG:
Starting worker pool setup.
INFO:apache_beam.runners.dataflow.dataflow_runner:2021-01-07T13:11:02.100Z: JOB_MESSAGE_BASIC:
Starting 1 workers in us-central1-f...
INFO:apache_beam.runners.dataflow.dataflow_runner:2021-01-07T13:11:02.148Z: JOB_MESSAGE_BASIC:
Finished operation GroupByKey/Create
INFO:apache_beam.runners.dataflow.dataflow_runner:2021-01-07T13:11:02.230Z: JOB_MESSAGE_DEBUG:
Value "GroupByKey/Session" materialized.
INFO:apache_beam.runners.dataflow.dataflow_runner:2021-01-07T13:11:02.278Z: JOB_MESSAGE_BASIC:
Executing operation Create/Read+metrics+map_to_common_key+GroupByKey/Reify+GroupByKey/Write
INFO:apache_beam.runners.dataflow.dataflow_runner:2021-01-07T13:11:05.390Z: JOB_MESSAGE_BASIC:
Finished operation read/ReadFromBigQuery/FilesToRemoveImpulse/Read+read/ReadFromBigQuery/MapFilesToRemove
INFO:apache_beam.runners.dataflow.dataflow_runner:2021-01-07T13:11:05.503Z: JOB_MESSAGE_DEBUG:
Value "read/ReadFromBigQuery/MapFilesToRemove.out" materialized.
INFO:apache_beam.runners.dataflow.dataflow_runner:2021-01-07T13:11:05.557Z: JOB_MESSAGE_BASIC:
Executing operation read/ReadFromBigQuery/_PassThroughThenCleanup/ParDo(RemoveExtractedFiles)/_UnpickledSideInput(MapFilesToRemove.out.0)
INFO:apache_beam.runners.dataflow.dataflow_runner:2021-01-07T13:11:05.610Z: JOB_MESSAGE_BASIC:
Finished operation read/ReadFromBigQuery/_PassThroughThenCleanup/ParDo(RemoveExtractedFiles)/_UnpickledSideInput(MapFilesToRemove.out.0)
INFO:apache_beam.runners.dataflow.dataflow_runner:2021-01-07T13:11:05.682Z: JOB_MESSAGE_DEBUG:
Value "read/ReadFromBigQuery/_PassThroughThenCleanup/ParDo(RemoveExtractedFiles)/_UnpickledSideInput(MapFilesToRemove.out.0).output"
materialized.
INFO:apache_beam.runners.dataflow.dataflow_runner:2021-01-07T13:11:08.461Z: JOB_MESSAGE_BASIC:
Executing BigQuery import job "dataflow_job_5161610934562375404". You can check its status
with the bq tool: "bq show -j --project_id=apache-beam-testing dataflow_job_5161610934562375404".
INFO:apache_beam.runners.dataflow.dataflow_runner:2021-01-07T13:11:16.454Z: JOB_MESSAGE_BASIC:
Your project already contains 100 Dataflow-created metric descriptors, so new user metrics
of the form custom.googleapis.com/* will not be created. However, all user metrics are also
available in the metric dataflow.googleapis.com/job/user_counter. If you rely on the custom
metrics, you can delete old / unused metric descriptors. See https://developers.google.com/apis-explorer/#p/monitoring/v3/monitoring.projects.metricDescriptors.list
and https://developers.google.com/apis-explorer/#p/monitoring/v3/monitoring.projects.metricDescriptors.delete
INFO:apache_beam.runners.dataflow.dataflow_runner:2021-01-07T13:11:19.042Z: JOB_MESSAGE_BASIC:
BigQuery import job "dataflow_job_5161610934562375404" done.
INFO:apache_beam.runners.dataflow.dataflow_runner:2021-01-07T13:11:19.684Z: JOB_MESSAGE_BASIC:
Finished operation read/ReadFromBigQuery/Read+read/ReadFromBigQuery/_PassThroughThenCleanup/ParDo(PassThrough)/ParDo(PassThrough)+write/Write/NativeWrite
INFO:apache_beam.runners.dataflow.dataflow_runner:2021-01-07T13:11:19.752Z: JOB_MESSAGE_DEBUG:
Value "read/ReadFromBigQuery/_PassThroughThenCleanup/ParDo(PassThrough)/ParDo(PassThrough).cleanup_signal"
materialized.
INFO:apache_beam.runners.dataflow.dataflow_runner:2021-01-07T13:11:19.843Z: JOB_MESSAGE_BASIC:
Executing operation read/ReadFromBigQuery/_PassThroughThenCleanup/ParDo(RemoveExtractedFiles)/_UnpickledSideInput(ParDo(PassThrough).cleanup_signal.0)
INFO:apache_beam.runners.dataflow.dataflow_runner:2021-01-07T13:11:19.896Z: JOB_MESSAGE_BASIC:
Finished operation read/ReadFromBigQuery/_PassThroughThenCleanup/ParDo(RemoveExtractedFiles)/_UnpickledSideInput(ParDo(PassThrough).cleanup_signal.0)
INFO:apache_beam.runners.dataflow.dataflow_runner:2021-01-07T13:11:19.961Z: JOB_MESSAGE_DEBUG:
Value "read/ReadFromBigQuery/_PassThroughThenCleanup/ParDo(RemoveExtractedFiles)/_UnpickledSideInput(ParDo(PassThrough).cleanup_signal.0).output"
materialized.
INFO:apache_beam.runners.dataflow.dataflow_runner:2021-01-07T13:11:20.030Z: JOB_MESSAGE_BASIC:
Executing operation read/ReadFromBigQuery/_PassThroughThenCleanup/Create/Read+read/ReadFromBigQuery/_PassThroughThenCleanup/ParDo(RemoveExtractedFiles)/ParDo(RemoveExtractedFiles)
INFO:apache_beam.runners.dataflow.dataflow_runner:2021-01-07T13:11:25.964Z: JOB_MESSAGE_BASIC:
Finished operation read/ReadFromBigQuery/_PassThroughThenCleanup/Create/Read+read/ReadFromBigQuery/_PassThroughThenCleanup/ParDo(RemoveExtractedFiles)/ParDo(RemoveExtractedFiles)
INFO:apache_beam.runners.dataflow.dataflow_runner:2021-01-07T13:11:26.019Z: JOB_MESSAGE_DEBUG:
Executing success step success3
INFO:apache_beam.runners.dataflow.dataflow_runner:2021-01-07T13:11:26.097Z: JOB_MESSAGE_DETAILED:
Cleaning up.
INFO:apache_beam.runners.dataflow.dataflow_runner:2021-01-07T13:11:26.176Z: JOB_MESSAGE_DEBUG:
Starting worker pool teardown.
INFO:apache_beam.runners.dataflow.dataflow_runner:2021-01-07T13:11:26.238Z: JOB_MESSAGE_BASIC:
Stopping worker pool...
INFO:apache_beam.runners.dataflow.dataflow_runner:2021-01-07T13:11:29.658Z: JOB_MESSAGE_DETAILED:
Autoscaling: Raised the number of workers to 1 based on the rate of progress in the currently
running stage(s).
INFO:apache_beam.runners.dataflow.dataflow_runner:2021-01-07T13:12:04.034Z: JOB_MESSAGE_DETAILED:
Workers have started successfully.
INFO:apache_beam.runners.dataflow.dataflow_runner:2021-01-07T13:12:04.060Z: JOB_MESSAGE_DETAILED:
Workers have started successfully.
INFO:apache_beam.runners.dataflow.dataflow_runner:2021-01-07T13:12:08.374Z: JOB_MESSAGE_DETAILED:
Autoscaling: Resized worker pool from 1 to 0.
INFO:apache_beam.runners.dataflow.dataflow_runner:2021-01-07T13:12:08.419Z: JOB_MESSAGE_BASIC:
Worker pool stopped.
INFO:apache_beam.runners.dataflow.dataflow_runner:2021-01-07T13:12:08.453Z: JOB_MESSAGE_DEBUG:
Tearing down pending resources...
INFO:apache_beam.runners.dataflow.dataflow_runner:Job 2021-01-07_05_04_51-1833066476848382015
is in state JOB_STATE_DONE
INFO:apache_beam.io.gcp.tests.bigquery_matcher:Attempting to perform query SELECT fruit from
`python_query_to_table_16100246778404.output_table`; to BQ
DEBUG:google.auth._default:Checking None for explicit credentials as part of auth process...
DEBUG:google.auth._default:Checking Cloud SDK credentials as part of auth process...
DEBUG:google.auth._default:Cloud SDK credentials not found on disk; not using them
DEBUG:google.auth._default:Checking for App Engine runtime as part of auth process...
DEBUG:google.auth._default:No App Engine library was found so cannot authentication via App
Engine Identity Credentials.
DEBUG:google.auth.transport._http_client:Making request: GET http://169.254.169.254
DEBUG:google.auth.transport._http_client:Making request: GET http://metadata.google.internal/computeMetadata/v1/project/project-id
DEBUG:urllib3.util.retry:Converted retries value: 3 -> Retry(total=3, connect=None, read=None,
redirect=None, status=None)
DEBUG:google.auth.transport.requests:Making request: GET http://metadata.google.internal/computeMetadata/v1/instance/service-accounts/default/?recursive=true
DEBUG:urllib3.connectionpool:Starting new HTTP connection (1): metadata.google.internal:80
DEBUG:urllib3.connectionpool:http://metadata.google.internal:80 "GET /computeMetadata/v1/instance/service-accounts/default/?recursive=true
HTTP/1.1" 200 144
DEBUG:google.auth.transport.requests:Making request: GET http://metadata.google.internal/computeMetadata/v1/instance/service-accounts/844138762903-compute@developer.gserviceaccount.com/token?scopes=https%3A%2F%2Fwww.googleapis.com%2Fauth%2Fbigquery%2Chttps%3A%2F%2Fwww.googleapis.com%2Fauth%2Fcloud-platform
DEBUG:urllib3.connectionpool:http://metadata.google.internal:80 "GET /computeMetadata/v1/instance/service-accounts/844138762903-compute@developer.gserviceaccount.com/token?scopes=https%3A%2F%2Fwww.googleapis.com%2Fauth%2Fbigquery%2Chttps%3A%2F%2Fwww.googleapis.com%2Fauth%2Fcloud-platform
HTTP/1.1" 200 241
DEBUG:urllib3.connectionpool:Starting new HTTPS connection (1): bigquery.googleapis.com:443
DEBUG:urllib3.connectionpool:https://bigquery.googleapis.com:443 "POST /bigquery/v2/projects/apache-beam-testing/jobs?prettyPrint=false
HTTP/1.1" 200 None
DEBUG:urllib3.connectionpool:https://bigquery.googleapis.com:443 "GET /bigquery/v2/projects/apache-beam-testing/queries/8c5ff02b-6bda-4fd2-93ce-08cb064bf83a?maxResults=0&location=US&prettyPrint=false
HTTP/1.1" 200 None
DEBUG:urllib3.connectionpool:https://bigquery.googleapis.com:443 "GET /bigquery/v2/projects/apache-beam-testing/datasets/_7357fab0f784d2a7327ddbe81cdd1f4ca7e429cd/tables/anon56d05d8f2eb23f0ba92cfd1e2b7825a123eefc4e/data?prettyPrint=false
HTTP/1.1" 200 None
INFO:apache_beam.io.gcp.tests.bigquery_matcher:Read from given query (SELECT fruit from `python_query_to_table_16100246778404.output_table`;),
total rows 2
INFO:apache_beam.io.gcp.tests.bigquery_matcher:Generate checksum: 158a8ea1c254fcf40d4ed3e7c0242c3ea0a29e72
INFO:apache_beam.runners.dataflow.dataflow_runner:2021-01-07T13:12:22.298Z: JOB_MESSAGE_BASIC:
Finished operation Create/Read+ExternalTransform(simple)/Map(<lambda at external_it_test.py:43>)+assert_that/WindowInto(WindowIntoFn)+assert_that/ToVoidKey+assert_that/Group/pair_with_1+assert_that/Group/GroupByKey/Reify+assert_that/Group/GroupByKey/Write
INFO:apache_beam.runners.dataflow.dataflow_runner:2021-01-07T13:12:25.374Z: JOB_MESSAGE_BASIC:
Finished operation assert_that/Create/Read+assert_that/Group/pair_with_0+assert_that/Group/GroupByKey/Reify+assert_that/Group/GroupByKey/Write
INFO:apache_beam.runners.dataflow.dataflow_runner:2021-01-07T13:12:25.445Z: JOB_MESSAGE_BASIC:
Executing operation assert_that/Group/GroupByKey/Close
INFO:apache_beam.runners.dataflow.dataflow_runner:2021-01-07T13:12:25.496Z: JOB_MESSAGE_BASIC:
Finished operation assert_that/Group/GroupByKey/Close
INFO:apache_beam.runners.dataflow.dataflow_runner:2021-01-07T13:12:25.561Z: JOB_MESSAGE_BASIC:
Executing operation assert_that/Group/GroupByKey/Read+assert_that/Group/GroupByKey/GroupByWindow+assert_that/Group/Map(_merge_tagged_vals_under_key)+assert_that/Unkey+assert_that/Match
INFO:apache_beam.runners.dataflow.dataflow_runner:2021-01-07T13:12:34.792Z: JOB_MESSAGE_BASIC:
Finished operation assert_that/Group/GroupByKey/Read+assert_that/Group/GroupByKey/GroupByWindow+assert_that/Group/Map(_merge_tagged_vals_under_key)+assert_that/Unkey+assert_that/Match
INFO:apache_beam.runners.dataflow.dataflow_runner:2021-01-07T13:12:34.918Z: JOB_MESSAGE_DEBUG:
Executing success step success19
INFO:apache_beam.runners.dataflow.dataflow_runner:2021-01-07T13:12:35.073Z: JOB_MESSAGE_DETAILED:
Cleaning up.
INFO:apache_beam.runners.dataflow.dataflow_runner:2021-01-07T13:12:35.128Z: JOB_MESSAGE_DEBUG:
Starting worker pool teardown.
INFO:apache_beam.runners.dataflow.dataflow_runner:2021-01-07T13:12:35.159Z: JOB_MESSAGE_BASIC:
Stopping worker pool...
INFO:apache_beam.runners.dataflow.dataflow_runner:2021-01-07T13:13:26.207Z: JOB_MESSAGE_DETAILED:
Autoscaling: Resized worker pool from 1 to 0.
INFO:apache_beam.runners.dataflow.dataflow_runner:2021-01-07T13:13:26.251Z: JOB_MESSAGE_BASIC:
Worker pool stopped.
INFO:apache_beam.runners.dataflow.dataflow_runner:2021-01-07T13:13:26.297Z: JOB_MESSAGE_DEBUG:
Tearing down pending resources...
INFO:apache_beam.runners.dataflow.dataflow_runner:Job 2021-01-07_05_06_19-6716387042362533236
is in state JOB_STATE_DONE
WARNING:apache_beam.runners.dataflow.dataflow_runner:Timing out on waiting for job 2021-01-07_04_59_16-6430817979314578080
after 902 seconds
INFO:apache_beam.io.gcp.tests.bigquery_matcher:Attempting to perform query SELECT number FROM
python_pubsub_bq_16100243449116.output_table to BQ
DEBUG:google.auth._default:Checking None for explicit credentials as part of auth process...
DEBUG:google.auth._default:Checking Cloud SDK credentials as part of auth process...
DEBUG:google.auth._default:Cloud SDK credentials not found on disk; not using them
DEBUG:google.auth._default:Checking for App Engine runtime as part of auth process...
DEBUG:google.auth._default:No App Engine library was found so cannot authentication via App
Engine Identity Credentials.
DEBUG:google.auth.transport._http_client:Making request: GET http://169.254.169.254
DEBUG:google.auth.transport._http_client:Making request: GET http://metadata.google.internal/computeMetadata/v1/project/project-id
DEBUG:urllib3.util.retry:Converted retries value: 3 -> Retry(total=3, connect=None, read=None,
redirect=None, status=None)
DEBUG:google.auth.transport.requests:Making request: GET http://metadata.google.internal/computeMetadata/v1/instance/service-accounts/default/?recursive=true
DEBUG:urllib3.connectionpool:Starting new HTTP connection (1): metadata.google.internal:80
DEBUG:urllib3.connectionpool:http://metadata.google.internal:80 "GET /computeMetadata/v1/instance/service-accounts/default/?recursive=true
HTTP/1.1" 200 144
DEBUG:google.auth.transport.requests:Making request: GET http://metadata.google.internal/computeMetadata/v1/instance/service-accounts/844138762903-compute@developer.gserviceaccount.com/token?scopes=https%3A%2F%2Fwww.googleapis.com%2Fauth%2Fbigquery%2Chttps%3A%2F%2Fwww.googleapis.com%2Fauth%2Fcloud-platform
DEBUG:urllib3.connectionpool:http://metadata.google.internal:80 "GET /computeMetadata/v1/instance/service-accounts/844138762903-compute@developer.gserviceaccount.com/token?scopes=https%3A%2F%2Fwww.googleapis.com%2Fauth%2Fbigquery%2Chttps%3A%2F%2Fwww.googleapis.com%2Fauth%2Fcloud-platform
HTTP/1.1" 200 241
DEBUG:urllib3.connectionpool:Starting new HTTPS connection (1): bigquery.googleapis.com:443
DEBUG:urllib3.connectionpool:https://bigquery.googleapis.com:443 "POST /bigquery/v2/projects/apache-beam-testing/jobs?prettyPrint=false
HTTP/1.1" 200 None
DEBUG:urllib3.connectionpool:https://bigquery.googleapis.com:443 "GET /bigquery/v2/projects/apache-beam-testing/queries/31ff2479-1425-4b56-85e1-03ff82a60585?maxResults=0&location=US&prettyPrint=false
HTTP/1.1" 200 None
DEBUG:urllib3.connectionpool:https://bigquery.googleapis.com:443 "GET /bigquery/v2/projects/apache-beam-testing/datasets/_7357fab0f784d2a7327ddbe81cdd1f4ca7e429cd/tables/anon6c39c668_9aca_4d71_ba9a_04612c639ee5/data?prettyPrint=false
HTTP/1.1" 200 None
INFO:apache_beam.io.gcp.tests.bigquery_matcher:Result of query is: [(2,), (0,), (1,), (3,)]
DEBUG:google.auth._default:Checking None for explicit credentials as part of auth process...
DEBUG:google.auth._default:Checking Cloud SDK credentials as part of auth process...
DEBUG:google.auth._default:Cloud SDK credentials not found on disk; not using them
DEBUG:google.auth._default:Checking for App Engine runtime as part of auth process...
DEBUG:google.auth._default:No App Engine library was found so cannot authentication via App
Engine Identity Credentials.
DEBUG:google.auth.transport._http_client:Making request: GET http://169.254.169.254
DEBUG:google.auth.transport._http_client:Making request: GET http://metadata.google.internal/computeMetadata/v1/project/project-id
DEBUG:urllib3.util.retry:Converted retries value: 3 -> Retry(total=3, connect=None, read=None,
redirect=None, status=None)
DEBUG:google.auth.transport.requests:Making request: GET http://metadata.google.internal/computeMetadata/v1/instance/service-accounts/default/?recursive=true
DEBUG:urllib3.connectionpool:Starting new HTTP connection (1): metadata.google.internal:80
DEBUG:urllib3.connectionpool:http://metadata.google.internal:80 "GET /computeMetadata/v1/instance/service-accounts/default/?recursive=true
HTTP/1.1" 200 144
DEBUG:google.auth.transport.requests:Making request: GET http://metadata.google.internal/computeMetadata/v1/instance/service-accounts/844138762903-compute@developer.gserviceaccount.com/token?scopes=https%3A%2F%2Fwww.googleapis.com%2Fauth%2Fbigquery%2Chttps%3A%2F%2Fwww.googleapis.com%2Fauth%2Fcloud-platform
DEBUG:urllib3.connectionpool:http://metadata.google.internal:80 "GET /computeMetadata/v1/instance/service-accounts/844138762903-compute@developer.gserviceaccount.com/token?scopes=https%3A%2F%2Fwww.googleapis.com%2Fauth%2Fbigquery%2Chttps%3A%2F%2Fwww.googleapis.com%2Fauth%2Fcloud-platform
HTTP/1.1" 200 241
DEBUG:urllib3.connectionpool:Starting new HTTPS connection (1): bigquery.googleapis.com:443
DEBUG:urllib3.connectionpool:https://bigquery.googleapis.com:443 "DELETE /bigquery/v2/projects/apache-beam-testing/datasets/python_pubsub_bq_16100243449116?deleteContents=true&prettyPrint=false
HTTP/1.1" 200 None
INFO:apache_beam.runners.dataflow.dataflow_runner:2021-01-07T13:17:14.369Z: JOB_MESSAGE_BASIC:
Finished operation Create/Read+metrics+map_to_common_key+GroupByKey/Reify+GroupByKey/Write
INFO:apache_beam.runners.dataflow.dataflow_runner:2021-01-07T13:17:14.425Z: JOB_MESSAGE_BASIC:
Executing operation GroupByKey/Close
INFO:apache_beam.runners.dataflow.dataflow_runner:2021-01-07T13:17:14.472Z: JOB_MESSAGE_BASIC:
Finished operation GroupByKey/Close
INFO:apache_beam.runners.dataflow.dataflow_runner:2021-01-07T13:17:14.546Z: JOB_MESSAGE_BASIC:
Executing operation GroupByKey/Read+GroupByKey/GroupByWindow+m_out
INFO:apache_beam.runners.dataflow.dataflow_runner:2021-01-07T13:17:23.769Z: JOB_MESSAGE_BASIC:
Finished operation GroupByKey/Read+GroupByKey/GroupByWindow+m_out
INFO:apache_beam.runners.dataflow.dataflow_runner:2021-01-07T13:17:23.834Z: JOB_MESSAGE_DEBUG:
Executing success step success11
INFO:apache_beam.runners.dataflow.dataflow_runner:2021-01-07T13:17:23.892Z: JOB_MESSAGE_DETAILED:
Cleaning up.
INFO:apache_beam.runners.dataflow.dataflow_runner:2021-01-07T13:17:23.944Z: JOB_MESSAGE_DEBUG:
Starting worker pool teardown.
INFO:apache_beam.runners.dataflow.dataflow_runner:2021-01-07T13:17:23.971Z: JOB_MESSAGE_BASIC:
Stopping worker pool...
INFO:apache_beam.runners.dataflow.dataflow_runner:2021-01-07T13:18:10.454Z: JOB_MESSAGE_DETAILED:
Autoscaling: Resized worker pool from 1 to 0.
INFO:apache_beam.runners.dataflow.dataflow_runner:2021-01-07T13:18:10.511Z: JOB_MESSAGE_BASIC:
Worker pool stopped.
INFO:apache_beam.runners.dataflow.dataflow_runner:2021-01-07T13:18:10.547Z: JOB_MESSAGE_DEBUG:
Tearing down pending resources...
INFO:apache_beam.runners.dataflow.dataflow_runner:Job 2021-01-07_05_10_54-2046044609921854810
is in state JOB_STATE_DONE
test_bigquery_tornadoes_it (apache_beam.examples.cookbook.bigquery_tornadoes_it_test.BigqueryTornadoesIT)
... ok
test_autocomplete_it (apache_beam.examples.complete.autocomplete_test.AutocompleteTest) ...
ok
test_streaming_wordcount_debugging_it (apache_beam.examples.streaming_wordcount_debugging_it_test.StreamingWordcountDebuggingIT)
... SKIP: Skipped due to [BEAM-3377]: assert_that not working for streaming
test_datastore_wordcount_it (apache_beam.examples.cookbook.datastore_wordcount_it_test.DatastoreWordCountIT)
... ok
test_leader_board_it (apache_beam.examples.complete.game.leader_board_it_test.LeaderBoardIT)
... ok
test_run_example_with_setup_file (apache_beam.examples.complete.juliaset.juliaset.juliaset_test_it.JuliaSetTestIT)
... ok
test_game_stats_it (apache_beam.examples.complete.game.game_stats_it_test.GameStatsIT) ...
ok
test_streaming_wordcount_it (apache_beam.examples.streaming_wordcount_it_test.StreamingWordCountIT)
... ok
test_wordcount_fnapi_it (apache_beam.examples.wordcount_it_test.WordCountIT) ... ok
test_user_score_it (apache_beam.examples.complete.game.user_score_it_test.UserScoreIT) ...
ok
test_hourly_team_score_it (apache_beam.examples.complete.game.hourly_team_score_it_test.HourlyTeamScoreIT)
... ok
test_wordcount_it (apache_beam.examples.wordcount_it_test.WordCountIT) ... ok
test_avro_it (apache_beam.examples.fastavro_it_test.FastavroIT) ... ok
test_read_queries (apache_beam.io.gcp.bigquery_read_it_test.ReadAllBQTests) ... ok
test_read_via_sql (apache_beam.io.gcp.experimental.spannerio_read_it_test.SpannerReadIntegrationTest)
... ok
test_read_via_table (apache_beam.io.gcp.experimental.spannerio_read_it_test.SpannerReadIntegrationTest)
... ok
test_bigquery_read_1M_python (apache_beam.io.gcp.bigquery_io_read_it_test.BigqueryIOReadIT)
... ok
test_bigquery_read_custom_1M_python (apache_beam.io.gcp.bigquery_io_read_it_test.BigqueryIOReadIT)
... ok
test_bqfl_streaming (apache_beam.io.gcp.bigquery_file_loads_test.BigQueryFileLoadsIT) ...
SKIP: TestStream is not supported on TestDataflowRunner
test_multiple_destinations_transform (apache_beam.io.gcp.bigquery_file_loads_test.BigQueryFileLoadsIT)
... ok
test_one_job_fails_all_jobs_fail (apache_beam.io.gcp.bigquery_file_loads_test.BigQueryFileLoadsIT)
... ok
test_avro_file_load (apache_beam.io.gcp.bigquery_test.BigQueryFileLoadsIntegrationTests) ...
ok
test_spanner_error (apache_beam.io.gcp.experimental.spannerio_write_it_test.SpannerWriteIntegrationTest)
... ok
test_spanner_update (apache_beam.io.gcp.experimental.spannerio_write_it_test.SpannerWriteIntegrationTest)
... ok
test_write_batches (apache_beam.io.gcp.experimental.spannerio_write_it_test.SpannerWriteIntegrationTest)
... ok
test_multiple_destinations_transform (apache_beam.io.gcp.bigquery_test.BigQueryStreamingInsertTransformIntegrationTests)
... ok
test_iobase_source (apache_beam.io.gcp.bigquery_read_it_test.ReadNewTypesTests) ... ok
test_native_source (apache_beam.io.gcp.bigquery_read_it_test.ReadNewTypesTests) ... ok
test_value_provider_transform (apache_beam.io.gcp.bigquery_test.BigQueryStreamingInsertTransformIntegrationTests)
... ok
test_copy (apache_beam.io.gcp.gcsio_integration_test.GcsIOIntegrationTest) ... ok
test_copy_batch (apache_beam.io.gcp.gcsio_integration_test.GcsIOIntegrationTest) ... ok
test_copy_batch_kms (apache_beam.io.gcp.gcsio_integration_test.GcsIOIntegrationTest) ... ok
test_copy_batch_rewrite_token (apache_beam.io.gcp.gcsio_integration_test.GcsIOIntegrationTest)
... ok
test_copy_kms (apache_beam.io.gcp.gcsio_integration_test.GcsIOIntegrationTest) ... ok
test_copy_rewrite_token (apache_beam.io.gcp.gcsio_integration_test.GcsIOIntegrationTest) ...
ok
test_iobase_source (apache_beam.io.gcp.bigquery_read_it_test.ReadTests) ... ok
test_native_source (apache_beam.io.gcp.bigquery_read_it_test.ReadTests) ... ok
test_datastore_write_limit (apache_beam.io.gcp.datastore.v1new.datastore_write_it_test.DatastoreWriteIT)
... ok
test_transform_on_gcs (apache_beam.io.fileio_test.MatchIntegrationTest) ... ok
test_parquetio_it (apache_beam.io.parquetio_it_test.TestParquetIT) ... ok
test_dicom_search_instances (apache_beam.io.gcp.dicomio_integration_test.DICOMIoIntegrationTest)
... ok
test_dicom_store_instance_from_gcs (apache_beam.io.gcp.dicomio_integration_test.DICOMIoIntegrationTest)
... ok
test_streaming_data_only (apache_beam.io.gcp.pubsub_integration_test.PubSubIntegrationTest)
... ok
test_streaming_with_attributes (apache_beam.io.gcp.pubsub_integration_test.PubSubIntegrationTest)
... ok
test_analyzing_syntax (apache_beam.ml.gcp.naturallanguageml_test_it.NaturalLanguageMlTestIT)
... ok
test_label_detection_with_video_context (apache_beam.ml.gcp.videointelligenceml_test_it.VideoIntelligenceMlTestIT)
... ok
test_big_query_write (apache_beam.io.gcp.bigquery_write_it_test.BigQueryWriteIntegrationTests)
... ok
test_big_query_write_new_types (apache_beam.io.gcp.bigquery_write_it_test.BigQueryWriteIntegrationTests)
... ok
test_big_query_write_schema_autodetect (apache_beam.io.gcp.bigquery_write_it_test.BigQueryWriteIntegrationTests)
... SKIP: DataflowRunner does not support schema autodetection
test_big_query_write_without_schema (apache_beam.io.gcp.bigquery_write_it_test.BigQueryWriteIntegrationTests)
... ok
test_basic_execution (apache_beam.testing.test_stream_it_test.TestStreamIntegrationTests)
... SKIP: The "TestDataflowRunner", does not support the TestStream transform. Supported runners:
['DirectRunner', 'SwitchingDirectRunner']
Tests that the TestStream supports emitting to multiple PCollections. ... SKIP: The "TestDataflowRunner",
does not support the TestStream transform. Supported runners: ['DirectRunner', 'SwitchingDirectRunner']
Tests that the TestStream can independently control output watermarks. ... SKIP: The "TestDataflowRunner",
does not support the TestStream transform. Supported runners: ['DirectRunner', 'SwitchingDirectRunner']
test_text_detection_with_language_hint (apache_beam.ml.gcp.visionml_test_it.VisionMlTestIT)
... ok
test_deidentification (apache_beam.ml.gcp.cloud_dlp_it_test.CloudDLPIT) ... ok
test_inspection (apache_beam.ml.gcp.cloud_dlp_it_test.CloudDLPIT) ... ok
Runs streaming Dataflow job and verifies that user metrics are reported ... ok
test_big_query_legacy_sql (apache_beam.io.gcp.big_query_query_to_table_it_test.BigQueryQueryToTableIT)
... ok
test_big_query_new_types (apache_beam.io.gcp.big_query_query_to_table_it_test.BigQueryQueryToTableIT)
... ok
test_big_query_new_types_avro (apache_beam.io.gcp.big_query_query_to_table_it_test.BigQueryQueryToTableIT)
... ok
test_big_query_new_types_native (apache_beam.io.gcp.big_query_query_to_table_it_test.BigQueryQueryToTableIT)
... ok
test_big_query_standard_sql (apache_beam.io.gcp.big_query_query_to_table_it_test.BigQueryQueryToTableIT)
... ok
test_big_query_standard_sql_kms_key_native (apache_beam.io.gcp.big_query_query_to_table_it_test.BigQueryQueryToTableIT)
... ok
test_job_python_from_python_it (apache_beam.transforms.external_it_test.ExternalTransformIT)
... ok
test_file_loads (apache_beam.io.gcp.bigquery_test.PubSubBigQueryIT) ... ok
test_streaming_inserts (apache_beam.io.gcp.bigquery_test.PubSubBigQueryIT) ... ok
test_metrics_fnapi_it (apache_beam.runners.dataflow.dataflow_exercise_metrics_pipeline_test.ExerciseMetricsPipelineTest)
... ok
test_metrics_it (apache_beam.runners.dataflow.dataflow_exercise_metrics_pipeline_test.ExerciseMetricsPipelineTest)
... ok

----------------------------------------------------------------------
XML: nosetests-postCommitIT-df-py38.xml
----------------------------------------------------------------------
XML: <https://ci-beam.apache.org/job/beam_PostCommit_Python38/ws/src/sdks/python/nosetests.xml>
----------------------------------------------------------------------
Ran 68 tests in 4423.238s

OK (SKIP=6)

FAILURE: Build failed with an exception.

* Where:
Script '<https://ci-beam.apache.org/job/beam_PostCommit_Python38/ws/src/sdks/python/test-suites/portable/common.gradle'>
line: 190

* What went wrong:
Execution failed for task ':sdks:python:test-suites:portable:py38:postCommitPy38IT'.
> Process 'command 'sh'' finished with non-zero exit value 1

* Try:
Run with --stacktrace option to get the stack trace. Run with --info or --debug option to
get more log output. Run with --scan to get full insights.

* Get more help at https://help.gradle.org

Deprecated Gradle features were used in this build, making it incompatible with Gradle 7.0.
Use '--warning-mode all' to show the individual deprecation warnings.
See https://docs.gradle.org/6.7.1/userguide/command_line_interface.html#sec:command_line_warnings

BUILD FAILED in 1h 17m 46s
215 actionable tasks: 153 executed, 58 from cache, 4 up-to-date
Gradle was unable to watch the file system for changes. The inotify watches limit is too low.

Publishing build scan...
https://gradle.com/s/4zz5xiwrbvsbw

Build step 'Invoke Gradle script' changed build result to FAILURE
Build step 'Invoke Gradle script' marked build as failure

---------------------------------------------------------------------
To unsubscribe, e-mail: builds-unsubscribe@beam.apache.org
For additional commands, e-mail: builds-help@beam.apache.org


Mime
View raw message