beam-builds mailing list archives

Site index · List index
Message view « Date » · « Thread »
Top « Date » · « Thread »
From Apache Jenkins Server <jenk...@builds.apache.org>
Subject Build failed in Jenkins: beam_PostCommit_Go_VR_Flink #4241
Date Sat, 09 Jan 2021 12:40:55 GMT
See <https://ci-beam.apache.org/job/beam_PostCommit_Go_VR_Flink/4241/display/redirect?page=changes>

Changes:

[Ismaël Mejía] [BEAM-11571] Support Conversion to GenericRecords in Convert.to

[Ismaël Mejía] [BEAM-11571] Don't transform if input and output types are equal on


------------------------------------------
[...truncated 275.65 KB...]
      >
      component_coder_ids: "c13"
    >
  >
  coders: <
    key: "c15"
    value: <
      spec: <
        urn: "beam:coder:iterable:v1"
      >
      component_coder_ids: "c14"
    >
  >
  coders: <
    key: "c16"
    value: <
      spec: <
        urn: "beam:coder:kv:v1"
      >
      component_coder_ids: "c7"
      component_coder_ids: "c15"
    >
  >
  coders: <
    key: "c17"
    value: <
      spec: <
        urn: "beam:coder:kv:v1"
      >
      component_coder_ids: "c3"
      component_coder_ids: "c3"
    >
  >
  coders: <
    key: "c18"
    value: <
      spec: <
        urn: "beam:coder:iterable:v1"
      >
      component_coder_ids: "c3"
    >
  >
  coders: <
    key: "c19"
    value: <
      spec: <
        urn: "beam:coder:kv:v1"
      >
      component_coder_ids: "c3"
      component_coder_ids: "c18"
    >
  >
  coders: <
    key: "c2"
    value: <
      spec: <
        urn: "beam:go:coder:custom:v1"
        payload: "Cgd2YXJpbnR6EgIIAhqFAQpxZ2l0aHViLmNvbS9hcGFjaGUvYmVhbS9zZGtzL2dvL3Rlc3QvdmVuZG9yL2dpdGh1Yi5jb20vYXBhY2hlL2JlYW0vc2Rrcy9nby9wa2cvYmVhbS9jb3JlL3J1bnRpbWUvY29kZXJ4LmVuY1ZhckludFoSEAgWIgQIGUAPKgYIFBICCAgikQEKcWdpdGh1Yi5jb20vYXBhY2hlL2JlYW0vc2Rrcy9nby90ZXN0L3ZlbmRvci9naXRodWIuY29tL2FwYWNoZS9iZWFtL3Nka3MvZ28vcGtnL2JlYW0vY29yZS9ydW50aW1lL2NvZGVyeC5kZWNWYXJJbnRaEhwIFiIECBlAAyIGCBQSAggIKgQIGUAPKgQIGUAB"
      >
    >
  >
  coders: <
    key: "c3"
    value: <
      spec: <
        urn: "beam:coder:length_prefix:v1"
      >
      component_coder_ids: "c2"
    >
  >
  coders: <
    key: "c4"
    value: <
      spec: <
        urn: "beam:coder:kv:v1"
      >
      component_coder_ids: "c3"
      component_coder_ids: "c0"
    >
  >
  coders: <
    key: "c5"
    value: <
      spec: <
        urn: "beam:coder:iterable:v1"
      >
      component_coder_ids: "c0"
    >
  >
  coders: <
    key: "c6"
    value: <
      spec: <
        urn: "beam:coder:kv:v1"
      >
      component_coder_ids: "c3"
      component_coder_ids: "c5"
    >
  >
  coders: <
    key: "c7"
    value: <
      spec: <
        urn: "beam:coder:string_utf8:v1"
      >
    >
  >
  coders: <
    key: "c8"
    value: <
      spec: <
        urn: "beam:coder:kv:v1"
      >
      component_coder_ids: "c7"
      component_coder_ids: "c3"
    >
  >
  coders: <
    key: "c9"
    value: <
      spec: <
        urn: "beam:coder:kv:v1"
      >
      component_coder_ids: "c7"
      component_coder_ids: "c7"
    >
  >
  environments: <
    key: "go"
    value: <
      urn: "beam:env:docker:v1"
      payload: "\nAus.gcr.io/apache-beam-testing/jenkins/beam_go_sdk:20210109-121745"
      capabilities: "beam:protocol:progress_reporting:v0"
      capabilities: "beam:protocol:multi_core_bundle_processing:v1"
      capabilities: "beam:version:sdk_base:go"
      capabilities: "beam:coder:bytes:v1"
      capabilities: "beam:coder:bool:v1"
      capabilities: "beam:coder:varint:v1"
      capabilities: "beam:coder:double:v1"
      capabilities: "beam:coder:string_utf8:v1"
      capabilities: "beam:coder:length_prefix:v1"
      capabilities: "beam:coder:kv:v1"
      capabilities: "beam:coder:iterable:v1"
      capabilities: "beam:coder:state_backed_iterable:v1"
      capabilities: "beam:coder:windowed_value:v1"
      capabilities: "beam:coder:global_window:v1"
      capabilities: "beam:coder:interval_window:v1"
      dependencies: <
        type_urn: "beam:artifact:type:go_worker_binary:v1"
        role_urn: "beam:artifact:role:staging_to:v1"
        role_payload: "\n\006worker"
      >
    >
  >
>
root_transform_ids: "e5"
root_transform_ids: "e1"
root_transform_ids: "e3"
root_transform_ids: "s1"
root_transform_ids: "e11_reshuffle"
root_transform_ids: "e12"
root_transform_ids: "s5"
root_transform_ids: "s4"
root_transform_ids: "s3"
root_transform_ids: "s2"
2021/01/09 12:40:50 Test reshuffle:reshufflekv failed: 	connecting to job service
failed to dial server at localhost:58441
	caused by:
context deadline exceeded
2021/01/09 12:40:50 Result: 11 tests failed

if [[ ! -z "$JOB_PORT" ]]; then
  # Shut down the job server
  kill %1 || echo "Failed to shut down job server"
fi

if [[ "$PUSH_CONTAINER_TO_GCR" = 'yes' ]]; then
  # Delete the container locally and remotely
  docker rmi $CONTAINER:$TAG || echo "Failed to remove container"
  gcloud --quiet container images delete $CONTAINER:$TAG || echo "Failed to delete container"

  # Clean up tempdir
  rm -rf $TMPDIR
fi
Untagged: us.gcr.io/apache-beam-testing/jenkins/beam_go_sdk:20210109-121745
Untagged: us.gcr.io/apache-beam-testing/jenkins/beam_go_sdk@sha256:e3edb9e43ce7eafec19a41f663d06e79f880439c5c82b421542318130ef5f92f
Deleted: sha256:1dc0608ce2164bedd7515c4a2751eec4e0eb15c7e0fbd9eb06d529734a88d949
Deleted: sha256:026e8200a87606112a5e363195d03b62ee40184689acddc24a17e33e8055c544
Deleted: sha256:937d626ac261bb028805a8d2398a361ed0721ced7866ea094caab934b6cc8046
Deleted: sha256:d50e1f534600841ad41499b38bc3acc1ce1f4422063a5a7817a3399160f4abb1
Deleted: sha256:0d30408b5e4fe2b84d520ef0cc0045a08239662645d43dd0edcfdbf71fd9e915
Deleted: sha256:8952291942b0068264ff16bf1a256f84957df8262d72c756dfdcdd0e4f1267d9
Deleted: sha256:61595010c6192c8a6a475e74e12464d75dada4ab6dc27349cb0be6daa305750b
Deleted: sha256:05b0216b2de72a972107dc4ef2ea8d3c6e63b0b627a214196730333ef1636ebb
Deleted: sha256:a24a70226761083458c264dfaa88b7103a809b91d27d7e19e8aa1af752e0e0fe
Deleted: sha256:a0890155af637f60347c1dd7b50019043fab5851429589e3d62648c9ef5dd467
Deleted: sha256:f32742f610136536a7c49173986fde5dffd8b54c51bcf3d2ea4150128c59a72c
Deleted: sha256:b9b81155a9cdee4bb0df4c832e24de4c95c6fbc52a432c860e276e9383c78820
Deleted: sha256:60a2859af14552304966a5ac568be9f131763c8ef450a10ad19a666b52404cb5
Deleted: sha256:7e684534a589cce2fc2a5ac75ce85d9516d58f857bbdc42d4ad025ea1f98ff49
Deleted: sha256:a725f61c7c966b85384a1e2673d5d447ac2da556f26578d5173694eb210e9809
Deleted: sha256:54d748995858f5539c763696698caa359e350bca22c427258e9702245ddab38d
Deleted: sha256:5b6f0d2c750afd8cd05ed59afafa5a40c675ecc7736c702fdee04a6d9acb0bf1
Digests:
- us.gcr.io/apache-beam-testing/jenkins/beam_go_sdk@sha256:e3edb9e43ce7eafec19a41f663d06e79f880439c5c82b421542318130ef5f92f
  Associated tags:
 - 20210109-121745
Tags:
- us.gcr.io/apache-beam-testing/jenkins/beam_go_sdk:20210109-121745
Deleted [us.gcr.io/apache-beam-testing/jenkins/beam_go_sdk:20210109-121745].
Deleted [us.gcr.io/apache-beam-testing/jenkins/beam_go_sdk@sha256:e3edb9e43ce7eafec19a41f663d06e79f880439c5c82b421542318130ef5f92f].

>>> FAILURE
if [[ "$TEST_EXIT_CODE" -eq 0 ]]; then
  echo ">>> SUCCESS"
else
  echo ">>> FAILURE"
fi
exit $TEST_EXIT_CODE

> Task :sdks:go:test:flinkValidatesRunner FAILED

FAILURE: Build failed with an exception.

* Where:
Build file '<https://ci-beam.apache.org/job/beam_PostCommit_Go_VR_Flink/ws/src/sdks/go/test/build.gradle'>
line: 150

* What went wrong:
Execution failed for task ':sdks:go:test:flinkValidatesRunner'.
> Process 'command 'sh'' finished with non-zero exit value 1

* Try:
Run with --stacktrace option to get the stack trace. Run with --info or --debug option to
get more log output. Run with --scan to get full insights.

* Get more help at https://help.gradle.org

Deprecated Gradle features were used in this build, making it incompatible with Gradle 7.0.
Use '--warning-mode all' to show the individual deprecation warnings.
See https://docs.gradle.org/6.7.1/userguide/command_line_interface.html#sec:command_line_warnings

BUILD FAILED in 40m 31s
130 actionable tasks: 116 executed, 14 from cache
Gradle was unable to watch the file system for changes. The inotify watches limit is too low.

Publishing build scan...
https://gradle.com/s/h4bzpvdq4zy46

Build step 'Invoke Gradle script' changed build result to FAILURE
Build step 'Invoke Gradle script' marked build as failure

---------------------------------------------------------------------
To unsubscribe, e-mail: builds-unsubscribe@beam.apache.org
For additional commands, e-mail: builds-help@beam.apache.org


Mime
View raw message