beam-builds mailing list archives

Site index · List index
Message view « Date » · « Thread »
Top « Date » · « Thread »
From Apache Jenkins Server <jenk...@builds.apache.org>
Subject Build failed in Jenkins: beam_LoadTests_Python_ParDo_Flink_Streaming #254
Date Thu, 14 Jan 2021 12:38:05 GMT
See <https://ci-beam.apache.org/job/beam_LoadTests_Python_ParDo_Flink_Streaming/254/display/redirect?page=changes>

Changes:

[Ismaël Mejía] [BEAM-8202] Support ParquetTable Writer

[Ismaël Mejía] [BEAM-8202] Make Avro SchemaIOProvider (and tests) consistent with

[chamikaramj] Do not set empty specs in external transforms

[samuelw] [BEAM-10556] Remove rawtypes suppression from WindmillStateCache

[noreply] [BEAM-11614] Clarify Beam model for zero subtransform case (#13744)

[noreply] [BEAM-11531] Remove transform implementation (#13705)

[noreply] [BEAM-11531] Skip some DataFrame tests that are broken in pandas 1.2.0

[noreply] [BEAM-11357] Add annotations to PTransforms and enable them in Go SDK

[noreply] [BEAM-11569] Enabling wheels to be built using Beam-based submodules

[noreply] [BEAM-11624] Add hash functions in beam sql  (#13733)

[noreply] [BEAM-11533] PubSub support Beam DATETIME (SQL TIMESTAMP) type (#13731)


------------------------------------------
[...truncated 38.28 KB...]
  Using cached boto3-1.16.54-py2.py3-none-any.whl (130 kB)
Collecting botocore<1.20.0,>=1.19.54
  Using cached botocore-1.19.54-py2.py3-none-any.whl (7.2 MB)
Collecting cachetools<5,>=3.1.0
  Using cached cachetools-4.2.0-py3-none-any.whl (12 kB)
Collecting crcmod<2.0,>=1.7
  Using cached crcmod-1.7-cp37-cp37m-linux_x86_64.whl
Collecting cryptography>=2.1.4
  Using cached cryptography-3.3.1-cp36-abi3-manylinux2010_x86_64.whl (2.6 MB)
Collecting cffi>=1.12
  Using cached cffi-1.14.4-cp37-cp37m-manylinux1_x86_64.whl (402 kB)
Collecting dill<0.3.2,>=0.3.1.1
  Using cached dill-0.3.1.1-py3-none-any.whl
Collecting fastavro<2,>=0.21.4
  Using cached fastavro-1.2.3-cp37-cp37m-manylinux2014_x86_64.whl (2.0 MB)
Collecting freezegun>=0.3.12
  Using cached freezegun-1.0.0-py2.py3-none-any.whl (14 kB)
Collecting google-apitools<0.5.32,>=0.5.31
  Using cached google_apitools-0.5.31-py3-none-any.whl
Collecting fasteners>=0.14
  Using cached fasteners-0.16-py2.py3-none-any.whl (28 kB)
Collecting google-auth<2,>=1.18.0
  Using cached google_auth-1.24.0-py2.py3-none-any.whl (114 kB)
Requirement already satisfied: setuptools>=40.3.0 in <https://ci-beam.apache.org/job/beam_LoadTests_Python_ParDo_Flink_Streaming/ws/src/build/gradleenv/1329484227/lib/python3.7/site-packages>
(from google-auth<2,>=1.18.0->apache-beam==2.28.0.dev0) (51.1.2)
Collecting google-cloud-bigquery<2,>=1.6.0
  Using cached google_cloud_bigquery-1.28.0-py2.py3-none-any.whl (187 kB)
Collecting google-api-core<2.0dev,>=1.21.0
  Using cached google_api_core-1.24.1-py2.py3-none-any.whl (92 kB)
Collecting google-cloud-bigtable<2,>=0.31.1
  Using cached google_cloud_bigtable-1.6.1-py2.py3-none-any.whl (267 kB)
Collecting google-cloud-build<3,>=2.0.0
  Using cached google_cloud_build-2.0.0-py2.py3-none-any.whl (67 kB)
Collecting google-cloud-core<2,>=0.28.1
  Using cached google_cloud_core-1.5.0-py2.py3-none-any.whl (27 kB)
Collecting google-cloud-datastore<2,>=1.7.1
  Using cached google_cloud_datastore-1.15.3-py2.py3-none-any.whl (134 kB)
Collecting google-cloud-dlp<2,>=0.12.0
  Using cached google_cloud_dlp-1.0.0-py2.py3-none-any.whl (169 kB)
Collecting google-cloud-language<2,>=1.3.0
  Using cached google_cloud_language-1.3.0-py2.py3-none-any.whl (83 kB)
Collecting google-cloud-pubsub<2,>=0.39.0
  Using cached google_cloud_pubsub-1.7.0-py2.py3-none-any.whl (144 kB)
Collecting google-cloud-spanner<2,>=1.13.0
  Using cached google_cloud_spanner-1.19.1-py2.py3-none-any.whl (255 kB)
Collecting google-cloud-videointelligence<2,>=1.8.0
  Using cached google_cloud_videointelligence-1.16.1-py2.py3-none-any.whl (183 kB)
Collecting google-cloud-vision<2,>=0.38.0
  Using cached google_cloud_vision-1.0.0-py2.py3-none-any.whl (435 kB)
Collecting google-resumable-media<2.0dev,>=0.6.0
  Using cached google_resumable_media-1.2.0-py2.py3-none-any.whl (75 kB)
Collecting google-crc32c<2.0dev,>=1.0
  Using cached google_crc32c-1.1.0-cp37-cp37m-manylinux2010_x86_64.whl (39 kB)
Collecting googleapis-common-protos<2.0dev,>=1.6.0
  Using cached googleapis_common_protos-1.52.0-py2.py3-none-any.whl (100 kB)
Collecting grpc-google-iam-v1<0.13dev,>=0.12.3
  Using cached grpc_google_iam_v1-0.12.3-py3-none-any.whl
Collecting grpcio-gcp<1,>=0.2.2
  Using cached grpcio_gcp-0.2.2-py2.py3-none-any.whl (9.4 kB)
Collecting hdfs<3.0.0,>=2.1.0
  Using cached hdfs-2.5.8-py3-none-any.whl
Collecting httplib2<0.18.0,>=0.8
  Using cached httplib2-0.17.4-py3-none-any.whl (95 kB)
Collecting jmespath<1.0.0,>=0.7.1
  Using cached jmespath-0.10.0-py2.py3-none-any.whl (24 kB)
Collecting libcst>=0.2.5
  Using cached libcst-0.3.16-py3-none-any.whl (505 kB)
Collecting mock<3.0.0,>=1.0.1
  Using cached mock-2.0.0-py2.py3-none-any.whl (56 kB)
Collecting msrest>=0.6.10
  Using cached msrest-0.6.19-py2.py3-none-any.whl (84 kB)
Collecting certifi>=2017.4.17
  Using cached certifi-2020.12.5-py2.py3-none-any.whl (147 kB)
Collecting isodate>=0.6.0
  Using cached isodate-0.6.0-py2.py3-none-any.whl (45 kB)
Collecting nose>=1.3.7
  Using cached nose-1.3.7-py3-none-any.whl (154 kB)
Collecting nose_xunitmp>=0.4.1
  Using cached nose_xunitmp-0.4.1-py3-none-any.whl
Collecting numpy<2,>=1.14.3
  Using cached numpy-1.19.5-cp37-cp37m-manylinux2010_x86_64.whl (14.8 MB)
Collecting oauth2client<5,>=2.0.1
  Using cached oauth2client-4.1.3-py2.py3-none-any.whl (98 kB)
Collecting pandas<1.2.0,>=1.0
  Using cached pandas-1.1.5-cp37-cp37m-manylinux1_x86_64.whl (9.5 MB)
Collecting parameterized<0.8.0,>=0.7.1
  Using cached parameterized-0.7.5-py2.py3-none-any.whl (17 kB)
Collecting pbr>=0.11
  Using cached pbr-5.5.1-py2.py3-none-any.whl (106 kB)
Collecting proto-plus>=0.4.0
  Using cached proto_plus-1.13.0-py3-none-any.whl
Collecting psycopg2-binary<3.0.0,>=2.8.5
  Using cached psycopg2_binary-2.8.6-cp37-cp37m-manylinux1_x86_64.whl (3.0 MB)
Collecting pyarrow<3.0.0,>=0.15.1
  Using cached pyarrow-2.0.0-cp37-cp37m-manylinux2014_x86_64.whl (17.7 MB)
Collecting pyasn1>=0.1.7
  Using cached pyasn1-0.4.8-py2.py3-none-any.whl (77 kB)
Collecting pyasn1-modules>=0.2.1
  Using cached pyasn1_modules-0.2.8-py2.py3-none-any.whl (155 kB)
Collecting pydot<2,>=1.2.0
  Using cached pydot-1.4.1-py2.py3-none-any.whl (19 kB)
Collecting pyhamcrest!=1.10.0,<2.0.0,>=1.9
  Using cached PyHamcrest-1.10.1-py3-none-any.whl (48 kB)
Collecting pymongo<4.0.0,>=3.8.0
  Using cached pymongo-3.11.2-cp37-cp37m-manylinux2014_x86_64.whl (512 kB)
Collecting pyparsing>=2.1.4
  Using cached pyparsing-2.4.7-py2.py3-none-any.whl (67 kB)
Collecting pytest<5.0,>=4.4.0
  Using cached pytest-4.6.11-py2.py3-none-any.whl (231 kB)
Requirement already satisfied: py>=1.5.0 in <https://ci-beam.apache.org/job/beam_LoadTests_Python_ParDo_Flink_Streaming/ws/src/build/gradleenv/1329484227/lib/python3.7/site-packages>
(from pytest<5.0,>=4.4.0->apache-beam==2.28.0.dev0) (1.10.0)
Requirement already satisfied: importlib-metadata>=0.12 in <https://ci-beam.apache.org/job/beam_LoadTests_Python_ParDo_Flink_Streaming/ws/src/build/gradleenv/1329484227/lib/python3.7/site-packages>
(from pytest<5.0,>=4.4.0->apache-beam==2.28.0.dev0) (3.4.0)
Requirement already satisfied: pluggy<1.0,>=0.12 in <https://ci-beam.apache.org/job/beam_LoadTests_Python_ParDo_Flink_Streaming/ws/src/build/gradleenv/1329484227/lib/python3.7/site-packages>
(from pytest<5.0,>=4.4.0->apache-beam==2.28.0.dev0) (0.13.1)
Collecting atomicwrites>=1.0
  Using cached atomicwrites-1.4.0-py2.py3-none-any.whl (6.8 kB)
Collecting attrs>=17.4.0
  Using cached attrs-20.3.0-py2.py3-none-any.whl (49 kB)
Requirement already satisfied: zipp>=0.5 in <https://ci-beam.apache.org/job/beam_LoadTests_Python_ParDo_Flink_Streaming/ws/src/build/gradleenv/1329484227/lib/python3.7/site-packages>
(from importlib-metadata>=0.12->pytest<5.0,>=4.4.0->apache-beam==2.28.0.dev0)
(3.4.0)
Collecting more-itertools>=4.0.0
  Using cached more_itertools-8.6.0-py3-none-any.whl (45 kB)
Collecting pytest-timeout<2,>=1.3.3
  Using cached pytest_timeout-1.4.2-py2.py3-none-any.whl (10 kB)
Collecting pytest-xdist<2,>=1.29.0
  Using cached pytest_xdist-1.34.0-py2.py3-none-any.whl (36 kB)
Collecting execnet>=1.1
  Using cached execnet-1.7.1-py2.py3-none-any.whl (39 kB)
Collecting apipkg>=1.4
  Using cached apipkg-1.5-py2.py3-none-any.whl (4.9 kB)
Collecting python-dateutil<3,>=2.8.0
  Using cached python_dateutil-2.8.1-py2.py3-none-any.whl (227 kB)
Collecting pytz>=2018.3
  Using cached pytz-2020.5-py2.py3-none-any.whl (510 kB)
Collecting pyyaml<6.0.0,>=3.12
  Using cached PyYAML-5.3.1-cp37-cp37m-linux_x86_64.whl
Collecting requests<3.0.0,>=2.24.0
  Using cached requests-2.25.1-py2.py3-none-any.whl (61 kB)
Collecting chardet<5,>=3.0.2
  Using cached chardet-4.0.0-py2.py3-none-any.whl (178 kB)
Collecting idna<3,>=2.5
  Using cached idna-2.10-py2.py3-none-any.whl (58 kB)
Collecting requests_mock<2.0,>=1.7
  Using cached requests_mock-1.8.0-py2.py3-none-any.whl (23 kB)
Collecting requests-oauthlib>=0.5.0
  Using cached requests_oauthlib-1.3.0-py2.py3-none-any.whl (23 kB)
Collecting oauthlib>=3.0.0
  Using cached oauthlib-3.1.0-py2.py3-none-any.whl (147 kB)
Collecting rsa<5,>=3.1.4
  Using cached rsa-4.7-py3-none-any.whl (34 kB)
Collecting s3transfer<0.4.0,>=0.3.0
  Using cached s3transfer-0.3.4-py2.py3-none-any.whl (69 kB)
Collecting sqlalchemy<2.0,>=1.3
  Using cached SQLAlchemy-1.3.22-cp37-cp37m-manylinux2010_x86_64.whl (1.3 MB)
Collecting tenacity<6.0,>=5.0.2
  Using cached tenacity-5.1.5-py2.py3-none-any.whl (34 kB)
Collecting testcontainers<4.0.0,>=3.0.3
  Using cached testcontainers-3.2.0-py2.py3-none-any.whl
Collecting typing-inspect>=0.4.0
  Using cached typing_inspect-0.6.0-py3-none-any.whl (8.1 kB)
Collecting mypy-extensions>=0.3.0
  Using cached mypy_extensions-0.4.3-py2.py3-none-any.whl (4.5 kB)
Collecting urllib3<1.27,>=1.25.4
  Using cached urllib3-1.26.2-py2.py3-none-any.whl (136 kB)
Collecting deprecation
  Using cached deprecation-2.1.0-py2.py3-none-any.whl (11 kB)
Collecting docker
  Using cached docker-4.4.1-py2.py3-none-any.whl (146 kB)
Collecting websocket-client>=0.32.0
  Using cached websocket_client-0.57.0-py2.py3-none-any.whl (200 kB)
Collecting docopt
  Using cached docopt-0.6.2-py2.py3-none-any.whl
Collecting packaging
  Using cached packaging-20.8-py2.py3-none-any.whl (39 kB)
Collecting pycparser
  Using cached pycparser-2.20-py2.py3-none-any.whl (112 kB)
Collecting pytest-forked
  Using cached pytest_forked-1.3.0-py2.py3-none-any.whl (4.7 kB)
Collecting wcwidth
  Using cached wcwidth-0.2.5-py2.py3-none-any.whl (30 kB)
Collecting wrapt
  Using cached wrapt-1.12.1-cp37-cp37m-linux_x86_64.whl
Building wheels for collected packages: apache-beam
  Building wheel for apache-beam (setup.py): started
  Building wheel for apache-beam (setup.py): finished with status 'done'
  Created wheel for apache-beam: filename=apache_beam-2.28.0.dev0-py3-none-any.whl size=2384319
sha256=3a9b1375703fa9b6382e2278ebc8d9fe3c0e58b78002c5e3bd880bd11332a413
  Stored in directory: /home/jenkins/.cache/pip/wheels/bc/10/43/2e6f08d57c0f9fc9e1f1ee753673c40f9e03ed660bcae39b4a
Successfully built apache-beam
Installing collected packages: pyasn1, urllib3, rsa, pyparsing, pycparser, pyasn1-modules,
idna, chardet, certifi, cachetools, wcwidth, requests, pytz, python-dateutil, packaging, oauthlib,
mypy-extensions, more-itertools, jmespath, googleapis-common-protos, google-auth, cffi, attrs,
atomicwrites, websocket-client, typing-inspect, requests-oauthlib, pyyaml, pytest, pbr, numpy,
isodate, httplib2, grpcio-gcp, google-crc32c, google-api-core, docopt, botocore, apipkg, wrapt,
s3transfer, pytest-forked, pymongo, pydot, pyarrow, proto-plus, oauth2client, nose, msrest,
mock, libcst, hdfs, grpc-google-iam-v1, google-resumable-media, google-cloud-core, fasteners,
fastavro, execnet, docker, dill, deprecation, cryptography, crcmod, azure-core, avro-python3,
testcontainers, tenacity, sqlalchemy, requests-mock, pytest-xdist, pytest-timeout, pyhamcrest,
psycopg2-binary, parameterized, pandas, nose-xunitmp, google-cloud-vision, google-cloud-videointelligence,
google-cloud-spanner, google-cloud-pubsub, google-cloud-language, google-cloud-dlp, google-cloud-datastore,
google-cloud-build, google-cloud-bigtable, google-cloud-bigquery, google-apitools, freezegun,
boto3, azure-storage-blob, apache-beam
Successfully installed apache-beam-2.28.0.dev0 apipkg-1.5 atomicwrites-1.4.0 attrs-20.3.0
avro-python3-1.9.2.1 azure-core-1.10.0 azure-storage-blob-12.7.0 boto3-1.16.54 botocore-1.19.54
cachetools-4.2.0 certifi-2020.12.5 cffi-1.14.4 chardet-4.0.0 crcmod-1.7 cryptography-3.3.1
deprecation-2.1.0 dill-0.3.1.1 docker-4.4.1 docopt-0.6.2 execnet-1.7.1 fastavro-1.2.3 fasteners-0.16
freezegun-1.0.0 google-api-core-1.24.1 google-apitools-0.5.31 google-auth-1.24.0 google-cloud-bigquery-1.28.0
google-cloud-bigtable-1.6.1 google-cloud-build-2.0.0 google-cloud-core-1.5.0 google-cloud-datastore-1.15.3
google-cloud-dlp-1.0.0 google-cloud-language-1.3.0 google-cloud-pubsub-1.7.0 google-cloud-spanner-1.19.1
google-cloud-videointelligence-1.16.1 google-cloud-vision-1.0.0 google-crc32c-1.1.0 google-resumable-media-1.2.0
googleapis-common-protos-1.52.0 grpc-google-iam-v1-0.12.3 grpcio-gcp-0.2.2 hdfs-2.5.8 httplib2-0.17.4
idna-2.10 isodate-0.6.0 jmespath-0.10.0 libcst-0.3.16 mock-2.0.0 more-itertools-8.6.0 msrest-0.6.19
mypy-extensions-0.4.3 nose-1.3.7 nose-xunitmp-0.4.1 numpy-1.19.5 oauth2client-4.1.3 oauthlib-3.1.0
packaging-20.8 pandas-1.1.5 parameterized-0.7.5 pbr-5.5.1 proto-plus-1.13.0 psycopg2-binary-2.8.6
pyarrow-2.0.0 pyasn1-0.4.8 pyasn1-modules-0.2.8 pycparser-2.20 pydot-1.4.1 pyhamcrest-1.10.1
pymongo-3.11.2 pyparsing-2.4.7 pytest-4.6.11 pytest-forked-1.3.0 pytest-timeout-1.4.2 pytest-xdist-1.34.0
python-dateutil-2.8.1 pytz-2020.5 pyyaml-5.3.1 requests-2.25.1 requests-mock-1.8.0 requests-oauthlib-1.3.0
rsa-4.7 s3transfer-0.3.4 sqlalchemy-1.3.22 tenacity-5.1.5 testcontainers-3.2.0 typing-inspect-0.6.0
urllib3-1.26.2 wcwidth-0.2.5 websocket-client-0.57.0 wrapt-1.12.1

> Task :sdks:python:apache_beam:testing:load_tests:run
WARNING:apache_beam.transforms.core:Key coder FastPrimitivesCoder for transform <ParDo(PTransform)
label=[Step: 0]> with stateful DoFn may not be deterministic. This may cause incorrect
behavior for complex key types. Consider adding an input type hint for this transform.
WARNING:apache_beam.transforms.core:Key coder FastPrimitivesCoder for transform <ParDo(PTransform)
label=[Step: 1]> with stateful DoFn may not be deterministic. This may cause incorrect
behavior for complex key types. Consider adding an input type hint for this transform.
WARNING:apache_beam.transforms.core:Key coder FastPrimitivesCoder for transform <ParDo(PTransform)
label=[Step: 2]> with stateful DoFn may not be deterministic. This may cause incorrect
behavior for complex key types. Consider adding an input type hint for this transform.
WARNING:apache_beam.transforms.core:Key coder FastPrimitivesCoder for transform <ParDo(PTransform)
label=[Step: 3]> with stateful DoFn may not be deterministic. This may cause incorrect
behavior for complex key types. Consider adding an input type hint for this transform.
WARNING:apache_beam.transforms.core:Key coder FastPrimitivesCoder for transform <ParDo(PTransform)
label=[Step: 4]> with stateful DoFn may not be deterministic. This may cause incorrect
behavior for complex key types. Consider adding an input type hint for this transform.
WARNING:apache_beam.transforms.core:Key coder FastPrimitivesCoder for transform <ParDo(PTransform)
label=[Step: 5]> with stateful DoFn may not be deterministic. This may cause incorrect
behavior for complex key types. Consider adding an input type hint for this transform.
WARNING:apache_beam.transforms.core:Key coder FastPrimitivesCoder for transform <ParDo(PTransform)
label=[Step: 6]> with stateful DoFn may not be deterministic. This may cause incorrect
behavior for complex key types. Consider adding an input type hint for this transform.
WARNING:apache_beam.transforms.core:Key coder FastPrimitivesCoder for transform <ParDo(PTransform)
label=[Step: 7]> with stateful DoFn may not be deterministic. This may cause incorrect
behavior for complex key types. Consider adding an input type hint for this transform.
WARNING:apache_beam.transforms.core:Key coder FastPrimitivesCoder for transform <ParDo(PTransform)
label=[Step: 8]> with stateful DoFn may not be deterministic. This may cause incorrect
behavior for complex key types. Consider adding an input type hint for this transform.
WARNING:apache_beam.transforms.core:Key coder FastPrimitivesCoder for transform <ParDo(PTransform)
label=[Step: 9]> with stateful DoFn may not be deterministic. This may cause incorrect
behavior for complex key types. Consider adding an input type hint for this transform.
WARNING:root:Make sure that locally built Python SDK docker image has Python 3.7 interpreter.
INFO:root:Default Python SDK image for environment is apache/beam_python3.7_sdk:2.28.0.dev
INFO:root:Using provided Python SDK container image: gcr.io/apache-beam-testing/beam_portability/beam_python3.7_sdk:latest
INFO:root:Python SDK container image set to "gcr.io/apache-beam-testing/beam_portability/beam_python3.7_sdk:latest"
for Docker environment
WARNING:apache_beam.options.pipeline_options:Discarding unparseable args: ['--iterations=10',
'--number_of_counter_operations=0', '--number_of_counters=0', '--stateful', '--use_stateful_load_generator']
INFO:apache_beam.runners.portability.portable_runner:Job state changed to STOPPED
INFO:apache_beam.runners.portability.portable_runner:Job state changed to STARTING
INFO:apache_beam.runners.portability.portable_runner:Job state changed to RUNNING
ERROR:root:java.util.concurrent.TimeoutException
INFO:apache_beam.runners.portability.portable_runner:Job state changed to FAILED
Traceback (most recent call last):
  File "/usr/lib/python3.7/runpy.py", line 193, in _run_module_as_main
    "__main__", mod_spec)
  File "/usr/lib/python3.7/runpy.py", line 85, in _run_code
    exec(code, run_globals)
  File "<https://ci-beam.apache.org/job/beam_LoadTests_Python_ParDo_Flink_Streaming/ws/src/sdks/python/apache_beam/testing/load_tests/pardo_test.py",>
line 169, in <module>
    ParDoTest().run()
  File "<https://ci-beam.apache.org/job/beam_LoadTests_Python_ParDo_Flink_Streaming/ws/src/sdks/python/apache_beam/testing/load_tests/load_test.py",>
line 152, in run
    self.result.wait_until_finish(duration=self.timeout_ms)
  File "<https://ci-beam.apache.org/job/beam_LoadTests_Python_ParDo_Flink_Streaming/ws/src/sdks/python/apache_beam/runners/portability/portable_runner.py",>
line 581, in wait_until_finish
    raise self._runtime_exception
RuntimeError: Pipeline load-tests-python-flink-streaming-pardo-1-0114100256_1efc7573-2cf2-4f84-bf9b-23fce43c6b34
failed in state FAILED: java.util.concurrent.TimeoutException

> Task :sdks:python:apache_beam:testing:load_tests:run FAILED

FAILURE: Build failed with an exception.

* Where:
Build file '<https://ci-beam.apache.org/job/beam_LoadTests_Python_ParDo_Flink_Streaming/ws/src/sdks/python/apache_beam/testing/load_tests/build.gradle'>
line: 58

* What went wrong:
Execution failed for task ':sdks:python:apache_beam:testing:load_tests:run'.
> error occurred

* Try:
Run with --stacktrace option to get the stack trace. Run with --info or --debug option to
get more log output. Run with --scan to get full insights.

* Get more help at https://help.gradle.org

Deprecated Gradle features were used in this build, making it incompatible with Gradle 7.0.
Use '--warning-mode all' to show the individual deprecation warnings.
See https://docs.gradle.org/6.7.1/userguide/command_line_interface.html#sec:command_line_warnings

BUILD FAILED in 7m 34s
5 actionable tasks: 5 executed

Publishing build scan...
https://gradle.com/s/rcau5ayi5x2uo

Build step 'Invoke Gradle script' changed build result to FAILURE
Build step 'Invoke Gradle script' marked build as failure

---------------------------------------------------------------------
To unsubscribe, e-mail: builds-unsubscribe@beam.apache.org
For additional commands, e-mail: builds-help@beam.apache.org


Mime
View raw message