beam-builds mailing list archives

Site index · List index
Message view « Date » · « Thread »
Top « Date » · « Thread »
From Apache Jenkins Server <jenk...@builds.apache.org>
Subject Build failed in Jenkins: beam_PostCommit_Java_PVR_Spark_Streaming #630
Date Wed, 27 Jan 2021 00:33:29 GMT
See <https://ci-beam.apache.org/job/beam_PostCommit_Java_PVR_Spark_Streaming/630/display/redirect?page=changes>

Changes:

[Kyle Weaver] [BEAM-10925] Load SQL UDFs from jar.

[Kyle Weaver] Move JavaUdfLoader from zetasql -> sql.

[Kyle Weaver] Make JavaUdfDefinitions a subclass of JavaUdfLoader.

[Kyle Weaver] [BEAM-9541] Push all docker images from RC instead of hard-coding them.

[Kyle Weaver] Don't set context classloader.

[Pablo Estrada] Revert "Revert "Merge pull request #12647 from [BEAM-10378]

[Pablo Estrada] Fixing checker framework checks

[Kyle Weaver] [BEAM-9541] Update Python SDK's Flink version list.

[Kyle Weaver] [BEAM-9541] Create a Gradle task to push all docker images, and use it

[Kyle Weaver] [BEAM-11689] Use public.nexus.pentaho.org for pentaho dependencies

[noreply] [BEAM-11272] Remove combiner label constructor arg (#13355)

[noreply] [BEAM-11691] Skip JavaUdfLoaderTest instead of failing when jar path

[noreply] Merge pull request #13757: [BEAM-11640] Linkage Checker version upgrade


------------------------------------------
[...truncated 1.44 KB...]
Checking out Revision 3d7c3a7363ec6edbf818bca1113138f940059623 (origin/master)
 > git config core.sparsecheckout # timeout=10
 > git checkout -f 3d7c3a7363ec6edbf818bca1113138f940059623 # timeout=10
Commit message: "Merge pull request #13813 from ibzib/BEAM-11689"
 > git rev-list --no-walk 67989cafecf3f5d4bce879e9f6b9a690955e84d5 # timeout=10
No emails were triggered.
[EnvInject] - Executing scripts and injecting environment variables after the SCM step.
[EnvInject] - Injecting as environment variables the properties content 
SPARK_LOCAL_IP=127.0.0.1
SETUPTOOLS_USE_DISTUTILS=stdlib

[EnvInject] - Variables injected successfully.
[Gradle] - Launching build.
[src] $ <https://ci-beam.apache.org/job/beam_PostCommit_Java_PVR_Spark_Streaming/ws/src/gradlew>
--continue --max-workers=12 -Dorg.gradle.jvmargs=-Xms2g -Dorg.gradle.jvmargs=-Xmx4g -Pdocker-pull-licenses
:runners:spark:job-server:validatesPortableRunnerStreaming
Starting a Gradle Daemon, 2 busy Daemons could not be reused, use --status for details
> Task :buildSrc:compileJava NO-SOURCE
> Task :buildSrc:compileGroovy FROM-CACHE
> Task :buildSrc:pluginDescriptors
> Task :buildSrc:processResources
> Task :buildSrc:classes
> Task :buildSrc:jar
> Task :buildSrc:assemble
> Task :buildSrc:spotlessGroovy
> Task :buildSrc:spotlessGroovyCheck
> Task :buildSrc:spotlessGroovyGradle FROM-CACHE
> Task :buildSrc:spotlessGroovyGradleCheck UP-TO-DATE
> Task :buildSrc:spotlessCheck
> Task :buildSrc:pluginUnderTestMetadata
> Task :buildSrc:compileTestJava NO-SOURCE
> Task :buildSrc:compileTestGroovy NO-SOURCE
> Task :buildSrc:processTestResources NO-SOURCE
> Task :buildSrc:testClasses UP-TO-DATE
> Task :buildSrc:test NO-SOURCE
> Task :buildSrc:validatePlugins FROM-CACHE
> Task :buildSrc:check
> Task :buildSrc:build
Configuration on demand is an incubating feature.
> Task :sdks:java:extensions:google-cloud-platform-core:createCheckerFrameworkManifest
> Task :sdks:java:harness:createCheckerFrameworkManifest
> Task :vendor:sdks-java-extensions-protobuf:createCheckerFrameworkManifest
> Task :sdks:java:harness:processResources NO-SOURCE
> Task :vendor:sdks-java-extensions-protobuf:processResources NO-SOURCE
> Task :runners:java-fn-execution:createCheckerFrameworkManifest
> Task :sdks:java:fn-execution:createCheckerFrameworkManifest
> Task :model:job-management:createCheckerFrameworkManifest
> Task :runners:java-job-service:createCheckerFrameworkManifest
> Task :runners:core-construction-java:createCheckerFrameworkManifest
> Task :model:fn-execution:createCheckerFrameworkManifest
> Task :runners:core-java:createCheckerFrameworkManifest
> Task :sdks:java:core:createCheckerFrameworkManifest
> Task :model:pipeline:createCheckerFrameworkManifest
> Task :sdks:java:core:generateAvroProtocol NO-SOURCE
> Task :runners:java-fn-execution:processResources NO-SOURCE
> Task :runners:core-construction-java:processResources NO-SOURCE
> Task :runners:core-java:processResources NO-SOURCE
> Task :sdks:java:fn-execution:processResources NO-SOURCE
> Task :runners:java-job-service:processResources NO-SOURCE
> Task :sdks:java:core:generateAvroJava NO-SOURCE
> Task :sdks:java:extensions:google-cloud-platform-core:processResources NO-SOURCE
> Task :model:job-management:extractProto
> Task :runners:core-java:processTestResources NO-SOURCE
> Task :runners:core-construction-java:processTestResources NO-SOURCE
> Task :runners:spark:createCheckerFrameworkManifest
> Task :sdks:java:expansion-service:createCheckerFrameworkManifest
> Task :sdks:java:io:kafka:createCheckerFrameworkManifest
> Task :sdks:java:expansion-service:processResources NO-SOURCE
> Task :sdks:java:io:kafka:processResources NO-SOURCE
> Task :model:fn-execution:extractProto
> Task :runners:portability:java:createCheckerFrameworkManifest
> Task :runners:portability:java:processResources NO-SOURCE
> Task :runners:spark:processResources
> Task :runners:portability:java:processTestResources NO-SOURCE
> Task :model:job-management:processResources
> Task :runners:spark:processTestResources
> Task :model:fn-execution:processResources
> Task :sdks:java:core:generateGrammarSource FROM-CACHE
> Task :sdks:java:core:processResources
> Task :sdks:java:core:generateTestAvroProtocol NO-SOURCE
> Task :model:pipeline:extractIncludeProto
> Task :model:pipeline:extractProto
> Task :sdks:java:core:generateTestAvroJava
> Task :sdks:java:core:generateTestGrammarSource NO-SOURCE
> Task :sdks:java:core:processTestResources
> Task :model:pipeline:generateProto FROM-CACHE
> Task :model:pipeline:compileJava FROM-CACHE
> Task :model:pipeline:processResources
> Task :model:pipeline:classes
> Task :model:pipeline:jar
> Task :model:pipeline:shadowJar FROM-CACHE
> Task :model:fn-execution:extractIncludeProto
> Task :model:job-management:extractIncludeProto
> Task :model:job-management:generateProto FROM-CACHE
> Task :model:fn-execution:generateProto FROM-CACHE
> Task :model:job-management:compileJava FROM-CACHE
> Task :model:job-management:classes
> Task :model:fn-execution:compileJava FROM-CACHE
> Task :model:fn-execution:classes
> Task :model:fn-execution:shadowJar FROM-CACHE
> Task :model:job-management:shadowJar FROM-CACHE
> Task :sdks:java:core:compileJava FROM-CACHE
> Task :sdks:java:core:classes
> Task :sdks:java:core:shadowJar FROM-CACHE
> Task :sdks:java:fn-execution:compileJava FROM-CACHE
> Task :sdks:java:fn-execution:classes UP-TO-DATE
> Task :vendor:sdks-java-extensions-protobuf:compileJava FROM-CACHE
> Task :vendor:sdks-java-extensions-protobuf:classes UP-TO-DATE
> Task :sdks:java:fn-execution:jar
> Task :sdks:java:core:jar
> Task :vendor:sdks-java-extensions-protobuf:shadowJar FROM-CACHE
> Task :runners:core-construction-java:compileJava FROM-CACHE
> Task :runners:core-construction-java:classes UP-TO-DATE
> Task :runners:core-construction-java:jar
> Task :runners:core-java:compileJava FROM-CACHE
> Task :runners:core-java:classes UP-TO-DATE
> Task :runners:core-java:jar
> Task :sdks:java:extensions:google-cloud-platform-core:compileJava FROM-CACHE
> Task :sdks:java:extensions:google-cloud-platform-core:classes UP-TO-DATE
> Task :sdks:java:extensions:google-cloud-platform-core:jar
> Task :sdks:java:harness:compileJava FROM-CACHE
> Task :sdks:java:harness:classes UP-TO-DATE
> Task :sdks:java:harness:jar
> Task :sdks:java:harness:shadowJar FROM-CACHE
> Task :runners:java-fn-execution:compileJava FROM-CACHE
> Task :runners:java-fn-execution:classes UP-TO-DATE
> Task :runners:java-fn-execution:jar
> Task :sdks:java:expansion-service:compileJava FROM-CACHE
> Task :sdks:java:expansion-service:classes UP-TO-DATE
> Task :sdks:java:expansion-service:jar
> Task :sdks:java:io:kafka:compileJava FROM-CACHE
> Task :sdks:java:io:kafka:classes UP-TO-DATE
> Task :sdks:java:io:kafka:jar
> Task :sdks:java:core:compileTestJava
> Task :runners:java-job-service:compileJava
Note: <https://ci-beam.apache.org/job/beam_PostCommit_Java_PVR_Spark_Streaming/ws/src/runners/java-job-service/src/main/java/org/apache/beam/runners/jobsubmission/PortablePipelineJarCreator.java>
uses unchecked or unsafe operations.
Note: Recompile with -Xlint:unchecked for details.

> Task :runners:java-job-service:classes
> Task :runners:java-job-service:jar

> Task :sdks:java:core:compileTestJava
Note: Some input files use or override a deprecated API.
Note: Recompile with -Xlint:deprecation for details.
Note: Some input files use unchecked or unsafe operations.
Note: Recompile with -Xlint:unchecked for details.

> Task :sdks:java:core:testClasses
> Task :sdks:java:core:shadowTestJar FROM-CACHE
> Task :runners:spark:compileJava
> Task :runners:portability:java:compileJava
> Task :runners:portability:java:classes
> Task :runners:portability:java:jar
> Task :runners:core-construction-java:compileTestJava
> Task :runners:core-java:compileTestJava
Note: Some input files use or override a deprecated API.
Note: Recompile with -Xlint:deprecation for details.
Note: Some input files use unchecked or unsafe operations.
Note: Recompile with -Xlint:unchecked for details.

> Task :runners:core-java:testClasses
> Task :runners:core-java:testJar

> Task :runners:core-construction-java:compileTestJava
Note: Some input files use or override a deprecated API.
Note: Recompile with -Xlint:deprecation for details.
Note: Some input files use unchecked or unsafe operations.
Note: Recompile with -Xlint:unchecked for details.

> Task :runners:core-construction-java:testClasses

> Task :runners:spark:compileJava
Note: Some input files use or override a deprecated API.
Note: Recompile with -Xlint:deprecation for details.
Note: Some input files use unchecked or unsafe operations.
Note: Recompile with -Xlint:unchecked for details.

> Task :runners:core-construction-java:testJar
> Task :runners:spark:classes
> Task :runners:spark:jar

> Task :runners:portability:java:compileTestJava
Note: <https://ci-beam.apache.org/job/beam_PostCommit_Java_PVR_Spark_Streaming/ws/src/runners/portability/java/src/test/java/org/apache/beam/runners/portability/CloseableResourceTest.java>
uses or overrides a deprecated API.
Note: Recompile with -Xlint:deprecation for details.

> Task :runners:portability:java:testClasses
> Task :runners:portability:java:testJar
> Task :runners:spark:compileTestJava
Note: Some input files use or override a deprecated API.
Note: Recompile with -Xlint:deprecation for details.
Note: Some input files use unchecked or unsafe operations.
Note: Recompile with -Xlint:unchecked for details.

> Task :runners:spark:testClasses
> Task :runners:spark:testJar
> Task :runners:spark:job-server:validatesPortableRunnerStreaming

org.apache.beam.sdk.transforms.CombineTest$BasicTests > testCombinePerKeyInstanceMethodReference
FAILED
    java.lang.AssertionError at CombineTest.java:937

org.apache.beam.sdk.transforms.FlattenTest > testFlattenIterablesEmpty FAILED
    java.lang.AssertionError at FlattenTest.java:320

org.apache.beam.sdk.testing.PAssertTest > testNotEqualTo FAILED
    java.lang.AssertionError at PAssertTest.java:361

org.apache.beam.sdk.transforms.KvSwapTest > testKvSwap FAILED
    java.lang.AssertionError at KvSwapTest.java:81

org.apache.beam.sdk.transforms.CombineTest$BasicTests > testCombinePerKeyLambda FAILED
    java.lang.AssertionError at CombineTest.java:909

org.apache.beam.sdk.transforms.FlattenTest > testFlattenIterablesLists FAILED
    java.lang.AssertionError at FlattenTest.java:273

org.apache.beam.sdk.transforms.GroupByKeyTest > org.apache.beam.sdk.transforms.GroupByKeyTest$WindowTests.testGroupByKeyMergingWindows
FAILED
    java.lang.RuntimeException at GroupByKeyTest.java:585

org.apache.beam.sdk.transforms.GroupByKeyTest > org.apache.beam.sdk.transforms.GroupByKeyTest$WindowTests.testGroupByKeyMultipleWindows
FAILED
    java.lang.RuntimeException at GroupByKeyTest.java:557

org.apache.beam.sdk.transforms.GroupByKeyTest > org.apache.beam.sdk.transforms.GroupByKeyTest$WindowTests.testGroupByKeyAndWindows
FAILED
    java.lang.RuntimeException at GroupByKeyTest.java:527

103 tests completed, 9 failed, 1 skipped

> Task :runners:spark:job-server:validatesPortableRunnerStreaming FAILED

FAILURE: Build failed with an exception.

* What went wrong:
Execution failed for task ':runners:spark:job-server:validatesPortableRunnerStreaming'.
> There were failing tests. See the report at: file://<https://ci-beam.apache.org/job/beam_PostCommit_Java_PVR_Spark_Streaming/ws/src/runners/spark/job-server/build/reports/tests/validatesPortableRunnerStreaming/index.html>

* Try:
Run with --stacktrace option to get the stack trace. Run with --info or --debug option to
get more log output. Run with --scan to get full insights.

* Get more help at https://help.gradle.org

Deprecated Gradle features were used in this build, making it incompatible with Gradle 7.0.
Use '--warning-mode all' to show the individual deprecation warnings.
See https://docs.gradle.org/6.8/userguide/command_line_interface.html#sec:command_line_warnings

BUILD FAILED in 32m 58s
80 actionable tasks: 56 executed, 24 from cache

Publishing build scan...
https://gradle.com/s/sxlujlgwkllcs

Build step 'Invoke Gradle script' changed build result to FAILURE
Build step 'Invoke Gradle script' marked build as failure

---------------------------------------------------------------------
To unsubscribe, e-mail: builds-unsubscribe@beam.apache.org
For additional commands, e-mail: builds-help@beam.apache.org


Mime
View raw message