beam-builds mailing list archives

Site index · List index
Message view « Date » · « Thread »
Top « Date » · « Thread »
From Apache Jenkins Server <jenk...@builds.apache.org>
Subject Build failed in Jenkins: beam_PostCommit_Java #7151
Date Sun, 31 Jan 2021 13:42:28 GMT
See <https://ci-beam.apache.org/job/beam_PostCommit_Java/7151/display/redirect>

Changes:


------------------------------------------
[...truncated 101.78 KB...]
> Task :sdks:java:io:hadoop-format:runHadoopFormatIO2101ElasticIT

> Task :sdks:go:resolveBuildDependencies
Resolving golang.org/x/sys: commit='fde4db37ae7ad8191b03d30d27f258b5291ae4e3', urls=[https://go.googlesource.com/sys]

> Task :sdks:java:extensions:zetasketch:integrationTest
> Task :sdks:java:extensions:ml:postCommit

> Task :release:go-licenses:java:dockerRun
+ go-licenses save github.com/apache/beam/sdks/java/container --save_path=/output/licenses
+ go-licenses csv github.com/apache/beam/sdks/java/container
+ tee /output/licenses/list.csv
golang.org/x/sys,https://go.googlesource.com/sys/+/refs/heads/master/LICENSE,BSD-3-Clause
github.com/apache/beam/sdks/java/container,https://github.com/apache/beam/blob/master/LICENSE,Apache-2.0
google.golang.org/protobuf,https://go.googlesource.com/protobuf/+/refs/heads/master/LICENSE,BSD-3-Clause
google.golang.org/grpc,https://github.com/grpc/grpc-go/blob/master/LICENSE,Apache-2.0
google.golang.org/genproto/googleapis/rpc/status,https://github.com/googleapis/go-genproto/blob/master/LICENSE,Apache-2.0
github.com/apache/beam/sdks/go/pkg/beam,https://github.com/apache/beam/blob/master/sdks/go/README.md,Apache-2.0
github.com/golang/protobuf,https://github.com/golang/protobuf/blob/master/LICENSE,BSD-3-Clause
golang.org/x/net,https://go.googlesource.com/net/+/refs/heads/master/LICENSE,BSD-3-Clause
golang.org/x/text,https://go.googlesource.com/text/+/refs/heads/master/LICENSE,BSD-3-Clause
+ chmod -R a+w /output/licenses

> Task :release:go-licenses:java:createLicenses
> Task :sdks:java:container:java8:copyGolangLicenses
> Task :sdks:java:io:kafka:kafkaVersion01103Test
> Task :sdks:java:io:hadoop-file-system:hadoopVersion285Test
> Task :sdks:java:io:hadoop-format:runHadoopFormatIO2101IT

> Task :sdks:go:resolveBuildDependencies
Resolving golang.org/x/text: commit='23ae387dee1f90d29a23c0e87ee0b46038fbed0e', urls=[https://go.googlesource.com/text]
Resolving cached github.com/etcd-io/etcd: commit='11214aa33bf5a47d3d9d8dafe0f6b97237dfe921',
urls=[https://github.com/etcd-io/etcd.git, git@github.com:etcd-io/etcd.git]

> Task :sdks:java:io:kafka:kafkaVersion100BatchIT
> Task :sdks:java:io:hadoop-format:runHadoopFormatIO2101Test
> Task :sdks:java:io:hadoop-file-system:hadoopVersion292Test
> Task :sdks:java:io:kafka:kafkaVersion100Test
> Task :sdks:java:io:hadoop-file-system:hadoopVersion321Test
> Task :sdks:java:io:hadoop-format:runHadoopFormatIO285ElasticIT
> Task :sdks:java:io:kafka:kafkaVersion111BatchIT
> Task :sdks:java:io:hadoop-file-system:hadoopVersionsTest
> Task :sdks:java:io:kafka:kafkaVersion111Test
> Task :sdks:java:io:hadoop-format:runHadoopFormatIO285IT
> Task :sdks:java:io:kafka:kafkaVersion201BatchIT
> Task :sdks:java:io:hadoop-format:runHadoopFormatIO285Test

> Task :sdks:go:resolveBuildDependencies
Resolving google.golang.org/api: commit='0324d5e90dc7753607860272666845fad9ceb97e', urls=[https://code.googlesource.com/google-api-go-client]

> Task :sdks:java:io:kafka:kafkaVersion201Test
> Task :sdks:java:io:kafka:kafkaVersion211BatchIT
> Task :sdks:java:io:hadoop-format:runHadoopFormatIO292ElasticIT
> Task :sdks:java:io:kafka:kafkaVersion211Test

> Task :sdks:go:resolveBuildDependencies
Resolving google.golang.org/genproto: commit='4d944d34d83c502a5f761500a14d8842648415c3', urls=[https://github.com/google/go-genproto]
Resolving google.golang.org/grpc: commit='5e8f83304c0563d1ba74db05fee83d9c18ab9a58', urls=[https://github.com/grpc/grpc-go]
Resolving google.golang.org/protobuf: commit='d165be301fb1e13390ad453281ded24385fd8ebc', urls=[https://go.googlesource.com/protobuf]
Resolving cached github.com/etcd-io/etcd: commit='11214aa33bf5a47d3d9d8dafe0f6b97237dfe921',
urls=[https://github.com/etcd-io/etcd.git, git@github.com:etcd-io/etcd.git]
Resolving cached github.com/etcd-io/etcd: commit='11214aa33bf5a47d3d9d8dafe0f6b97237dfe921',
urls=[https://github.com/etcd-io/etcd.git, git@github.com:etcd-io/etcd.git]

> Task :sdks:go:installDependencies
> Task :sdks:go:buildLinuxAmd64
> Task :sdks:go:goBuild
> Task :sdks:java:io:kafka:kafkaVersion222BatchIT
> Task :sdks:java:io:hadoop-format:runHadoopFormatIO292IT

> Task :sdks:java:container:resolveBuildDependencies
Unable to watch the file system for changes. The inotify watches limit is too low.
Resolving ./github.com/apache/beam/sdks/go@<https://ci-beam.apache.org/job/beam_PostCommit_Java/ws/src/sdks/go>

> Task :sdks:java:container:installDependencies
> Task :sdks:java:container:buildLinuxAmd64
> Task :sdks:java:container:goBuild
> Task :sdks:java:container:java8:copySdkHarnessLauncher
> Task :sdks:java:container:java8:dockerPrepare
> Task :sdks:java:container:java8:docker

> Task :runners:google-cloud-dataflow-java:buildAndPushDockerContainer
WARNING: `gcloud docker` will not be supported for Docker client versions above 18.03.

As an alternative, use `gcloud auth configure-docker` to configure `docker` to
use `gcloud` as a credential helper, then use `docker` as you would for non-GCR
registries, e.g. `docker pull gcr.io/project-id/my-image`. Add
`--verbosity=error` to silence this warning: `gcloud docker
--verbosity=error -- pull gcr.io/project-id/my-image`.

See: https://cloud.google.com/container-registry/docs/support/deprecation-notices#gcloud-docker

The push refers to repository [us.gcr.io/apache-beam-testing/java-postcommit-it/java]
d1ce8df12585: Preparing
c539c8c77820: Preparing
9c46a21e991c: Preparing
02d79de60d76: Preparing
d4aeb0f57a7a: Preparing
93e0d90a6fe9: Preparing
f2fbe5f84746: Preparing
4b49e678e81f: Preparing
61670dc52e56: Preparing
4dc8fb2a04ce: Preparing
c3e075831b0c: Preparing
25b2e6cfc187: Preparing
7df6dd475950: Preparing
7496c5e8691b: Preparing
aa7af8a465c6: Preparing
ef9a7b8862f4: Preparing
a1f2f42922b1: Preparing
4762552ad7d8: Preparing
4dc8fb2a04ce: Waiting
c3e075831b0c: Waiting
25b2e6cfc187: Waiting
7df6dd475950: Waiting
7496c5e8691b: Waiting
aa7af8a465c6: Waiting
ef9a7b8862f4: Waiting
a1f2f42922b1: Waiting
4762552ad7d8: Waiting
93e0d90a6fe9: Waiting
f2fbe5f84746: Waiting
4b49e678e81f: Waiting
61670dc52e56: Waiting
d1ce8df12585: Pushed
d4aeb0f57a7a: Pushed
02d79de60d76: Pushed
c539c8c77820: Pushed
4b49e678e81f: Pushed
f2fbe5f84746: Pushed
9c46a21e991c: Pushed
25b2e6cfc187: Layer already exists
7df6dd475950: Layer already exists
7496c5e8691b: Layer already exists
aa7af8a465c6: Layer already exists
4dc8fb2a04ce: Pushed
ef9a7b8862f4: Layer already exists
a1f2f42922b1: Layer already exists
4762552ad7d8: Layer already exists
c3e075831b0c: Pushed
93e0d90a6fe9: Pushed
61670dc52e56: Pushed
20210131120040: digest: sha256:c05f3404110fd0c0a55b54fb7c8f9301279a5aecccfeb4f04c170db8ef001de3
size: 4098

> Task :runners:google-cloud-dataflow-java:coreSDKJavaRunnerV2IntegrationTest NO-SOURCE
> Task :sdks:java:io:kafka:kafkaVersion222Test
> Task :sdks:java:io:hadoop-format:runHadoopFormatIO292Test
> Task :runners:google-cloud-dataflow-java:examplesJavaRunnerV2IntegrationTest
> Task :sdks:java:io:kafka:kafkaVersion231BatchIT
> Task :sdks:java:io:kafka:kafkaVersion231Test

> Task :sdks:java:io:google-cloud-platform:integrationTest

org.apache.beam.sdk.io.gcp.healthcare.FhirIOWriteIT > testFhirIO_Import[R4] FAILED
    org.apache.beam.sdk.Pipeline$PipelineExecutionException at FhirIOWriteIT.java:139
        Caused by: java.lang.AssertionError at FhirIOWriteIT.java:137
            Caused by: java.lang.AssertionError at MatcherAssert.java:18

> Task :sdks:java:io:hadoop-format:runHadoopFormatIO321ElasticIT
> Task :sdks:java:io:kafka:kafkaVersion241BatchIT
> Task :sdks:java:io:hadoop-format:runHadoopFormatIO321IT
> Task :sdks:java:io:kafka:kafkaVersion241Test
> Task :sdks:java:io:kafka:kafkaVersion251BatchIT
> Task :sdks:java:io:hadoop-format:runHadoopFormatIO321Test

> Task :sdks:java:io:google-cloud-platform:integrationTest

43 tests completed, 1 failed, 1 skipped

> Task :sdks:java:io:google-cloud-platform:integrationTest FAILED
> Task :sdks:java:io:kafka:kafkaVersion251Test
> Task :sdks:java:io:kafka:kafkaVersionsCompatibilityTest
> Task :sdks:java:io:google-cloud-platform:integrationTestKms
> Task :sdks:java:io:hadoop-format:hadoopVersionsTest
> Task :javaHadoopVersionsTest

> Task :runners:google-cloud-dataflow-java:examplesJavaRunnerV2IntegrationTest

***********************************************************
***********************************************************
**********************Set Up Pubsub************************
The Pub/Sub topic has been set up for this example: projects/apache-beam-testing/topics/testpipeline-jenkins-0131121145-b8148cb1
The Pub/Sub subscription has been set up for this example: projects/apache-beam-testing/subscriptions/testpipeline-jenkins-0131121145-b8148cb1
******************Set Up Big Query Table*******************
The BigQuery table has been set up for this example: apache-beam-testing:traffic_routes_1612095099075.traffic_routes_table
*************************Tear Down*************************
The Pub/Sub topic has been deleted: projects/apache-beam-testing/topics/testpipeline-jenkins-0131121145-b8148cb1
The Pub/Sub subscription has been deleted: projects/apache-beam-testing/subscriptions/testpipeline-jenkins-0131121145-b8148cb1
The BigQuery table might contain the example's output, and it is not deleted automatically:
apache-beam-testing:traffic_routes_1612095099075.traffic_routes_table
Please go to the Developers Console to delete it manually. Otherwise, you may be charged for
its usage.
***********************************************************
***********************************************************

> Task :sdks:java:extensions:zetasketch:postCommit

> Task :runners:google-cloud-dataflow-java:examplesJavaRunnerV2IntegrationTest

***********************************************************
***********************************************************
**********************Set Up Pubsub************************
The Pub/Sub topic has been set up for this example: projects/apache-beam-testing/topics/testpipeline-jenkins-0131123639-c12426aa
The Pub/Sub subscription has been set up for this example: projects/apache-beam-testing/subscriptions/testpipeline-jenkins-0131123639-c12426aa
******************Set Up Big Query Table*******************
The BigQuery table has been set up for this example: apache-beam-testing:traffic_max_lane_flow_1612096599235.traffic_max_lane_flow_table
*************************Tear Down*************************
The Pub/Sub topic has been deleted: projects/apache-beam-testing/topics/testpipeline-jenkins-0131123639-c12426aa
The Pub/Sub subscription has been deleted: projects/apache-beam-testing/subscriptions/testpipeline-jenkins-0131123639-c12426aa
The BigQuery table might contain the example's output, and it is not deleted automatically:
apache-beam-testing:traffic_max_lane_flow_1612096599235.traffic_max_lane_flow_table
Please go to the Developers Console to delete it manually. Otherwise, you may be charged for
its usage.
***********************************************************
***********************************************************

> Task :runners:google-cloud-dataflow-java:googleCloudPlatformRunnerV2IntegrationTest

> Task :runners:google-cloud-dataflow-java:cleanUpDockerImages
Untagged: us.gcr.io/apache-beam-testing/java-postcommit-it/java:20210131120040
Untagged: us.gcr.io/apache-beam-testing/java-postcommit-it/java@sha256:c05f3404110fd0c0a55b54fb7c8f9301279a5aecccfeb4f04c170db8ef001de3
Digests:
- us.gcr.io/apache-beam-testing/java-postcommit-it/java@sha256:c05f3404110fd0c0a55b54fb7c8f9301279a5aecccfeb4f04c170db8ef001de3
  Associated tags:
 - 20210131120040
Tags:
- us.gcr.io/apache-beam-testing/java-postcommit-it/java:20210131120040
Deleted [us.gcr.io/apache-beam-testing/java-postcommit-it/java:20210131120040].
Deleted [us.gcr.io/apache-beam-testing/java-postcommit-it/java@sha256:c05f3404110fd0c0a55b54fb7c8f9301279a5aecccfeb4f04c170db8ef001de3].

> Task :runners:google-cloud-dataflow-java:postCommitRunnerV2

FAILURE: Build failed with an exception.

* What went wrong:
Execution failed for task ':sdks:java:io:google-cloud-platform:integrationTest'.
> There were failing tests. See the report at: file://<https://ci-beam.apache.org/job/beam_PostCommit_Java/ws/src/sdks/java/io/google-cloud-platform/build/reports/tests/integrationTest/index.html>

* Try:
Run with --stacktrace option to get the stack trace. Run with --info or --debug option to
get more log output. Run with --scan to get full insights.

* Get more help at https://help.gradle.org

Deprecated Gradle features were used in this build, making it incompatible with Gradle 7.0.
Use '--warning-mode all' to show the individual deprecation warnings.
See https://docs.gradle.org/6.8/userguide/command_line_interface.html#sec:command_line_warnings

BUILD FAILED in 1h 42m 7s
248 actionable tasks: 156 executed, 90 from cache, 2 up-to-date
Gradle was unable to watch the file system for changes. The inotify watches limit is too low.

Publishing build scan...
https://gradle.com/s/rzrspx3w73eag

Build step 'Invoke Gradle script' changed build result to FAILURE
Build step 'Invoke Gradle script' marked build as failure

---------------------------------------------------------------------
To unsubscribe, e-mail: builds-unsubscribe@beam.apache.org
For additional commands, e-mail: builds-help@beam.apache.org


Mime
View raw message