beam-builds mailing list archives

Site index · List index
Message view « Date » · « Thread »
Top « Date » · « Thread »
From Apache Jenkins Server <jenk...@builds.apache.org>
Subject Build failed in Jenkins: beam_PostCommit_Python37 #3388
Date Fri, 29 Jan 2021 19:35:56 GMT
See <https://ci-beam.apache.org/job/beam_PostCommit_Python37/3388/display/redirect?page=changes>

Changes:

[Ismaël Mejía] [BEAM-11658] Match .snappy files into the given (de)compressor


------------------------------------------
[...truncated 56.15 MB...]
INFO:apache_beam.runners.dataflow.dataflow_runner:2021-01-29T19:31:25.676Z: JOB_MESSAGE_BASIC:
Finished operation assert_that/Group/GroupByKey/Close
INFO:apache_beam.runners.dataflow.dataflow_runner:2021-01-29T19:31:25.790Z: JOB_MESSAGE_BASIC:
Executing operation assert_that/Group/GroupByKey/Read+assert_that/Group/GroupByKey/GroupByWindow+assert_that/Group/Map(_merge_tagged_vals_under_key)+assert_that/Unkey+assert_that/Match
INFO:apache_beam.runners.dataflow.dataflow_runner:2021-01-29T19:31:25.568Z: JOB_MESSAGE_DETAILED:
Autoscaling: Resized worker pool from 1 to 0.
INFO:apache_beam.runners.dataflow.dataflow_runner:2021-01-29T19:31:25.624Z: JOB_MESSAGE_BASIC:
Worker pool stopped.
INFO:apache_beam.runners.dataflow.dataflow_runner:2021-01-29T19:31:25.669Z: JOB_MESSAGE_DEBUG:
Tearing down pending resources...
INFO:apache_beam.runners.dataflow.dataflow_runner:2021-01-29T19:31:34.938Z: JOB_MESSAGE_BASIC:
Finished operation assert_that/Group/GroupByKey/Read+assert_that/Group/GroupByKey/GroupByWindow+assert_that/Group/Map(_merge_tagged_vals_under_key)+assert_that/Unkey+assert_that/Match
INFO:apache_beam.runners.dataflow.dataflow_runner:2021-01-29T19:31:35.017Z: JOB_MESSAGE_DEBUG:
Executing success step success19
INFO:apache_beam.runners.dataflow.dataflow_runner:2021-01-29T19:31:35.078Z: JOB_MESSAGE_DETAILED:
Cleaning up.
INFO:apache_beam.runners.dataflow.dataflow_runner:2021-01-29T19:31:35.119Z: JOB_MESSAGE_DEBUG:
Starting worker pool teardown.
INFO:apache_beam.runners.dataflow.dataflow_runner:2021-01-29T19:31:35.143Z: JOB_MESSAGE_BASIC:
Stopping worker pool...
INFO:apache_beam.runners.dataflow.dataflow_runner:Job 2021-01-29_11_24_30-3661319820342267244
is in state JOB_STATE_DONE
INFO:apache_beam.io.gcp.tests.bigquery_matcher:Attempting to perform query SELECT fruit from
`python_query_to_table_16119482583892.output_table`; to BQ
DEBUG:google.auth._default:Checking None for explicit credentials as part of auth process...
DEBUG:google.auth._default:Checking Cloud SDK credentials as part of auth process...
DEBUG:google.auth._default:Cloud SDK credentials not found on disk; not using them
DEBUG:google.auth._default:Checking for App Engine runtime as part of auth process...
DEBUG:google.auth._default:No App Engine library was found so cannot authentication via App
Engine Identity Credentials.
DEBUG:google.auth.transport._http_client:Making request: GET http://169.254.169.254
DEBUG:google.auth.transport._http_client:Making request: GET http://metadata.google.internal/computeMetadata/v1/project/project-id
DEBUG:urllib3.util.retry:Converted retries value: 3 -> Retry(total=3, connect=None, read=None,
redirect=None, status=None)
DEBUG:google.auth.transport.requests:Making request: GET http://metadata.google.internal/computeMetadata/v1/instance/service-accounts/default/?recursive=true
DEBUG:urllib3.connectionpool:Starting new HTTP connection (1): metadata.google.internal:80
DEBUG:urllib3.connectionpool:http://metadata.google.internal:80 "GET /computeMetadata/v1/instance/service-accounts/default/?recursive=true
HTTP/1.1" 200 144
DEBUG:google.auth.transport.requests:Making request: GET http://metadata.google.internal/computeMetadata/v1/instance/service-accounts/844138762903-compute@developer.gserviceaccount.com/token?scopes=https%3A%2F%2Fwww.googleapis.com%2Fauth%2Fbigquery%2Chttps%3A%2F%2Fwww.googleapis.com%2Fauth%2Fcloud-platform
DEBUG:urllib3.connectionpool:http://metadata.google.internal:80 "GET /computeMetadata/v1/instance/service-accounts/844138762903-compute@developer.gserviceaccount.com/token?scopes=https%3A%2F%2Fwww.googleapis.com%2Fauth%2Fbigquery%2Chttps%3A%2F%2Fwww.googleapis.com%2Fauth%2Fcloud-platform
HTTP/1.1" 200 241
DEBUG:urllib3.connectionpool:Starting new HTTPS connection (1): bigquery.googleapis.com:443
DEBUG:urllib3.connectionpool:https://bigquery.googleapis.com:443 "POST /bigquery/v2/projects/apache-beam-testing/jobs?prettyPrint=false
HTTP/1.1" 200 None
DEBUG:urllib3.connectionpool:https://bigquery.googleapis.com:443 "GET /bigquery/v2/projects/apache-beam-testing/queries/1c974b02-bd5a-4e4d-8108-f330878585d1?maxResults=0&location=US&prettyPrint=false
HTTP/1.1" 200 None
DEBUG:urllib3.connectionpool:https://bigquery.googleapis.com:443 "GET /bigquery/v2/projects/apache-beam-testing/datasets/_7357fab0f784d2a7327ddbe81cdd1f4ca7e429cd/tables/anona7fecf78a267f79afe61d1101f622b5fd5f60090/data?prettyPrint=false
HTTP/1.1" 200 None
INFO:apache_beam.io.gcp.tests.bigquery_matcher:Read from given query (SELECT fruit from `python_query_to_table_16119482583892.output_table`;),
total rows 2
INFO:apache_beam.io.gcp.tests.bigquery_matcher:Generate checksum: 158a8ea1c254fcf40d4ed3e7c0242c3ea0a29e72
INFO:apache_beam.runners.dataflow.dataflow_runner:2021-01-29T19:32:17.523Z: JOB_MESSAGE_DETAILED:
Autoscaling: Resized worker pool from 1 to 0.
INFO:apache_beam.runners.dataflow.dataflow_runner:2021-01-29T19:32:17.635Z: JOB_MESSAGE_BASIC:
Worker pool stopped.
INFO:apache_beam.runners.dataflow.dataflow_runner:2021-01-29T19:32:17.693Z: JOB_MESSAGE_DEBUG:
Tearing down pending resources...
INFO:apache_beam.runners.dataflow.dataflow_runner:Job 2021-01-29_11_25_34-18011921838230736594
is in state JOB_STATE_DONE
WARNING:apache_beam.runners.dataflow.dataflow_runner:Timing out on waiting for job 2021-01-29_11_17_43-12862427053147499042
after 902 seconds
INFO:apache_beam.io.gcp.tests.bigquery_matcher:Attempting to perform query SELECT number FROM
python_pubsub_bq_16119478521601.output_table to BQ
DEBUG:google.auth._default:Checking None for explicit credentials as part of auth process...
DEBUG:google.auth._default:Checking Cloud SDK credentials as part of auth process...
DEBUG:google.auth._default:Cloud SDK credentials not found on disk; not using them
DEBUG:google.auth._default:Checking for App Engine runtime as part of auth process...
DEBUG:google.auth._default:No App Engine library was found so cannot authentication via App
Engine Identity Credentials.
DEBUG:google.auth.transport._http_client:Making request: GET http://169.254.169.254
DEBUG:google.auth.transport._http_client:Making request: GET http://metadata.google.internal/computeMetadata/v1/project/project-id
DEBUG:urllib3.util.retry:Converted retries value: 3 -> Retry(total=3, connect=None, read=None,
redirect=None, status=None)
DEBUG:google.auth.transport.requests:Making request: GET http://metadata.google.internal/computeMetadata/v1/instance/service-accounts/default/?recursive=true
DEBUG:urllib3.connectionpool:Starting new HTTP connection (1): metadata.google.internal:80
DEBUG:urllib3.connectionpool:http://metadata.google.internal:80 "GET /computeMetadata/v1/instance/service-accounts/default/?recursive=true
HTTP/1.1" 200 144
DEBUG:google.auth.transport.requests:Making request: GET http://metadata.google.internal/computeMetadata/v1/instance/service-accounts/844138762903-compute@developer.gserviceaccount.com/token?scopes=https%3A%2F%2Fwww.googleapis.com%2Fauth%2Fbigquery%2Chttps%3A%2F%2Fwww.googleapis.com%2Fauth%2Fcloud-platform
DEBUG:urllib3.connectionpool:http://metadata.google.internal:80 "GET /computeMetadata/v1/instance/service-accounts/844138762903-compute@developer.gserviceaccount.com/token?scopes=https%3A%2F%2Fwww.googleapis.com%2Fauth%2Fbigquery%2Chttps%3A%2F%2Fwww.googleapis.com%2Fauth%2Fcloud-platform
HTTP/1.1" 200 241
DEBUG:urllib3.connectionpool:Starting new HTTPS connection (1): bigquery.googleapis.com:443
DEBUG:urllib3.connectionpool:https://bigquery.googleapis.com:443 "POST /bigquery/v2/projects/apache-beam-testing/jobs?prettyPrint=false
HTTP/1.1" 200 None
DEBUG:urllib3.connectionpool:https://bigquery.googleapis.com:443 "GET /bigquery/v2/projects/apache-beam-testing/queries/4fce9254-a9f6-4b6a-86a4-f0ebdca3a312?maxResults=0&location=US&prettyPrint=false
HTTP/1.1" 200 None
DEBUG:urllib3.connectionpool:https://bigquery.googleapis.com:443 "GET /bigquery/v2/projects/apache-beam-testing/datasets/_7357fab0f784d2a7327ddbe81cdd1f4ca7e429cd/tables/anon11caedd1_1d1d_4a37_971e_8ea6aef7022f/data?prettyPrint=false
HTTP/1.1" 200 None
INFO:apache_beam.io.gcp.tests.bigquery_matcher:Result of query is: [(2,), (0,), (3,), (1,)]
DEBUG:google.auth._default:Checking None for explicit credentials as part of auth process...
DEBUG:google.auth._default:Checking Cloud SDK credentials as part of auth process...
DEBUG:google.auth._default:Cloud SDK credentials not found on disk; not using them
DEBUG:google.auth._default:Checking for App Engine runtime as part of auth process...
DEBUG:google.auth._default:No App Engine library was found so cannot authentication via App
Engine Identity Credentials.
DEBUG:google.auth.transport._http_client:Making request: GET http://169.254.169.254
DEBUG:google.auth.transport._http_client:Making request: GET http://metadata.google.internal/computeMetadata/v1/project/project-id
DEBUG:urllib3.util.retry:Converted retries value: 3 -> Retry(total=3, connect=None, read=None,
redirect=None, status=None)
DEBUG:google.auth.transport.requests:Making request: GET http://metadata.google.internal/computeMetadata/v1/instance/service-accounts/default/?recursive=true
DEBUG:urllib3.connectionpool:Starting new HTTP connection (1): metadata.google.internal:80
DEBUG:urllib3.connectionpool:http://metadata.google.internal:80 "GET /computeMetadata/v1/instance/service-accounts/default/?recursive=true
HTTP/1.1" 200 144
DEBUG:google.auth.transport.requests:Making request: GET http://metadata.google.internal/computeMetadata/v1/instance/service-accounts/844138762903-compute@developer.gserviceaccount.com/token?scopes=https%3A%2F%2Fwww.googleapis.com%2Fauth%2Fbigquery%2Chttps%3A%2F%2Fwww.googleapis.com%2Fauth%2Fcloud-platform
DEBUG:urllib3.connectionpool:http://metadata.google.internal:80 "GET /computeMetadata/v1/instance/service-accounts/844138762903-compute@developer.gserviceaccount.com/token?scopes=https%3A%2F%2Fwww.googleapis.com%2Fauth%2Fbigquery%2Chttps%3A%2F%2Fwww.googleapis.com%2Fauth%2Fcloud-platform
HTTP/1.1" 200 241
DEBUG:urllib3.connectionpool:Starting new HTTPS connection (1): bigquery.googleapis.com:443
DEBUG:urllib3.connectionpool:https://bigquery.googleapis.com:443 "DELETE /bigquery/v2/projects/apache-beam-testing/datasets/python_pubsub_bq_16119478521601?deleteContents=true&prettyPrint=false
HTTP/1.1" 200 None
INFO:apache_beam.runners.dataflow.dataflow_runner:2021-01-29T19:34:44.063Z: JOB_MESSAGE_BASIC:
Finished operation Create/Read+metrics+map_to_common_key+GroupByKey/Reify+GroupByKey/Write
INFO:apache_beam.runners.dataflow.dataflow_runner:2021-01-29T19:34:44.127Z: JOB_MESSAGE_BASIC:
Executing operation GroupByKey/Close
INFO:apache_beam.runners.dataflow.dataflow_runner:2021-01-29T19:34:44.237Z: JOB_MESSAGE_BASIC:
Finished operation GroupByKey/Close
INFO:apache_beam.runners.dataflow.dataflow_runner:2021-01-29T19:34:44.299Z: JOB_MESSAGE_BASIC:
Executing operation GroupByKey/Read+GroupByKey/GroupByWindow+m_out
INFO:apache_beam.runners.dataflow.dataflow_runner:2021-01-29T19:34:53.393Z: JOB_MESSAGE_BASIC:
Finished operation GroupByKey/Read+GroupByKey/GroupByWindow+m_out
INFO:apache_beam.runners.dataflow.dataflow_runner:2021-01-29T19:34:53.449Z: JOB_MESSAGE_DEBUG:
Executing success step success11
INFO:apache_beam.runners.dataflow.dataflow_runner:2021-01-29T19:34:53.505Z: JOB_MESSAGE_DETAILED:
Cleaning up.
INFO:apache_beam.runners.dataflow.dataflow_runner:2021-01-29T19:34:53.547Z: JOB_MESSAGE_DEBUG:
Starting worker pool teardown.
INFO:apache_beam.runners.dataflow.dataflow_runner:2021-01-29T19:34:53.567Z: JOB_MESSAGE_BASIC:
Stopping worker pool...
INFO:apache_beam.runners.dataflow.dataflow_runner:2021-01-29T19:35:41.203Z: JOB_MESSAGE_DETAILED:
Autoscaling: Resized worker pool from 1 to 0.
INFO:apache_beam.runners.dataflow.dataflow_runner:2021-01-29T19:35:41.268Z: JOB_MESSAGE_BASIC:
Worker pool stopped.
INFO:apache_beam.runners.dataflow.dataflow_runner:2021-01-29T19:35:41.318Z: JOB_MESSAGE_DEBUG:
Tearing down pending resources...
INFO:apache_beam.runners.dataflow.dataflow_runner:Job 2021-01-29_11_28_43-6195930875967140800
is in state JOB_STATE_DONE
Worker logs: https://console.cloud.google.com/dataflow/jobs/us-central1/2021-01-29_10_21_29-16361473287604145462?project=apache-beam-testing
Worker logs: https://console.cloud.google.com/dataflow/jobs/us-central1/2021-01-29_10_35_24-607267746373008417?project=apache-beam-testing
Worker logs: https://console.cloud.google.com/dataflow/jobs/us-central1/2021-01-29_10_43_22-1634671690559748033?project=apache-beam-testing
Worker logs: https://console.cloud.google.com/dataflow/jobs/us-central1/2021-01-29_10_52_59-7902446946210858696?project=apache-beam-testing
Worker logs: https://console.cloud.google.com/dataflow/jobs/us-central1/2021-01-29_11_00_46-1582646588779434544?project=apache-beam-testing
Worker logs: https://console.cloud.google.com/dataflow/jobs/us-central1/2021-01-29_11_08_38-5130333725540218611?project=apache-beam-testing
Worker logs: https://console.cloud.google.com/dataflow/jobs/us-central1/2021-01-29_11_16_08-11912123648648512471?project=apache-beam-testing
Worker logs: https://console.cloud.google.com/dataflow/jobs/us-central1/2021-01-29_11_23_22-7595602105164691551?project=apache-beam-testing
Worker logs: https://console.cloud.google.com/dataflow/jobs/us-central1/2021-01-29_10_21_28-10320223540139077950?project=apache-beam-testing
Worker logs: https://console.cloud.google.com/dataflow/jobs/us-central1/2021-01-29_10_44_03-17342971049804806274?project=apache-beam-testing
Worker logs: https://console.cloud.google.com/dataflow/jobs/us-central1/2021-01-29_10_53_23-16539237880979141602?project=apache-beam-testing
Worker logs: https://console.cloud.google.com/dataflow/jobs/us-central1/2021-01-29_11_01_57-3905923102628668463?project=apache-beam-testing
Worker logs: https://console.cloud.google.com/dataflow/jobs/us-central1/2021-01-29_11_09_55-10356855159805078477?project=apache-beam-testing
Worker logs: https://console.cloud.google.com/dataflow/jobs/us-central1/2021-01-29_11_17_40-16625827766006411337?project=apache-beam-testing
Worker logs: https://console.cloud.google.com/dataflow/jobs/us-central1/2021-01-29_10_21_20-8798348024357491168?project=apache-beam-testing
Worker logs: https://console.cloud.google.com/dataflow/jobs/us-central1/2021-01-29_10_33_20-10197766601199752880?project=apache-beam-testing
Worker logs: https://console.cloud.google.com/dataflow/jobs/us-central1/2021-01-29_10_42_21-6390941330498100796?project=apache-beam-testing
Worker logs: https://console.cloud.google.com/dataflow/jobs/us-central1/2021-01-29_10_50_08-5446686468800817173?project=apache-beam-testing
Worker logs: https://console.cloud.google.com/dataflow/jobs/us-central1/2021-01-29_10_58_36-7867783037354051960?project=apache-beam-testing
Worker logs: https://console.cloud.google.com/dataflow/jobs/us-central1/2021-01-29_11_06_19-5533199859460525834?project=apache-beam-testing
Worker logs: https://console.cloud.google.com/dataflow/jobs/us-central1/2021-01-29_11_13_44-2368816545005521491?project=apache-beam-testing
Worker logs: https://console.cloud.google.com/dataflow/jobs/us-central1/2021-01-29_11_21_10-14110674164883406161?project=apache-beam-testing
Worker logs: https://console.cloud.google.com/dataflow/jobs/us-central1/2021-01-29_11_28_43-6195930875967140800?project=apache-beam-testing
Worker logs: https://console.cloud.google.com/dataflow/jobs/us-central1/2021-01-29_10_21_16-12056992368577992146?project=apache-beam-testing
Worker logs: https://console.cloud.google.com/dataflow/jobs/us-central1/2021-01-29_10_40_32-2453926013119643677?project=apache-beam-testing
Worker logs: https://console.cloud.google.com/dataflow/jobs/us-central1/2021-01-29_10_50_45-10399369940718138290?project=apache-beam-testing
Worker logs: https://console.cloud.google.com/dataflow/jobs/us-central1/2021-01-29_10_59_32-9354691831810780501?project=apache-beam-testing
Worker logs: https://console.cloud.google.com/dataflow/jobs/us-central1/2021-01-29_11_08_18-8476607007162558548?project=apache-beam-testing
Worker logs: https://console.cloud.google.com/dataflow/jobs/us-central1/2021-01-29_11_16_35-9281067788426600391?project=apache-beam-testing
Worker logs: https://console.cloud.google.com/dataflow/jobs/us-central1/2021-01-29_11_24_37-12993619654526501831?project=apache-beam-testing
Worker logs: https://console.cloud.google.com/dataflow/jobs/us-central1/2021-01-29_10_28_29-6431533360504407172?project=apache-beam-testing
Worker logs: https://console.cloud.google.com/dataflow/jobs/us-central1/2021-01-29_10_37_53-9656158577688905986?project=apache-beam-testing
Worker logs: https://console.cloud.google.com/dataflow/jobs/us-central1/2021-01-29_10_45_14-6748591173335718936?project=apache-beam-testing
Worker logs: https://console.cloud.google.com/dataflow/jobs/us-central1/2021-01-29_10_53_04-1473215801959468459?project=apache-beam-testing
Worker logs: https://console.cloud.google.com/dataflow/jobs/us-central1/2021-01-29_11_01_07-2604701612043741246?project=apache-beam-testing
Worker logs: https://console.cloud.google.com/dataflow/jobs/us-central1/2021-01-29_11_09_00-5793946405094525228?project=apache-beam-testing
Worker logs: https://console.cloud.google.com/dataflow/jobs/us-central1/2021-01-29_11_17_14-5281600599805999558?project=apache-beam-testing
Worker logs: https://console.cloud.google.com/dataflow/jobs/us-central1/2021-01-29_11_25_34-18011921838230736594?project=apache-beam-testing
Worker logs: https://console.cloud.google.com/dataflow/jobs/us-central1/2021-01-29_10_21_22-10508271417426771518?project=apache-beam-testing
Worker logs: https://console.cloud.google.com/dataflow/jobs/us-central1/2021-01-29_10_29_51-807588851801789567?project=apache-beam-testing
Worker logs: https://console.cloud.google.com/dataflow/jobs/us-central1/2021-01-29_10_40_05-12449478584469314332?project=apache-beam-testing
Worker logs: https://console.cloud.google.com/dataflow/jobs/us-central1/2021-01-29_10_50_21-15839805670537470162?project=apache-beam-testing
Worker logs: https://console.cloud.google.com/dataflow/jobs/us-central1/2021-01-29_10_59_17-16601765058992966729?project=apache-beam-testing
Worker logs: https://console.cloud.google.com/dataflow/jobs/us-central1/2021-01-29_11_08_04-8252102662634550956?project=apache-beam-testing
Worker logs: https://console.cloud.google.com/dataflow/jobs/us-central1/2021-01-29_11_14_32-1728361290997753987?project=apache-beam-testing
Worker logs: https://console.cloud.google.com/dataflow/jobs/us-central1/2021-01-29_11_21_04-15405663838572520935?project=apache-beam-testing
Worker logs: https://console.cloud.google.com/dataflow/jobs/us-central1/2021-01-29_10_21_28-7572926315233008546?project=apache-beam-testing
Worker logs: https://console.cloud.google.com/dataflow/jobs/us-central1/2021-01-29_10_30_02-4688271933459125155?project=apache-beam-testing
Worker logs: https://console.cloud.google.com/dataflow/jobs/us-central1/2021-01-29_10_38_11-9788947273783472719?project=apache-beam-testing
Worker logs: https://console.cloud.google.com/dataflow/jobs/us-central1/2021-01-29_10_45_28-6273786340145090230?project=apache-beam-testing
Worker logs: https://console.cloud.google.com/dataflow/jobs/us-central1/2021-01-29_10_53_15-15871117818807924009?project=apache-beam-testing
Worker logs: https://console.cloud.google.com/dataflow/jobs/us-central1/2021-01-29_11_01_15-6561948551474656239?project=apache-beam-testing
Worker logs: https://console.cloud.google.com/dataflow/jobs/us-central1/2021-01-29_11_17_43-12862427053147499042?project=apache-beam-testing
Worker logs: https://console.cloud.google.com/dataflow/jobs/us-central1/2021-01-29_10_21_18-7743474619717231725?project=apache-beam-testing
Worker logs: https://console.cloud.google.com/dataflow/jobs/us-central1/2021-01-29_10_30_28-14189172611845332222?project=apache-beam-testing
Worker logs: https://console.cloud.google.com/dataflow/jobs/us-central1/2021-01-29_10_39_34-8862729273901722977?project=apache-beam-testing
Worker logs: https://console.cloud.google.com/dataflow/jobs/us-central1/2021-01-29_10_48_13-2811449860429876538?project=apache-beam-testing
Worker logs: https://console.cloud.google.com/dataflow/jobs/us-central1/2021-01-29_10_56_59-9564483982286371075?project=apache-beam-testing
Worker logs: https://console.cloud.google.com/dataflow/jobs/us-central1/2021-01-29_11_08_00-4404364837076743846?project=apache-beam-testing
Worker logs: https://console.cloud.google.com/dataflow/jobs/us-central1/2021-01-29_11_15_48-6472384315469191274?project=apache-beam-testing
Worker logs: https://console.cloud.google.com/dataflow/jobs/us-central1/2021-01-29_11_24_30-3661319820342267244?project=apache-beam-testing
test_autocomplete_it (apache_beam.examples.complete.autocomplete_test.AutocompleteTest) ...
ok
test_bigquery_tornadoes_it (apache_beam.examples.cookbook.bigquery_tornadoes_it_test.BigqueryTornadoesIT)
... ok
test_streaming_wordcount_debugging_it (apache_beam.examples.streaming_wordcount_debugging_it_test.StreamingWordcountDebuggingIT)
... SKIP: Skipped due to [BEAM-3377]: assert_that not working for streaming
test_datastore_wordcount_it (apache_beam.examples.cookbook.datastore_wordcount_it_test.DatastoreWordCountIT)
... ok
test_leader_board_it (apache_beam.examples.complete.game.leader_board_it_test.LeaderBoardIT)
... ok
test_game_stats_it (apache_beam.examples.complete.game.game_stats_it_test.GameStatsIT) ...
ok
test_run_example_with_setup_file (apache_beam.examples.complete.juliaset.juliaset.juliaset_test_it.JuliaSetTestIT)
... ok
test_streaming_wordcount_it (apache_beam.examples.streaming_wordcount_it_test.StreamingWordCountIT)
... ok
test_wordcount_fnapi_it (apache_beam.examples.wordcount_it_test.WordCountIT) ... ok
test_user_score_it (apache_beam.examples.complete.game.user_score_it_test.UserScoreIT) ...
ok
test_wordcount_it (apache_beam.examples.wordcount_it_test.WordCountIT) ... ok
test_hourly_team_score_it (apache_beam.examples.complete.game.hourly_team_score_it_test.HourlyTeamScoreIT)
... ok
test_avro_it (apache_beam.examples.fastavro_it_test.FastavroIT) ... ok
test_read_via_sql (apache_beam.io.gcp.experimental.spannerio_read_it_test.SpannerReadIntegrationTest)
... ok
test_read_via_table (apache_beam.io.gcp.experimental.spannerio_read_it_test.SpannerReadIntegrationTest)
... ok
test_read_queries (apache_beam.io.gcp.bigquery_read_it_test.ReadAllBQTests) ... ok
test_bigquery_read_1M_python (apache_beam.io.gcp.bigquery_io_read_it_test.BigqueryIOReadIT)
... ok
test_bigquery_read_custom_1M_python (apache_beam.io.gcp.bigquery_io_read_it_test.BigqueryIOReadIT)
... ok
test_bqfl_streaming (apache_beam.io.gcp.bigquery_file_loads_test.BigQueryFileLoadsIT) ...
SKIP: TestStream is not supported on TestDataflowRunner
test_multiple_destinations_transform (apache_beam.io.gcp.bigquery_file_loads_test.BigQueryFileLoadsIT)
... ok
test_one_job_fails_all_jobs_fail (apache_beam.io.gcp.bigquery_file_loads_test.BigQueryFileLoadsIT)
... ok
test_spanner_error (apache_beam.io.gcp.experimental.spannerio_write_it_test.SpannerWriteIntegrationTest)
... ok
test_spanner_update (apache_beam.io.gcp.experimental.spannerio_write_it_test.SpannerWriteIntegrationTest)
... ok
test_write_batches (apache_beam.io.gcp.experimental.spannerio_write_it_test.SpannerWriteIntegrationTest)
... ok
test_avro_file_load (apache_beam.io.gcp.bigquery_test.BigQueryFileLoadsIntegrationTests) ...
ok
test_multiple_destinations_transform (apache_beam.io.gcp.bigquery_test.BigQueryStreamingInsertTransformIntegrationTests)
... ok
test_iobase_source (apache_beam.io.gcp.bigquery_read_it_test.ReadNewTypesTests) ... ok
test_native_source (apache_beam.io.gcp.bigquery_read_it_test.ReadNewTypesTests) ... ok
test_copy (apache_beam.io.gcp.gcsio_integration_test.GcsIOIntegrationTest) ... ok
test_copy_batch (apache_beam.io.gcp.gcsio_integration_test.GcsIOIntegrationTest) ... ok
test_copy_batch_kms (apache_beam.io.gcp.gcsio_integration_test.GcsIOIntegrationTest) ... ok
test_copy_batch_rewrite_token (apache_beam.io.gcp.gcsio_integration_test.GcsIOIntegrationTest)
... ok
test_copy_kms (apache_beam.io.gcp.gcsio_integration_test.GcsIOIntegrationTest) ... ok
test_copy_rewrite_token (apache_beam.io.gcp.gcsio_integration_test.GcsIOIntegrationTest) ...
ok
test_value_provider_transform (apache_beam.io.gcp.bigquery_test.BigQueryStreamingInsertTransformIntegrationTests)
... ok
test_iobase_source (apache_beam.io.gcp.bigquery_read_it_test.ReadTests) ... ok
test_native_source (apache_beam.io.gcp.bigquery_read_it_test.ReadTests) ... ok
test_datastore_write_limit (apache_beam.io.gcp.datastore.v1new.datastore_write_it_test.DatastoreWriteIT)
... ok
test_transform_on_gcs (apache_beam.io.fileio_test.MatchIntegrationTest) ... ok
test_parquetio_it (apache_beam.io.parquetio_it_test.TestParquetIT) ... ok
test_streaming_data_only (apache_beam.io.gcp.pubsub_integration_test.PubSubIntegrationTest)
... ok
test_streaming_with_attributes (apache_beam.io.gcp.pubsub_integration_test.PubSubIntegrationTest)
... ok
test_dicom_search_instances (apache_beam.io.gcp.dicomio_integration_test.DICOMIoIntegrationTest)
... ok
test_dicom_store_instance_from_gcs (apache_beam.io.gcp.dicomio_integration_test.DICOMIoIntegrationTest)
... ok
test_analyzing_syntax (apache_beam.ml.gcp.naturallanguageml_test_it.NaturalLanguageMlTestIT)
... ok
test_label_detection_with_video_context (apache_beam.ml.gcp.videointelligenceml_test_it.VideoIntelligenceMlTestIT)
... ok
test_big_query_write (apache_beam.io.gcp.bigquery_write_it_test.BigQueryWriteIntegrationTests)
... ok
test_big_query_write_new_types (apache_beam.io.gcp.bigquery_write_it_test.BigQueryWriteIntegrationTests)
... ok
test_big_query_write_schema_autodetect (apache_beam.io.gcp.bigquery_write_it_test.BigQueryWriteIntegrationTests)
... SKIP: DataflowRunner does not support schema autodetection
test_big_query_write_without_schema (apache_beam.io.gcp.bigquery_write_it_test.BigQueryWriteIntegrationTests)
... ok
test_basic_execution (apache_beam.testing.test_stream_it_test.TestStreamIntegrationTests)
... SKIP: The "TestDataflowRunner", does not support the TestStream transform. Supported runners:
['DirectRunner', 'SwitchingDirectRunner']
Tests that the TestStream supports emitting to multiple PCollections. ... SKIP: The "TestDataflowRunner",
does not support the TestStream transform. Supported runners: ['DirectRunner', 'SwitchingDirectRunner']
Tests that the TestStream can independently control output watermarks. ... SKIP: The "TestDataflowRunner",
does not support the TestStream transform. Supported runners: ['DirectRunner', 'SwitchingDirectRunner']
test_text_detection_with_language_hint (apache_beam.ml.gcp.visionml_test_it.VisionMlTestIT)
... ok
test_deidentification (apache_beam.ml.gcp.cloud_dlp_it_test.CloudDLPIT) ... ok
test_inspection (apache_beam.ml.gcp.cloud_dlp_it_test.CloudDLPIT) ... ok
Runs streaming Dataflow job and verifies that user metrics are reported ... ok
test_big_query_legacy_sql (apache_beam.io.gcp.big_query_query_to_table_it_test.BigQueryQueryToTableIT)
... ok
test_big_query_new_types (apache_beam.io.gcp.big_query_query_to_table_it_test.BigQueryQueryToTableIT)
... ok
test_big_query_new_types_avro (apache_beam.io.gcp.big_query_query_to_table_it_test.BigQueryQueryToTableIT)
... ok
test_big_query_new_types_native (apache_beam.io.gcp.big_query_query_to_table_it_test.BigQueryQueryToTableIT)
... ok
test_big_query_standard_sql (apache_beam.io.gcp.big_query_query_to_table_it_test.BigQueryQueryToTableIT)
... ok
test_big_query_standard_sql_kms_key_native (apache_beam.io.gcp.big_query_query_to_table_it_test.BigQueryQueryToTableIT)
... ok
test_job_python_from_python_it (apache_beam.transforms.external_it_test.ExternalTransformIT)
... ok
test_file_loads (apache_beam.io.gcp.bigquery_test.PubSubBigQueryIT) ... ok
test_streaming_inserts (apache_beam.io.gcp.bigquery_test.PubSubBigQueryIT) ... ok
test_metrics_fnapi_it (apache_beam.runners.dataflow.dataflow_exercise_metrics_pipeline_test.ExerciseMetricsPipelineTest)
... ok
test_metrics_it (apache_beam.runners.dataflow.dataflow_exercise_metrics_pipeline_test.ExerciseMetricsPipelineTest)
... ok

----------------------------------------------------------------------
XML: nosetests-postCommitIT-df-py37.xml
----------------------------------------------------------------------
XML: <https://ci-beam.apache.org/job/beam_PostCommit_Python37/ws/src/sdks/python/nosetests.xml>
----------------------------------------------------------------------
Ran 68 tests in 4552.066s

OK (SKIP=6)

FAILURE: Build failed with an exception.

* Where:
Script '<https://ci-beam.apache.org/job/beam_PostCommit_Python37/ws/src/sdks/python/test-suites/portable/common.gradle'>
line: 197

* What went wrong:
Execution failed for task ':sdks:python:test-suites:portable:py37:postCommitPy37IT'.
> Process 'command 'sh'' finished with non-zero exit value 1

* Try:
Run with --stacktrace option to get the stack trace. Run with --info or --debug option to
get more log output. Run with --scan to get full insights.

* Get more help at https://help.gradle.org

Deprecated Gradle features were used in this build, making it incompatible with Gradle 7.0.
Use '--warning-mode all' to show the individual deprecation warnings.
See https://docs.gradle.org/6.8/userguide/command_line_interface.html#sec:command_line_warnings

BUILD FAILED in 1h 35m 24s
216 actionable tasks: 176 executed, 36 from cache, 4 up-to-date
Gradle was unable to watch the file system for changes. The inotify watches limit is too low.

Publishing build scan...
https://gradle.com/s/dabutr4lp3k5s

Build step 'Invoke Gradle script' changed build result to FAILURE
Build step 'Invoke Gradle script' marked build as failure

---------------------------------------------------------------------
To unsubscribe, e-mail: builds-unsubscribe@beam.apache.org
For additional commands, e-mail: builds-help@beam.apache.org


Mime
View raw message