beam-builds mailing list archives

Site index · List index
Message view « Date » · « Thread »
Top « Date » · « Thread »
From Apache Jenkins Server <jenk...@builds.apache.org>
Subject Build failed in Jenkins: beam_PostCommit_XVR_Dataflow #225
Date Fri, 08 Jan 2021 01:08:41 GMT
See <https://ci-beam.apache.org/job/beam_PostCommit_XVR_Dataflow/225/display/redirect?page=changes>

Changes:

[dcavazos] [BEAM-10983] Add getting started from Spark page

[dcavazos] Add "From Apache Spark" entry to side menu

[dcavazos] Add links to transform catalog

[dcavazos] Add more links

[dcavazos] Add RDD/DataFrame clarification

[dcavazos] Add link to from-spark page

[dcavazos] Added extra explanations

[dcavazos] Fixed typos + removed italics

[Kyle Weaver] [BEAM-11504] Clean up direct runner parallelism section.

[Robert Bradshaw] [BEAM-1833] Give transforms more control over the names of their inputs

[Ismaël Mejía] [BEAM-11419] Update Flink supported versions in the website

[noreply] Clarify some assertions (#13515)

[Robert Bradshaw] mypy

[noreply] Revert "[BEAM-11474] Track transform processing thread in Java SDK


------------------------------------------
[...truncated 3.59 MB...]
        "output_info": [
          {
            "encoding": {
              "@type": "kind:windowed_value",
              "component_encodings": [
                {
                  "@type": "FastPrimitivesCoder$eNprYE5OLEhMzkiNT0pNzNVLzk9JLSqGUlxuicUlAUWZuZklmWWpxc4gQa5CBs3GQsbaQqYIfgYGhvi0xJycpMTk7HiwlkJ8pgVkJmfnpEJNYQGawlpbyJZUnKQHACYlLgM=",
                  "component_encodings": [
                    {
                      "@type": "FastPrimitivesCoder$eNprYE5OLEhMzkiNT0pNzNVLzk9JLSqGUlxuicUlAUWZuZklmWWpxc4gQa5CBs3GQsbaQqYIfgYGhvi0xJycpMTk7HiwlkJ8pgVkJmfnpEJNYQGawlpbyJZUnKQHACYlLgM=",
                      "component_encodings": [],
                      "pipeline_proto_coder_id": "ref_Coder_FastPrimitivesCoder_5"
                    },
                    {
                      "@type": "FastPrimitivesCoder$eNprYE5OLEhMzkiNT0pNzNVLzk9JLSqGUlxuicUlAUWZuZklmWWpxc4gQa5CBs3GQsbaQqYIfgYGhvi0xJycpMTk7HiwlkJ8pgVkJmfnpEJNYQGawlpbyJZUnKQHACYlLgM=",
                      "component_encodings": [],
                      "pipeline_proto_coder_id": "ref_Coder_FastPrimitivesCoder_5"
                    }
                  ],
                  "is_pair_like": true,
                  "pipeline_proto_coder_id": "ref_Coder_FastPrimitivesCoder_5"
                },
                {
                  "@type": "kind:global_window"
                }
              ],
              "is_wrapper": true
            },
            "output_name": "None",
            "user_name": "assert_that/Match.out"
          }
        ],
        "parallel_input": {
          "@type": "OutputReference",
          "output_name": "None",
          "step_name": "s12"
        },
        "serialized_fn": "ref_AppliedPTransform_assert_that/Match_18",
        "user_name": "assert_that/Match"
      }
    }
  ],
  "type": "JOB_TYPE_BATCH"
}
INFO:apache_beam.runners.dataflow.dataflow_runner:2021-01-08T01:05:48.851Z: JOB_MESSAGE_DETAILED:
Autoscaling: Resized worker pool from 1 to 0.
INFO:apache_beam.runners.dataflow.dataflow_runner:2021-01-08T01:05:48.881Z: JOB_MESSAGE_BASIC:
Worker pool stopped.
INFO:apache_beam.runners.dataflow.dataflow_runner:2021-01-08T01:05:48.908Z: JOB_MESSAGE_DEBUG:
Tearing down pending resources...
INFO:apache_beam.runners.dataflow.dataflow_runner:2021-01-08T01:05:50.712Z: JOB_MESSAGE_DETAILED:
Autoscaling: Resized worker pool from 1 to 0.
INFO:apache_beam.runners.dataflow.dataflow_runner:2021-01-08T01:05:50.782Z: JOB_MESSAGE_BASIC:
Worker pool stopped.
INFO:apache_beam.runners.dataflow.dataflow_runner:2021-01-08T01:05:50.810Z: JOB_MESSAGE_DEBUG:
Tearing down pending resources...
INFO:apache_beam.runners.dataflow.internal.apiclient:Create job: <Job
 createTime: '2021-01-08T01:05:51.806611Z'
 currentStateTime: '1970-01-01T00:00:00Z'
 id: '2021-01-07_17_05_49-15599206393935208759'
 location: 'us-central1'
 name: 'beamapp-jenkins-0108010539-890251'
 projectId: 'apache-beam-testing'
 stageStates: []
 startTime: '2021-01-08T01:05:51.806611Z'
 steps: []
 tempFiles: []
 type: TypeValueValuesEnum(JOB_TYPE_BATCH, 1)>
INFO:apache_beam.runners.dataflow.internal.apiclient:Created job with id: [2021-01-07_17_05_49-15599206393935208759]
INFO:apache_beam.runners.dataflow.internal.apiclient:Submitted job: 2021-01-07_17_05_49-15599206393935208759
INFO:apache_beam.runners.dataflow.internal.apiclient:To access the Dataflow monitoring console,
please navigate to https://console.cloud.google.com/dataflow/jobs/us-central1/2021-01-07_17_05_49-15599206393935208759?project=apache-beam-testing
INFO:apache_beam.runners.dataflow.dataflow_runner:2021-01-08T01:05:51.196Z: JOB_MESSAGE_DETAILED:
Autoscaling: Resized worker pool from 1 to 0.
INFO:apache_beam.runners.dataflow.dataflow_runner:2021-01-08T01:05:51.241Z: JOB_MESSAGE_BASIC:
Worker pool stopped.
INFO:apache_beam.runners.dataflow.dataflow_runner:2021-01-08T01:05:51.268Z: JOB_MESSAGE_DEBUG:
Tearing down pending resources...
INFO:apache_beam.runners.dataflow.dataflow_runner:2021-01-08T01:05:56.571Z: JOB_MESSAGE_DETAILED:
Autoscaling: Resized worker pool from 1 to 0.
INFO:apache_beam.runners.dataflow.dataflow_runner:2021-01-08T01:05:56.622Z: JOB_MESSAGE_BASIC:
Worker pool stopped.
INFO:apache_beam.runners.dataflow.dataflow_runner:2021-01-08T01:05:56.653Z: JOB_MESSAGE_DEBUG:
Tearing down pending resources...
INFO:apache_beam.runners.dataflow.dataflow_runner:Job 2021-01-07_16_58_13-13491583988129473732
is in state JOB_STATE_DONE
INFO:apache_beam.runners.dataflow.dataflow_runner:Job 2021-01-07_16_58_10-14489960511497949029
is in state JOB_STATE_DONE
INFO:apache_beam.runners.dataflow.dataflow_runner:Job 2021-01-07_17_05_49-15599206393935208759
is in state JOB_STATE_RUNNING
INFO:apache_beam.runners.dataflow.dataflow_runner:Job 2021-01-07_16_58_13-5278811414977099236
is in state JOB_STATE_DONE
INFO:apache_beam.runners.dataflow.dataflow_runner:Job 2021-01-07_16_58_11-952734670816842096
is in state JOB_STATE_DONE
INFO:apache_beam.runners.dataflow.dataflow_runner:2021-01-08T01:05:49.939Z: JOB_MESSAGE_DETAILED:
Autoscaling was automatically enabled for job 2021-01-07_17_05_49-15599206393935208759.
INFO:apache_beam.runners.dataflow.dataflow_runner:2021-01-08T01:05:49.939Z: JOB_MESSAGE_DETAILED:
Autoscaling is enabled for job 2021-01-07_17_05_49-15599206393935208759. The number of workers
will be between 1 and 1000.
INFO:apache_beam.runners.dataflow.dataflow_runner:2021-01-08T01:05:57.297Z: JOB_MESSAGE_BASIC:
Worker configuration: n1-standard-1 in us-central1-f.
INFO:apache_beam.runners.dataflow.dataflow_runner:2021-01-08T01:05:57.976Z: JOB_MESSAGE_DETAILED:
Expanding SplittableParDo operations into optimizable parts.
INFO:apache_beam.runners.dataflow.dataflow_runner:2021-01-08T01:05:58.007Z: JOB_MESSAGE_DETAILED:
Expanding CollectionToSingleton operations into optimizable parts.
INFO:apache_beam.runners.dataflow.dataflow_runner:2021-01-08T01:05:58.264Z: JOB_MESSAGE_DETAILED:
Expanding CoGroupByKey operations into optimizable parts.
INFO:apache_beam.runners.dataflow.dataflow_runner:2021-01-08T01:05:58.301Z: JOB_MESSAGE_DEBUG:
Combiner lifting skipped for step assert_that/Group/GroupByKey: GroupByKey not followed by
a combiner.
INFO:apache_beam.runners.dataflow.dataflow_runner:2021-01-08T01:05:58.359Z: JOB_MESSAGE_DETAILED:
Expanding GroupByKey operations into optimizable parts.
INFO:apache_beam.runners.dataflow.dataflow_runner:2021-01-08T01:05:58.398Z: JOB_MESSAGE_DEBUG:
Annotating graph with Autotuner information.
INFO:apache_beam.runners.dataflow.dataflow_runner:2021-01-08T01:05:58.437Z: JOB_MESSAGE_DETAILED:
Fusing adjacent ParDo, Read, Write, and Flatten operations
INFO:apache_beam.runners.dataflow.dataflow_runner:2021-01-08T01:05:58.472Z: JOB_MESSAGE_DEBUG:
Inserted coder converter after flatten ref_AppliedPTransform_assert_that/Group/Flatten_14
INFO:apache_beam.runners.dataflow.dataflow_runner:2021-01-08T01:05:58.506Z: JOB_MESSAGE_DETAILED:
Unzipping flatten ref_AppliedPTransform_assert_that/Group/Flatten_14 for input ref_AppliedPTransform_assert_that/Group/pair_with_0_12.None
INFO:apache_beam.runners.dataflow.dataflow_runner:2021-01-08T01:05:58.535Z: JOB_MESSAGE_DETAILED:
Fusing unzipped copy of assert_that/Group/Flatten/OutputIdentity, through flatten assert_that/Group/Flatten,
into producer assert_that/Group/pair_with_0
INFO:apache_beam.runners.dataflow.dataflow_runner:2021-01-08T01:05:58.564Z: JOB_MESSAGE_DETAILED:
Fusing consumer assert_that/Group/Map(_merge_tagged_vals_under_key) into assert_that/Group/GroupByKey/Read
INFO:apache_beam.runners.dataflow.dataflow_runner:2021-01-08T01:05:58.587Z: JOB_MESSAGE_DETAILED:
Fusing consumer assert_that/Unkey into assert_that/Group/Map(_merge_tagged_vals_under_key)
INFO:apache_beam.runners.dataflow.dataflow_runner:2021-01-08T01:05:58.617Z: JOB_MESSAGE_DETAILED:
Fusing consumer assert_that/Match into assert_that/Unkey
INFO:apache_beam.runners.dataflow.dataflow_runner:2021-01-08T01:05:58.643Z: JOB_MESSAGE_DETAILED:
Unzipping flatten ref_AppliedPTransform_assert_that/Group/Flatten_14-u17 for input ref_AppliedPTransform_assert_that/Group/Flatten_14.None-c15
INFO:apache_beam.runners.dataflow.dataflow_runner:2021-01-08T01:05:58.671Z: JOB_MESSAGE_DETAILED:
Fusing unzipped copy of assert_that/Group/GroupByKey/Write, through flatten assert_that/Group/Flatten/Unzipped-1,
into producer assert_that/Group/Flatten/OutputIdentity
INFO:apache_beam.runners.dataflow.dataflow_runner:2021-01-08T01:05:58.693Z: JOB_MESSAGE_DETAILED:
Fusing consumer assert_that/Group/Flatten/OutputIdentity into assert_that/Group/pair_with_1
INFO:apache_beam.runners.dataflow.dataflow_runner:2021-01-08T01:05:58.716Z: JOB_MESSAGE_DETAILED:
Fusing consumer assert_that/Group/GroupByKey/Write into assert_that/Group/Flatten/OutputIdentity
INFO:apache_beam.runners.dataflow.dataflow_runner:2021-01-08T01:05:58.736Z: JOB_MESSAGE_DETAILED:
Fusing consumer SqlTransform(beam:external:java:sql:v1)/BeamValuesRel_13/Create.Values/Read(CreateSource)/ParDo(OutputSingleSource)/ParMultiDo(OutputSingleSource)
into SqlTransform(beam:external:java:sql:v1)/BeamValuesRel_13/Create.Values/Read(CreateSource)/Impulse
INFO:apache_beam.runners.dataflow.dataflow_runner:2021-01-08T01:05:58.762Z: JOB_MESSAGE_DETAILED:
Fusing consumer external_2SqlTransform(beam:external:java:sql:v1)/BeamValuesRel_13/Create.Values/Read(CreateSource)/ParDo(BoundedSourceAsSDFWrapper)/ParMultiDo(BoundedSourceAsSDFWrapper)/PairWithRestriction
into SqlTransform(beam:external:java:sql:v1)/BeamValuesRel_13/Create.Values/Read(CreateSource)/ParDo(OutputSingleSource)/ParMultiDo(OutputSingleSource)
INFO:apache_beam.runners.dataflow.dataflow_runner:2021-01-08T01:05:58.797Z: JOB_MESSAGE_DETAILED:
Fusing consumer external_2SqlTransform(beam:external:java:sql:v1)/BeamValuesRel_13/Create.Values/Read(CreateSource)/ParDo(BoundedSourceAsSDFWrapper)/ParMultiDo(BoundedSourceAsSDFWrapper)/SplitWithSizing
into external_2SqlTransform(beam:external:java:sql:v1)/BeamValuesRel_13/Create.Values/Read(CreateSource)/ParDo(BoundedSourceAsSDFWrapper)/ParMultiDo(BoundedSourceAsSDFWrapper)/PairWithRestriction
INFO:apache_beam.runners.dataflow.dataflow_runner:2021-01-08T01:05:58.842Z: JOB_MESSAGE_DETAILED:
Fusing consumer SqlTransform(beam:external:java:sql:v1)/BeamZetaSqlCalcRel_17/ParDo(Calc)/ParMultiDo(Calc)
into external_2SqlTransform(beam:external:java:sql:v1)/BeamValuesRel_13/Create.Values/Read(CreateSource)/ParDo(BoundedSourceAsSDFWrapper)/ParMultiDo(BoundedSourceAsSDFWrapper)/ProcessElementAndRestrictionWithSizing
INFO:apache_beam.runners.dataflow.dataflow_runner:2021-01-08T01:05:58.883Z: JOB_MESSAGE_DETAILED:
Fusing consumer assert_that/WindowInto(WindowIntoFn) into SqlTransform(beam:external:java:sql:v1)/BeamZetaSqlCalcRel_17/ParDo(Calc)/ParMultiDo(Calc)
INFO:apache_beam.runners.dataflow.dataflow_runner:2021-01-08T01:05:58.910Z: JOB_MESSAGE_DETAILED:
Fusing consumer assert_that/Create/FlatMap(<lambda at core.py:2957>) into assert_that/Create/Impulse
INFO:apache_beam.runners.dataflow.dataflow_runner:2021-01-08T01:05:58.943Z: JOB_MESSAGE_DETAILED:
Fusing consumer assert_that/Create/Map(decode) into assert_that/Create/FlatMap(<lambda
at core.py:2957>)
INFO:apache_beam.runners.dataflow.dataflow_runner:2021-01-08T01:05:58.968Z: JOB_MESSAGE_DETAILED:
Fusing consumer assert_that/Group/pair_with_0 into assert_that/Create/Map(decode)
INFO:apache_beam.runners.dataflow.dataflow_runner:2021-01-08T01:05:58.997Z: JOB_MESSAGE_DETAILED:
Fusing consumer assert_that/ToVoidKey into assert_that/WindowInto(WindowIntoFn)
INFO:apache_beam.runners.dataflow.dataflow_runner:2021-01-08T01:05:59.020Z: JOB_MESSAGE_DETAILED:
Fusing consumer assert_that/Group/pair_with_1 into assert_that/ToVoidKey
INFO:apache_beam.runners.dataflow.dataflow_runner:2021-01-08T01:05:59.055Z: JOB_MESSAGE_DEBUG:
Workflow config is missing a default resource spec.
INFO:apache_beam.runners.dataflow.dataflow_runner:2021-01-08T01:05:59.094Z: JOB_MESSAGE_DEBUG:
Adding StepResource setup and teardown to workflow graph.
INFO:apache_beam.runners.dataflow.dataflow_runner:2021-01-08T01:05:59.122Z: JOB_MESSAGE_DEBUG:
Adding workflow start and stop steps.
INFO:apache_beam.runners.dataflow.dataflow_runner:2021-01-08T01:05:59.155Z: JOB_MESSAGE_DEBUG:
Assigning stage ids.
INFO:apache_beam.runners.dataflow.dataflow_runner:2021-01-08T01:05:59.390Z: JOB_MESSAGE_DEBUG:
Executing wait step start26
INFO:apache_beam.runners.dataflow.dataflow_runner:2021-01-08T01:05:59.448Z: JOB_MESSAGE_BASIC:
Executing operation SqlTransform(beam:external:java:sql:v1)/BeamValuesRel_13/Create.Values/Read(CreateSource)/Impulse+SqlTransform(beam:external:java:sql:v1)/BeamValuesRel_13/Create.Values/Read(CreateSource)/ParDo(OutputSingleSource)/ParMultiDo(OutputSingleSource)+external_2SqlTransform(beam:external:java:sql:v1)/BeamValuesRel_13/Create.Values/Read(CreateSource)/ParDo(BoundedSourceAsSDFWrapper)/ParMultiDo(BoundedSourceAsSDFWrapper)/PairWithRestriction+external_2SqlTransform(beam:external:java:sql:v1)/BeamValuesRel_13/Create.Values/Read(CreateSource)/ParDo(BoundedSourceAsSDFWrapper)/ParMultiDo(BoundedSourceAsSDFWrapper)/SplitWithSizing
INFO:apache_beam.runners.dataflow.dataflow_runner:2021-01-08T01:05:59.469Z: JOB_MESSAGE_BASIC:
Executing operation assert_that/Group/GroupByKey/Create
INFO:apache_beam.runners.dataflow.dataflow_runner:2021-01-08T01:05:59.493Z: JOB_MESSAGE_DEBUG:
Starting worker pool setup.
INFO:apache_beam.runners.dataflow.dataflow_runner:2021-01-08T01:05:59.524Z: JOB_MESSAGE_BASIC:
Starting 1 workers in us-central1-f...
INFO:apache_beam.runners.dataflow.dataflow_runner:2021-01-08T01:05:59.587Z: JOB_MESSAGE_BASIC:
Finished operation assert_that/Group/GroupByKey/Create
INFO:apache_beam.runners.dataflow.dataflow_runner:2021-01-08T01:05:59.658Z: JOB_MESSAGE_DEBUG:
Value "assert_that/Group/GroupByKey/Session" materialized.
INFO:apache_beam.runners.dataflow.dataflow_runner:2021-01-08T01:05:59.728Z: JOB_MESSAGE_BASIC:
Executing operation assert_that/Create/Impulse+assert_that/Create/FlatMap(<lambda at core.py:2957>)+assert_that/Create/Map(decode)+assert_that/Group/pair_with_0+assert_that/Group/Flatten/OutputIdentity+assert_that/Group/GroupByKey/Write
INFO:apache_beam.runners.dataflow.dataflow_runner:2021-01-08T01:06:07.414Z: JOB_MESSAGE_BASIC:
Your project already contains 100 Dataflow-created metric descriptors, so new user metrics
of the form custom.googleapis.com/* will not be created. However, all user metrics are also
available in the metric dataflow.googleapis.com/job/user_counter. If you rely on the custom
metrics, you can delete old / unused metric descriptors. See https://developers.google.com/apis-explorer/#p/monitoring/v3/monitoring.projects.metricDescriptors.list
and https://developers.google.com/apis-explorer/#p/monitoring/v3/monitoring.projects.metricDescriptors.delete
INFO:apache_beam.runners.dataflow.dataflow_runner:2021-01-08T01:06:06.549Z: JOB_MESSAGE_DETAILED:
Autoscaling: Resized worker pool from 1 to 0.
INFO:apache_beam.runners.dataflow.dataflow_runner:2021-01-08T01:06:06.598Z: JOB_MESSAGE_BASIC:
Worker pool stopped.
INFO:apache_beam.runners.dataflow.dataflow_runner:2021-01-08T01:06:06.635Z: JOB_MESSAGE_DEBUG:
Tearing down pending resources...
INFO:apache_beam.runners.dataflow.dataflow_runner:2021-01-08T01:06:12.876Z: JOB_MESSAGE_DETAILED:
Autoscaling: Resized worker pool from 1 to 0.
INFO:apache_beam.runners.dataflow.dataflow_runner:2021-01-08T01:06:12.908Z: JOB_MESSAGE_BASIC:
Worker pool stopped.
INFO:apache_beam.runners.dataflow.dataflow_runner:2021-01-08T01:06:12.953Z: JOB_MESSAGE_DEBUG:
Tearing down pending resources...
INFO:apache_beam.runners.dataflow.dataflow_runner:Job 2021-01-07_16_58_11-7041659671192235545
is in state JOB_STATE_DONE
INFO:apache_beam.runners.dataflow.dataflow_runner:Job 2021-01-07_16_58_12-1698384925605639303
is in state JOB_STATE_DONE
INFO:apache_beam.runners.dataflow.dataflow_runner:2021-01-08T01:06:22.211Z: JOB_MESSAGE_DETAILED:
Autoscaling: Raised the number of workers to 1 based on the rate of progress in the currently
running stage(s).
INFO:apache_beam.runners.dataflow.dataflow_runner:2021-01-08T01:06:51.797Z: JOB_MESSAGE_DETAILED:
Workers have started successfully.
INFO:apache_beam.runners.dataflow.dataflow_runner:2021-01-08T01:06:51.855Z: JOB_MESSAGE_DETAILED:
Workers have started successfully.
test_map (apache_beam.transforms.sql_test.SqlTransformTest) ... ok
test_filter (apache_beam.transforms.sql_test.SqlTransformTest) ... ok
test_row (apache_beam.transforms.sql_test.SqlTransformTest) ... ok
test_project (apache_beam.transforms.sql_test.SqlTransformTest) ... ok
test_windowing_before_sql (apache_beam.transforms.sql_test.SqlTransformTest) ... ok
test_agg (apache_beam.transforms.sql_test.SqlTransformTest) ... ok
test_generate_data (apache_beam.transforms.sql_test.SqlTransformTest) ... ok
test_tagged_join (apache_beam.transforms.sql_test.SqlTransformTest) ... ok
Worker logs: https://console.cloud.google.com/dataflow/jobs/us-central1/2021-01-07_16_58_11-952734670816842096?project=apache-beam-testing
Worker logs: https://console.cloud.google.com/dataflow/jobs/us-central1/2021-01-07_16_58_13-5278811414977099236?project=apache-beam-testing
Process Process-3:
Traceback (most recent call last):
  File "/usr/lib/python3.6/multiprocessing/process.py", line 258, in _bootstrap
    self.run()
Worker logs: https://console.cloud.google.com/dataflow/jobs/us-central1/2021-01-07_16_58_10-12754118528677546174?project=apache-beam-testing
  File "/usr/lib/python3.6/multiprocessing/process.py", line 93, in run
    self._target(*self._args, **self._kwargs)
  File "<https://ci-beam.apache.org/job/beam_PostCommit_XVR_Dataflow/ws/src/build/gradleenv/1922375555/lib/python3.6/site-packages/nose/plugins/multiprocess.py",>
line 652, in runner
    keyboardCaught, shouldStop, loaderClass, resultClass, config)
  File "<https://ci-beam.apache.org/job/beam_PostCommit_XVR_Dataflow/ws/src/build/gradleenv/1922375555/lib/python3.6/site-packages/nose/plugins/multiprocess.py",>
line 700, in __runner
    for test_addr, arg in iter(get, 'STOP'):
  File "<https://ci-beam.apache.org/job/beam_PostCommit_XVR_Dataflow/ws/src/build/gradleenv/1922375555/lib/python3.6/site-packages/nose/plugins/multiprocess.py",>
line 675, in get
    return testQueue.get(timeout=config.multiprocess_timeout)
  File "<string>", line 2, in get
  File "/usr/lib/python3.6/multiprocessing/managers.py", line 757, in _callmethod
    kind, result = conn.recv()
  File "/usr/lib/python3.6/multiprocessing/connection.py", line 250, in recv
    buf = self._recv_bytes()
  File "/usr/lib/python3.6/multiprocessing/connection.py", line 407, in _recv_bytes
    buf = self._recv(4)
  File "/usr/lib/python3.6/multiprocessing/connection.py", line 383, in _recv
    raise EOFError
EOFError
Process Process-10:
Traceback (most recent call last):
  File "/usr/lib/python3.6/multiprocessing/process.py", line 258, in _bootstrap
    self.run()
  File "/usr/lib/python3.6/multiprocessing/process.py", line 93, in run
    self._target(*self._args, **self._kwargs)
  File "<https://ci-beam.apache.org/job/beam_PostCommit_XVR_Dataflow/ws/src/build/gradleenv/1922375555/lib/python3.6/site-packages/nose/plugins/multiprocess.py",>
line 652, in runner
    keyboardCaught, shouldStop, loaderClass, resultClass, config)
  File "<https://ci-beam.apache.org/job/beam_PostCommit_XVR_Dataflow/ws/src/build/gradleenv/1922375555/lib/python3.6/site-packages/nose/plugins/multiprocess.py",>
line 700, in __runner
    for test_addr, arg in iter(get, 'STOP'):
  File "<https://ci-beam.apache.org/job/beam_PostCommit_XVR_Dataflow/ws/src/build/gradleenv/1922375555/lib/python3.6/site-packages/nose/plugins/multiprocess.py",>
line 675, in get
    return testQueue.get(timeout=config.multiprocess_timeout)
  File "<string>", line 2, in get
  File "/usr/lib/python3.6/multiprocessing/managers.py", line 757, in _callmethod
    kind, result = conn.recv()
  File "/usr/lib/python3.6/multiprocessing/connection.py", line 250, in recv
    buf = self._recv_bytes()
  File "/usr/lib/python3.6/multiprocessing/connection.py", line 407, in _recv_bytes
    buf = self._recv(4)
  File "/usr/lib/python3.6/multiprocessing/connection.py", line 383, in _recv
    raise EOFError
EOFError
Process Process-4:
Traceback (most recent call last):
  File "/usr/lib/python3.6/multiprocessing/process.py", line 258, in _bootstrap
    self.run()
  File "/usr/lib/python3.6/multiprocessing/process.py", line 93, in run
    self._target(*self._args, **self._kwargs)
  File "<https://ci-beam.apache.org/job/beam_PostCommit_XVR_Dataflow/ws/src/build/gradleenv/1922375555/lib/python3.6/site-packages/nose/plugins/multiprocess.py",>
line 652, in runner
    keyboardCaught, shouldStop, loaderClass, resultClass, config)
  File "<https://ci-beam.apache.org/job/beam_PostCommit_XVR_Dataflow/ws/src/build/gradleenv/1922375555/lib/python3.6/site-packages/nose/plugins/multiprocess.py",>
line 700, in __runner
    for test_addr, arg in iter(get, 'STOP'):
  File "<https://ci-beam.apache.org/job/beam_PostCommit_XVR_Dataflow/ws/src/build/gradleenv/1922375555/lib/python3.6/site-packages/nose/plugins/multiprocess.py",>
line 675, in get
    return testQueue.get(timeout=config.multiprocess_timeout)
  File "<string>", line 2, in get
  File "/usr/lib/python3.6/multiprocessing/managers.py", line 757, in _callmethod
    kind, result = conn.recv()
  File "/usr/lib/python3.6/multiprocessing/connection.py", line 250, in recv
    buf = self._recv_bytes()
  File "/usr/lib/python3.6/multiprocessing/connection.py", line 407, in _recv_bytes
    buf = self._recv(4)
  File "/usr/lib/python3.6/multiprocessing/connection.py", line 383, in _recv
    raise EOFError
EOFError
Terminated

The message received from the daemon indicates that the daemon has disappeared.
Build request sent: Build{id=9fb38f20-3771-4391-a690-20033d967c6b, currentDir=<https://ci-beam.apache.org/job/beam_PostCommit_XVR_Dataflow/ws/src}>
Attempting to read last messages from the daemon log...
Daemon pid: 5805
  log file: /home/jenkins/.gradle/daemon/6.7.1/daemon-5805.out.log
----- Last  20 lines from daemon log file - daemon-5805.out.log -----
  File "/usr/lib/python3.6/multiprocessing/process.py", line 93, in run
    self._target(*self._args, **self._kwargs)
  File "<https://ci-beam.apache.org/job/beam_PostCommit_XVR_Dataflow/ws/src/build/gradleenv/1922375555/lib/python3.6/site-packages/nose/plugins/multiprocess.py",>
line 652, in runner
    keyboardCaught, shouldStop, loaderClass, resultClass, config)
  File "<https://ci-beam.apache.org/job/beam_PostCommit_XVR_Dataflow/ws/src/build/gradleenv/1922375555/lib/python3.6/site-packages/nose/plugins/multiprocess.py",>
line 700, in __runner
    for test_addr, arg in iter(get, 'STOP'):
  File "<https://ci-beam.apache.org/job/beam_PostCommit_XVR_Dataflow/ws/src/build/gradleenv/1922375555/lib/python3.6/site-packages/nose/plugins/multiprocess.py",>
line 675, in get
    return testQueue.get(timeout=config.multiprocess_timeout)
  File "<string>", line 2, in get
  File "/usr/lib/python3.6/multiprocessing/managers.py", line 757, in _callmethod
    kind, result = conn.recv()
  File "/usr/lib/python3.6/multiprocessing/connection.py", line 250, in recv
    buf = self._recv_bytes()
  File "/usr/lib/python3.6/multiprocessing/connection.py", line 407, in _recv_bytes
    buf = self._recv(4)
  File "/usr/lib/python3.6/multiprocessing/connection.py", line 383, in _recv
    raise EOFError
EOFError
Terminated
Daemon vm is shutting down... The daemon has exited normally or was terminated in response
to a user interrupt.
----- End of the daemon log -----


FAILURE: Build failed with an exception.

* What went wrong:
Gradle build daemon disappeared unexpectedly (it may have been killed or may have crashed)

* Try:
Run with --stacktrace option to get the stack trace. Run with --info or --debug option to
get more log output. Run with --scan to get full insights.

* Get more help at https://help.gradle.org
Build step 'Invoke Gradle script' changed build result to FAILURE
Build step 'Invoke Gradle script' marked build as failure

---------------------------------------------------------------------
To unsubscribe, e-mail: builds-unsubscribe@beam.apache.org
For additional commands, e-mail: builds-help@beam.apache.org


Mime
View raw message