beam-builds mailing list archives

Site index · List index
Message view « Date » · « Thread »
Top « Date » · « Thread »
From Apache Jenkins Server <jenk...@builds.apache.org>
Subject Build failed in Jenkins: beam_PostCommit_Go_VR_Flink #4329
Date Sun, 31 Jan 2021 12:29:51 GMT
See <https://ci-beam.apache.org/job/beam_PostCommit_Go_VR_Flink/4329/display/redirect>

Changes:


------------------------------------------
[...truncated 270.00 KB...]
      >
      component_coder_ids: "c13"
    >
  >
  coders: <
    key: "c15"
    value: <
      spec: <
        urn: "beam:coder:iterable:v1"
      >
      component_coder_ids: "c14"
    >
  >
  coders: <
    key: "c16"
    value: <
      spec: <
        urn: "beam:coder:kv:v1"
      >
      component_coder_ids: "c7"
      component_coder_ids: "c15"
    >
  >
  coders: <
    key: "c17"
    value: <
      spec: <
        urn: "beam:coder:kv:v1"
      >
      component_coder_ids: "c3"
      component_coder_ids: "c3"
    >
  >
  coders: <
    key: "c18"
    value: <
      spec: <
        urn: "beam:coder:iterable:v1"
      >
      component_coder_ids: "c3"
    >
  >
  coders: <
    key: "c19"
    value: <
      spec: <
        urn: "beam:coder:kv:v1"
      >
      component_coder_ids: "c3"
      component_coder_ids: "c18"
    >
  >
  coders: <
    key: "c2"
    value: <
      spec: <
        urn: "beam:go:coder:custom:v1"
        payload: "Cgd2YXJpbnR6EgIIAhqFAQpxZ2l0aHViLmNvbS9hcGFjaGUvYmVhbS9zZGtzL2dvL3Rlc3QvdmVuZG9yL2dpdGh1Yi5jb20vYXBhY2hlL2JlYW0vc2Rrcy9nby9wa2cvYmVhbS9jb3JlL3J1bnRpbWUvY29kZXJ4LmVuY1ZhckludFoSEAgWIgQIGUAPKgYIFBICCAgikQEKcWdpdGh1Yi5jb20vYXBhY2hlL2JlYW0vc2Rrcy9nby90ZXN0L3ZlbmRvci9naXRodWIuY29tL2FwYWNoZS9iZWFtL3Nka3MvZ28vcGtnL2JlYW0vY29yZS9ydW50aW1lL2NvZGVyeC5kZWNWYXJJbnRaEhwIFiIECBlAAyIGCBQSAggIKgQIGUAPKgQIGUAB"
      >
    >
  >
  coders: <
    key: "c3"
    value: <
      spec: <
        urn: "beam:coder:length_prefix:v1"
      >
      component_coder_ids: "c2"
    >
  >
  coders: <
    key: "c4"
    value: <
      spec: <
        urn: "beam:coder:kv:v1"
      >
      component_coder_ids: "c3"
      component_coder_ids: "c0"
    >
  >
  coders: <
    key: "c5"
    value: <
      spec: <
        urn: "beam:coder:iterable:v1"
      >
      component_coder_ids: "c0"
    >
  >
  coders: <
    key: "c6"
    value: <
      spec: <
        urn: "beam:coder:kv:v1"
      >
      component_coder_ids: "c3"
      component_coder_ids: "c5"
    >
  >
  coders: <
    key: "c7"
    value: <
      spec: <
        urn: "beam:coder:string_utf8:v1"
      >
    >
  >
  coders: <
    key: "c8"
    value: <
      spec: <
        urn: "beam:coder:kv:v1"
      >
      component_coder_ids: "c7"
      component_coder_ids: "c3"
    >
  >
  coders: <
    key: "c9"
    value: <
      spec: <
        urn: "beam:coder:kv:v1"
      >
      component_coder_ids: "c7"
      component_coder_ids: "c7"
    >
  >
  environments: <
    key: "go"
    value: <
      urn: "beam:env:docker:v1"
      payload: "\nAus.gcr.io/apache-beam-testing/jenkins/beam_go_sdk:20210131-120640"
      capabilities: "beam:protocol:progress_reporting:v0"
      capabilities: "beam:protocol:multi_core_bundle_processing:v1"
      capabilities: "beam:version:sdk_base:go"
      capabilities: "beam:coder:bytes:v1"
      capabilities: "beam:coder:bool:v1"
      capabilities: "beam:coder:varint:v1"
      capabilities: "beam:coder:double:v1"
      capabilities: "beam:coder:string_utf8:v1"
      capabilities: "beam:coder:length_prefix:v1"
      capabilities: "beam:coder:kv:v1"
      capabilities: "beam:coder:iterable:v1"
      capabilities: "beam:coder:state_backed_iterable:v1"
      capabilities: "beam:coder:windowed_value:v1"
      capabilities: "beam:coder:global_window:v1"
      capabilities: "beam:coder:interval_window:v1"
      dependencies: <
        type_urn: "beam:artifact:type:go_worker_binary:v1"
        role_urn: "beam:artifact:role:staging_to:v1"
        role_payload: "\n\006worker"
      >
    >
  >
>
root_transform_ids: "e1"
root_transform_ids: "e5"
root_transform_ids: "e3"
root_transform_ids: "s1"
root_transform_ids: "e11_reshuffle"
root_transform_ids: "e12"
root_transform_ids: "s5"
root_transform_ids: "s2"
root_transform_ids: "s4"
root_transform_ids: "s3"
2021/01/31 12:29:45 Test reshuffle:reshufflekv failed: 	connecting to job service
failed to dial server at localhost:50091
	caused by:
context deadline exceeded
2021/01/31 12:29:45 Result: 11 tests failed

if [[ ! -z "$JOB_PORT" ]]; then
  # Shut down the job server
  kill %1 || echo "Failed to shut down job server"
fi

if [[ "$PUSH_CONTAINER_TO_GCR" = 'yes' ]]; then
  # Delete the container locally and remotely
  docker rmi $CONTAINER:$TAG || echo "Failed to remove container"
  gcloud --quiet container images delete $CONTAINER:$TAG || echo "Failed to delete container"

  # Clean up tempdir
  rm -rf $TMPDIR
fi
Untagged: us.gcr.io/apache-beam-testing/jenkins/beam_go_sdk:20210131-120640
Untagged: us.gcr.io/apache-beam-testing/jenkins/beam_go_sdk@sha256:fb5b4b4bd69d58d6eae27201144e4115d8701e8e6afdb40db0c7d8218a2ae2e6
Deleted: sha256:c608203ce4581bf2fb6f1625cec35681d518d4e3e08798b7bed4a0d851c2d03e
Deleted: sha256:c399b2c15ce63f766a9d87c28598b3fa67e7628ed324362fab041e55bbe56edf
Deleted: sha256:6236426303e29faf06c0c7e279202c6ea94c2a570a4632335fbb0925428ba34c
Deleted: sha256:afe4b1ba00cc1c199d7f14da32e454e5c724984b70b911c3a5c3d3b2e0d54d0d
Deleted: sha256:f44e06ff086a3bfcf41b6c532473bb1036c7137fa229c9e8770fcd96c9bb98b2
Deleted: sha256:49b0aee27008b58673b16ecaaa8af16cd2cb1ed8c75670e6b12553c250586c22
Deleted: sha256:26b218228e712e2c9b29e5d1e3b38354ef51f86f106412e59db658b7ba2cf928
Deleted: sha256:a7ac44e3815cd70536c2531eb752c2b4edf0f666141b04d63bbbdd4923151441
Deleted: sha256:32e116488b0ae11e9148150c9ddbab0a59bcaa17c126671f8544ac6cca4b6e34
Deleted: sha256:dac14e41ee47dcf2539daf62a1d57208701917a525e49452f95ee9f9a4550880
Deleted: sha256:d7ad35af87de28bff68406025cc766906527261b44f9cb6c94840319b5a01bd2
Deleted: sha256:539b6baa5288bf4bc3b8e4aed1328d75610a2cae0f116c927446516206071ab3
Deleted: sha256:8e4f74594fbbbf716b487bdc4188cc086ebd96b57455e04f2f99710bbe4554ef
Deleted: sha256:8dc1f9f672aaaeae39ac098630f6cf056a29f03cc368d747ad58ac89aa427f92
Deleted: sha256:aed9a96d4d8984f4a4ac7b91029292876d2371475bace6275c6b1bd18f43ce59
Deleted: sha256:19ca4f161cb1505cea47d931461b3cace8115affeb650df2a7d8f93282ff8801
Deleted: sha256:d284b638394dfd9654e37ec8b3575339d6fd64d191a64df69e1935dfccbf166e
Digests:
- us.gcr.io/apache-beam-testing/jenkins/beam_go_sdk@sha256:fb5b4b4bd69d58d6eae27201144e4115d8701e8e6afdb40db0c7d8218a2ae2e6
  Associated tags:
 - 20210131-120640
Tags:
- us.gcr.io/apache-beam-testing/jenkins/beam_go_sdk:20210131-120640
Deleted [us.gcr.io/apache-beam-testing/jenkins/beam_go_sdk:20210131-120640].
Deleted [us.gcr.io/apache-beam-testing/jenkins/beam_go_sdk@sha256:fb5b4b4bd69d58d6eae27201144e4115d8701e8e6afdb40db0c7d8218a2ae2e6].

>>> FAILURE
if [[ "$TEST_EXIT_CODE" -eq 0 ]]; then
  echo ">>> SUCCESS"
else
  echo ">>> FAILURE"
fi
exit $TEST_EXIT_CODE

> Task :sdks:go:test:flinkValidatesRunner FAILED

FAILURE: Build failed with an exception.

* Where:
Build file '<https://ci-beam.apache.org/job/beam_PostCommit_Go_VR_Flink/ws/src/sdks/go/test/build.gradle'>
line: 150

* What went wrong:
Execution failed for task ':sdks:go:test:flinkValidatesRunner'.
> Process 'command 'sh'' finished with non-zero exit value 1

* Try:
Run with --stacktrace option to get the stack trace. Run with --info or --debug option to
get more log output. Run with --scan to get full insights.

* Get more help at https://help.gradle.org

Deprecated Gradle features were used in this build, making it incompatible with Gradle 7.0.
Use '--warning-mode all' to show the individual deprecation warnings.
See https://docs.gradle.org/6.8/userguide/command_line_interface.html#sec:command_line_warnings

BUILD FAILED in 29m 28s
130 actionable tasks: 88 executed, 42 from cache
Gradle was unable to watch the file system for changes. The inotify watches limit is too low.

Publishing build scan...
https://gradle.com/s/wp3st3luq4cdk

Build step 'Invoke Gradle script' changed build result to FAILURE
Build step 'Invoke Gradle script' marked build as failure

---------------------------------------------------------------------
To unsubscribe, e-mail: builds-unsubscribe@beam.apache.org
For additional commands, e-mail: builds-help@beam.apache.org


Mime
View raw message