beam-builds mailing list archives

Site index · List index
Message view « Date » · « Thread »
Top « Date » · « Thread »
From Apache Jenkins Server <jenk...@builds.apache.org>
Subject Build failed in Jenkins: beam_PostCommit_Python36 #3479
Date Sat, 30 Jan 2021 19:17:56 GMT
See <https://ci-beam.apache.org/job/beam_PostCommit_Python36/3479/display/redirect?page=changes>

Changes:

[Ismaël Mejía] [website] Clarify JIRA priority for security issues (CVEs)


------------------------------------------
[...truncated 41.38 MB...]
DEBUG:google.auth.transport._http_client:Making request: GET http://169.254.169.254
DEBUG:google.auth.transport._http_client:Making request: GET http://metadata.google.internal/computeMetadata/v1/project/project-id
DEBUG:urllib3.util.retry:Converted retries value: 3 -> Retry(total=3, connect=None, read=None,
redirect=None, status=None)
DEBUG:google.auth.transport.requests:Making request: GET http://metadata.google.internal/computeMetadata/v1/instance/service-accounts/default/?recursive=true
DEBUG:urllib3.connectionpool:Starting new HTTP connection (1): metadata.google.internal:80
DEBUG:urllib3.connectionpool:http://metadata.google.internal:80 "GET /computeMetadata/v1/instance/service-accounts/default/?recursive=true
HTTP/1.1" 200 144
DEBUG:google.auth.transport.requests:Making request: GET http://metadata.google.internal/computeMetadata/v1/instance/service-accounts/844138762903-compute@developer.gserviceaccount.com/token?scopes=https%3A%2F%2Fwww.googleapis.com%2Fauth%2Fbigquery%2Chttps%3A%2F%2Fwww.googleapis.com%2Fauth%2Fcloud-platform
DEBUG:urllib3.connectionpool:http://metadata.google.internal:80 "GET /computeMetadata/v1/instance/service-accounts/844138762903-compute@developer.gserviceaccount.com/token?scopes=https%3A%2F%2Fwww.googleapis.com%2Fauth%2Fbigquery%2Chttps%3A%2F%2Fwww.googleapis.com%2Fauth%2Fcloud-platform
HTTP/1.1" 200 241
DEBUG:urllib3.connectionpool:Starting new HTTPS connection (1): bigquery.googleapis.com:443
INFO:apache_beam.runners.dataflow.dataflow_runner:2021-01-30T19:11:37.717Z: JOB_MESSAGE_DETAILED:
Autoscaling: Raised the number of workers to 1 based on the rate of progress in the currently
running stage(s).
DEBUG:urllib3.connectionpool:https://bigquery.googleapis.com:443 "POST /bigquery/v2/projects/apache-beam-testing/jobs?prettyPrint=false
HTTP/1.1" 200 None
DEBUG:urllib3.connectionpool:https://bigquery.googleapis.com:443 "GET /bigquery/v2/projects/apache-beam-testing/queries/bc6d973f-3f32-47a3-baa0-b172f6410251?maxResults=0&location=US&prettyPrint=false
HTTP/1.1" 200 None
DEBUG:urllib3.connectionpool:https://bigquery.googleapis.com:443 "GET /bigquery/v2/projects/apache-beam-testing/datasets/_7357fab0f784d2a7327ddbe81cdd1f4ca7e429cd/tables/anon94b70685a9f7bb6d3015a7b9587b9413edbb2ff6/data?prettyPrint=false
HTTP/1.1" 200 None
INFO:apache_beam.io.gcp.tests.bigquery_matcher:Read from given query (SELECT fruit from `python_query_to_table_1612033452122.output_table`;),
total rows 2
INFO:apache_beam.io.gcp.tests.bigquery_matcher:Generate checksum: 158a8ea1c254fcf40d4ed3e7c0242c3ea0a29e72
INFO:apache_beam.runners.dataflow.dataflow_runner:2021-01-30T19:11:50.701Z: JOB_MESSAGE_DETAILED:
Workers have started successfully.
INFO:apache_beam.runners.dataflow.dataflow_runner:2021-01-30T19:11:50.730Z: JOB_MESSAGE_DETAILED:
Workers have started successfully.
INFO:apache_beam.runners.dataflow.dataflow_runner:2021-01-30T19:12:17.012Z: JOB_MESSAGE_DETAILED:
Autoscaling: Resized worker pool from 1 to 0.
INFO:apache_beam.runners.dataflow.dataflow_runner:2021-01-30T19:12:17.113Z: JOB_MESSAGE_BASIC:
Worker pool stopped.
INFO:apache_beam.runners.dataflow.dataflow_runner:2021-01-30T19:12:17.141Z: JOB_MESSAGE_DEBUG:
Tearing down pending resources...
INFO:apache_beam.runners.dataflow.dataflow_runner:Job 2021-01-30_11_05_19-5575082742540449290
is in state JOB_STATE_DONE
INFO:apache_beam.runners.dataflow.dataflow_runner:2021-01-30T19:13:35.883Z: JOB_MESSAGE_BASIC:
Finished operation assert_that/Create/Read+assert_that/Group/pair_with_0+assert_that/Group/GroupByKey/Reify+assert_that/Group/GroupByKey/Write
INFO:apache_beam.runners.dataflow.dataflow_runner:2021-01-30T19:13:39.124Z: JOB_MESSAGE_BASIC:
Finished operation Create/Read+ExternalTransform(simple)/Map(<lambda at external_it_test.py:43>)+assert_that/WindowInto(WindowIntoFn)+assert_that/ToVoidKey+assert_that/Group/pair_with_1+assert_that/Group/GroupByKey/Reify+assert_that/Group/GroupByKey/Write
INFO:apache_beam.runners.dataflow.dataflow_runner:2021-01-30T19:13:39.211Z: JOB_MESSAGE_BASIC:
Executing operation assert_that/Group/GroupByKey/Close
INFO:apache_beam.runners.dataflow.dataflow_runner:2021-01-30T19:13:39.307Z: JOB_MESSAGE_BASIC:
Finished operation assert_that/Group/GroupByKey/Close
INFO:apache_beam.runners.dataflow.dataflow_runner:2021-01-30T19:13:39.411Z: JOB_MESSAGE_BASIC:
Executing operation assert_that/Group/GroupByKey/Read+assert_that/Group/GroupByKey/GroupByWindow+assert_that/Group/Map(_merge_tagged_vals_under_key)+assert_that/Unkey+assert_that/Match
INFO:apache_beam.runners.dataflow.dataflow_runner:2021-01-30T19:13:48.511Z: JOB_MESSAGE_BASIC:
Finished operation assert_that/Group/GroupByKey/Read+assert_that/Group/GroupByKey/GroupByWindow+assert_that/Group/Map(_merge_tagged_vals_under_key)+assert_that/Unkey+assert_that/Match
INFO:apache_beam.runners.dataflow.dataflow_runner:2021-01-30T19:13:48.585Z: JOB_MESSAGE_DEBUG:
Executing success step success19
INFO:apache_beam.runners.dataflow.dataflow_runner:2021-01-30T19:13:48.675Z: JOB_MESSAGE_DETAILED:
Cleaning up.
INFO:apache_beam.runners.dataflow.dataflow_runner:2021-01-30T19:13:48.726Z: JOB_MESSAGE_DEBUG:
Starting worker pool teardown.
INFO:apache_beam.runners.dataflow.dataflow_runner:2021-01-30T19:13:48.785Z: JOB_MESSAGE_BASIC:
Stopping worker pool...
INFO:apache_beam.runners.dataflow.dataflow_runner:2021-01-30T19:14:34.667Z: JOB_MESSAGE_DETAILED:
Autoscaling: Resized worker pool from 1 to 0.
INFO:apache_beam.runners.dataflow.dataflow_runner:2021-01-30T19:14:34.731Z: JOB_MESSAGE_BASIC:
Worker pool stopped.
INFO:apache_beam.runners.dataflow.dataflow_runner:2021-01-30T19:14:34.769Z: JOB_MESSAGE_DEBUG:
Tearing down pending resources...
INFO:apache_beam.runners.dataflow.dataflow_runner:Job 2021-01-30_11_07_59-6784544427504275028
is in state JOB_STATE_DONE
WARNING:apache_beam.runners.dataflow.dataflow_runner:Timing out on waiting for job 2021-01-30_11_00_41-933838969139316366
after 903 seconds
INFO:apache_beam.io.gcp.tests.bigquery_matcher:Attempting to perform query SELECT number FROM
python_pubsub_bq_1612033230376.output_table to BQ
DEBUG:google.auth._default:Checking None for explicit credentials as part of auth process...
DEBUG:google.auth._default:Checking Cloud SDK credentials as part of auth process...
DEBUG:google.auth._default:Cloud SDK credentials not found on disk; not using them
DEBUG:google.auth._default:Checking for App Engine runtime as part of auth process...
DEBUG:google.auth._default:No App Engine library was found so cannot authentication via App
Engine Identity Credentials.
DEBUG:google.auth.transport._http_client:Making request: GET http://169.254.169.254
DEBUG:google.auth.transport._http_client:Making request: GET http://metadata.google.internal/computeMetadata/v1/project/project-id
DEBUG:urllib3.util.retry:Converted retries value: 3 -> Retry(total=3, connect=None, read=None,
redirect=None, status=None)
DEBUG:google.auth.transport.requests:Making request: GET http://metadata.google.internal/computeMetadata/v1/instance/service-accounts/default/?recursive=true
DEBUG:urllib3.connectionpool:Starting new HTTP connection (1): metadata.google.internal:80
DEBUG:urllib3.connectionpool:http://metadata.google.internal:80 "GET /computeMetadata/v1/instance/service-accounts/default/?recursive=true
HTTP/1.1" 200 144
DEBUG:google.auth.transport.requests:Making request: GET http://metadata.google.internal/computeMetadata/v1/instance/service-accounts/844138762903-compute@developer.gserviceaccount.com/token?scopes=https%3A%2F%2Fwww.googleapis.com%2Fauth%2Fbigquery%2Chttps%3A%2F%2Fwww.googleapis.com%2Fauth%2Fcloud-platform
DEBUG:urllib3.connectionpool:http://metadata.google.internal:80 "GET /computeMetadata/v1/instance/service-accounts/844138762903-compute@developer.gserviceaccount.com/token?scopes=https%3A%2F%2Fwww.googleapis.com%2Fauth%2Fbigquery%2Chttps%3A%2F%2Fwww.googleapis.com%2Fauth%2Fcloud-platform
HTTP/1.1" 200 241
DEBUG:urllib3.connectionpool:Starting new HTTPS connection (1): bigquery.googleapis.com:443
DEBUG:urllib3.connectionpool:https://bigquery.googleapis.com:443 "POST /bigquery/v2/projects/apache-beam-testing/jobs?prettyPrint=false
HTTP/1.1" 200 None
DEBUG:urllib3.connectionpool:https://bigquery.googleapis.com:443 "GET /bigquery/v2/projects/apache-beam-testing/queries/5fd6d6b0-e0c5-4bca-aa75-55fa2e1ca8d5?maxResults=0&location=US&prettyPrint=false
HTTP/1.1" 200 None
DEBUG:urllib3.connectionpool:https://bigquery.googleapis.com:443 "GET /bigquery/v2/projects/apache-beam-testing/datasets/_7357fab0f784d2a7327ddbe81cdd1f4ca7e429cd/tables/anon202ae0e8_fce4_4bab_af56_01490a9bc907/data?prettyPrint=false
HTTP/1.1" 200 None
INFO:apache_beam.io.gcp.tests.bigquery_matcher:Result of query is: [(3,), (1,), (2,), (0,)]
INFO:apache_beam.runners.dataflow.dataflow_runner:2021-01-30T19:16:41.815Z: JOB_MESSAGE_BASIC:
Finished operation Create/Read+metrics+map_to_common_key+GroupByKey/Reify+GroupByKey/Write
INFO:apache_beam.runners.dataflow.dataflow_runner:2021-01-30T19:16:42.037Z: JOB_MESSAGE_BASIC:
Executing operation GroupByKey/Close
INFO:apache_beam.runners.dataflow.dataflow_runner:2021-01-30T19:16:42.084Z: JOB_MESSAGE_BASIC:
Finished operation GroupByKey/Close
INFO:apache_beam.runners.dataflow.dataflow_runner:2021-01-30T19:16:42.142Z: JOB_MESSAGE_BASIC:
Executing operation GroupByKey/Read+GroupByKey/GroupByWindow+m_out
INFO:apache_beam.runners.dataflow.dataflow_runner:2021-01-30T19:16:51.192Z: JOB_MESSAGE_BASIC:
Finished operation GroupByKey/Read+GroupByKey/GroupByWindow+m_out
INFO:apache_beam.runners.dataflow.dataflow_runner:2021-01-30T19:16:51.271Z: JOB_MESSAGE_DEBUG:
Executing success step success11
INFO:apache_beam.runners.dataflow.dataflow_runner:2021-01-30T19:16:51.357Z: JOB_MESSAGE_DETAILED:
Cleaning up.
INFO:apache_beam.runners.dataflow.dataflow_runner:2021-01-30T19:16:51.423Z: JOB_MESSAGE_DEBUG:
Starting worker pool teardown.
INFO:apache_beam.runners.dataflow.dataflow_runner:2021-01-30T19:16:51.457Z: JOB_MESSAGE_BASIC:
Stopping worker pool...
DEBUG:google.auth._default:Checking None for explicit credentials as part of auth process...
DEBUG:google.auth._default:Checking Cloud SDK credentials as part of auth process...
DEBUG:google.auth._default:Cloud SDK credentials not found on disk; not using them
DEBUG:google.auth._default:Checking for App Engine runtime as part of auth process...
DEBUG:google.auth._default:No App Engine library was found so cannot authentication via App
Engine Identity Credentials.
DEBUG:google.auth.transport._http_client:Making request: GET http://169.254.169.254
DEBUG:google.auth.transport._http_client:Making request: GET http://metadata.google.internal/computeMetadata/v1/project/project-id
DEBUG:urllib3.util.retry:Converted retries value: 3 -> Retry(total=3, connect=None, read=None,
redirect=None, status=None)
DEBUG:google.auth.transport.requests:Making request: GET http://metadata.google.internal/computeMetadata/v1/instance/service-accounts/default/?recursive=true
DEBUG:urllib3.connectionpool:Starting new HTTP connection (1): metadata.google.internal:80
DEBUG:urllib3.connectionpool:http://metadata.google.internal:80 "GET /computeMetadata/v1/instance/service-accounts/default/?recursive=true
HTTP/1.1" 200 144
DEBUG:google.auth.transport.requests:Making request: GET http://metadata.google.internal/computeMetadata/v1/instance/service-accounts/844138762903-compute@developer.gserviceaccount.com/token?scopes=https%3A%2F%2Fwww.googleapis.com%2Fauth%2Fbigquery%2Chttps%3A%2F%2Fwww.googleapis.com%2Fauth%2Fcloud-platform
DEBUG:urllib3.connectionpool:http://metadata.google.internal:80 "GET /computeMetadata/v1/instance/service-accounts/844138762903-compute@developer.gserviceaccount.com/token?scopes=https%3A%2F%2Fwww.googleapis.com%2Fauth%2Fbigquery%2Chttps%3A%2F%2Fwww.googleapis.com%2Fauth%2Fcloud-platform
HTTP/1.1" 200 241
DEBUG:urllib3.connectionpool:Starting new HTTPS connection (1): bigquery.googleapis.com:443
DEBUG:urllib3.connectionpool:https://bigquery.googleapis.com:443 "DELETE /bigquery/v2/projects/apache-beam-testing/datasets/python_pubsub_bq_1612033230376?deleteContents=true&prettyPrint=false
HTTP/1.1" 200 None
INFO:apache_beam.runners.dataflow.dataflow_runner:2021-01-30T19:17:40.072Z: JOB_MESSAGE_DETAILED:
Autoscaling: Resized worker pool from 1 to 0.
INFO:apache_beam.runners.dataflow.dataflow_runner:2021-01-30T19:17:40.122Z: JOB_MESSAGE_BASIC:
Worker pool stopped.
INFO:apache_beam.runners.dataflow.dataflow_runner:2021-01-30T19:17:40.159Z: JOB_MESSAGE_DEBUG:
Tearing down pending resources...
INFO:apache_beam.runners.dataflow.dataflow_runner:Job 2021-01-30_11_10_55-1762795453948910338
is in state JOB_STATE_DONE
Worker logs: https://console.cloud.google.com/dataflow/jobs/us-central1/2021-01-30_10_05_57-17435344902666088719?project=apache-beam-testing
Worker logs: https://console.cloud.google.com/dataflow/jobs/us-central1/2021-01-30_10_20_51-11960668765107367283?project=apache-beam-testing
Worker logs: https://console.cloud.google.com/dataflow/jobs/us-central1/2021-01-30_10_28_11-13017167841238067232?project=apache-beam-testing
Worker logs: https://console.cloud.google.com/dataflow/jobs/us-central1/2021-01-30_10_35_49-5728863486306938199?project=apache-beam-testing
Worker logs: https://console.cloud.google.com/dataflow/jobs/us-central1/2021-01-30_10_44_08-14505849822770925778?project=apache-beam-testing
Worker logs: https://console.cloud.google.com/dataflow/jobs/us-central1/2021-01-30_11_00_41-933838969139316366?project=apache-beam-testing
Worker logs: https://console.cloud.google.com/dataflow/jobs/us-central1/2021-01-30_10_05_56-9370107318554031447?project=apache-beam-testing
Worker logs: https://console.cloud.google.com/dataflow/jobs/us-central1/2021-01-30_10_25_29-8960407052052957486?project=apache-beam-testing
Worker logs: https://console.cloud.google.com/dataflow/jobs/us-central1/2021-01-30_10_33_17-15915622026671476003?project=apache-beam-testing
Worker logs: https://console.cloud.google.com/dataflow/jobs/us-central1/2021-01-30_10_41_23-11671250766420329611?project=apache-beam-testing
Worker logs: https://console.cloud.google.com/dataflow/jobs/us-central1/2021-01-30_10_50_18-6647421063356046619?project=apache-beam-testing
Worker logs: https://console.cloud.google.com/dataflow/jobs/us-central1/2021-01-30_10_57_47-11643489326860432066?project=apache-beam-testing
Worker logs: https://console.cloud.google.com/dataflow/jobs/us-central1/2021-01-30_11_05_33-5424430278291415693?project=apache-beam-testing
Worker logs: https://console.cloud.google.com/dataflow/jobs/us-central1/2021-01-30_10_05_56-12816139039161714537?project=apache-beam-testing
Worker logs: https://console.cloud.google.com/dataflow/jobs/us-central1/2021-01-30_10_17_37-13755383150490083522?project=apache-beam-testing
Worker logs: https://console.cloud.google.com/dataflow/jobs/us-central1/2021-01-30_10_25_44-10051872431181388388?project=apache-beam-testing
Worker logs: https://console.cloud.google.com/dataflow/jobs/us-central1/2021-01-30_10_33_57-10020432153585008424?project=apache-beam-testing
Worker logs: https://console.cloud.google.com/dataflow/jobs/us-central1/2021-01-30_10_41_31-1498158034617827199?project=apache-beam-testing
Worker logs: https://console.cloud.google.com/dataflow/jobs/us-central1/2021-01-30_10_48_52-3525594754268226404?project=apache-beam-testing
Worker logs: https://console.cloud.google.com/dataflow/jobs/us-central1/2021-01-30_10_56_22-14436065401046057643?project=apache-beam-testing
Worker logs: https://console.cloud.google.com/dataflow/jobs/us-central1/2021-01-30_11_03_41-2580188970238203181?project=apache-beam-testing
Worker logs: https://console.cloud.google.com/dataflow/jobs/us-central1/2021-01-30_11_10_55-1762795453948910338?project=apache-beam-testing
Worker logs: https://console.cloud.google.com/dataflow/jobs/us-central1/2021-01-30_10_05_53-9829938352974083322?project=apache-beam-testing
Worker logs: https://console.cloud.google.com/dataflow/jobs/us-central1/2021-01-30_10_23_52-1236350629919463502?project=apache-beam-testing
Worker logs: https://console.cloud.google.com/dataflow/jobs/us-central1/2021-01-30_10_32_22-10239414120932577472?project=apache-beam-testing
Worker logs: https://console.cloud.google.com/dataflow/jobs/us-central1/2021-01-30_10_40_34-18016036445985983117?project=apache-beam-testing
Worker logs: https://console.cloud.google.com/dataflow/jobs/us-central1/2021-01-30_10_48_31-8770929488126007239?project=apache-beam-testing
Worker logs: https://console.cloud.google.com/dataflow/jobs/us-central1/2021-01-30_10_56_23-7327461011895055399?project=apache-beam-testing
Worker logs: https://console.cloud.google.com/dataflow/jobs/us-central1/2021-01-30_11_04_25-16279159989146991577?project=apache-beam-testing
Worker logs: https://console.cloud.google.com/dataflow/jobs/us-central1/2021-01-30_10_10_42-10712654402956125955?project=apache-beam-testing
Worker logs: https://console.cloud.google.com/dataflow/jobs/us-central1/2021-01-30_10_20_32-9868637873381830336?project=apache-beam-testing
Worker logs: https://console.cloud.google.com/dataflow/jobs/us-central1/2021-01-30_10_27_41-15336607609830471352?project=apache-beam-testing
Worker logs: https://console.cloud.google.com/dataflow/jobs/us-central1/2021-01-30_10_35_30-8745316696253192483?project=apache-beam-testing
Worker logs: https://console.cloud.google.com/dataflow/jobs/us-central1/2021-01-30_10_42_59-4981026230215213240?project=apache-beam-testing
Worker logs: https://console.cloud.google.com/dataflow/jobs/us-central1/2021-01-30_10_49_59-7647231267312731133?project=apache-beam-testing
Worker logs: https://console.cloud.google.com/dataflow/jobs/us-central1/2021-01-30_10_57_39-7448484423693738592?project=apache-beam-testing
Worker logs: https://console.cloud.google.com/dataflow/jobs/us-central1/2021-01-30_11_05_19-5575082742540449290?project=apache-beam-testing
Worker logs: https://console.cloud.google.com/dataflow/jobs/us-central1/2021-01-30_10_05_54-13390603950882616449?project=apache-beam-testing
Worker logs: https://console.cloud.google.com/dataflow/jobs/us-central1/2021-01-30_10_14_56-14706751905733116451?project=apache-beam-testing
Worker logs: https://console.cloud.google.com/dataflow/jobs/us-central1/2021-01-30_10_24_46-9039708926277288687?project=apache-beam-testing
Worker logs: https://console.cloud.google.com/dataflow/jobs/us-central1/2021-01-30_10_34_24-4980132219862185157?project=apache-beam-testing
Worker logs: https://console.cloud.google.com/dataflow/jobs/us-central1/2021-01-30_10_42_23-15126594595670697651?project=apache-beam-testing
Worker logs: https://console.cloud.google.com/dataflow/jobs/us-central1/2021-01-30_10_50_09-227715036727209260?project=apache-beam-testing
Worker logs: https://console.cloud.google.com/dataflow/jobs/us-central1/2021-01-30_10_56_36-2387788007977609180?project=apache-beam-testing
Worker logs: https://console.cloud.google.com/dataflow/jobs/us-central1/2021-01-30_11_03_04-16024751008392737555?project=apache-beam-testing
Worker logs: https://console.cloud.google.com/dataflow/jobs/us-central1/2021-01-30_10_05_58-3528511092584953768?project=apache-beam-testing
Worker logs: https://console.cloud.google.com/dataflow/jobs/us-central1/2021-01-30_10_14_54-8445585502303200415?project=apache-beam-testing
Worker logs: https://console.cloud.google.com/dataflow/jobs/us-central1/2021-01-30_10_23_31-419841170215804578?project=apache-beam-testing
Worker logs: https://console.cloud.google.com/dataflow/jobs/us-central1/2021-01-30_10_31_04-13917787379583478240?project=apache-beam-testing
Worker logs: https://console.cloud.google.com/dataflow/jobs/us-central1/2021-01-30_10_38_08-907215236736862424?project=apache-beam-testing
Worker logs: https://console.cloud.google.com/dataflow/jobs/us-central1/2021-01-30_10_45_00-12461862534426222370?project=apache-beam-testing
Worker logs: https://console.cloud.google.com/dataflow/jobs/us-central1/2021-01-30_10_52_52-4915687280683770921?project=apache-beam-testing
Worker logs: https://console.cloud.google.com/dataflow/jobs/us-central1/2021-01-30_11_00_50-17109883539504276956?project=apache-beam-testing
Worker logs: https://console.cloud.google.com/dataflow/jobs/us-central1/2021-01-30_10_05_54-259958211617528791?project=apache-beam-testing
Worker logs: https://console.cloud.google.com/dataflow/jobs/us-central1/2021-01-30_10_15_42-1764872806558483477?project=apache-beam-testing
Worker logs: https://console.cloud.google.com/dataflow/jobs/us-central1/2021-01-30_10_24_29-9582943159345745733?project=apache-beam-testing
Worker logs: https://console.cloud.google.com/dataflow/jobs/us-central1/2021-01-30_10_34_59-17858629179218284059?project=apache-beam-testing
Worker logs: https://console.cloud.google.com/dataflow/jobs/us-central1/2021-01-30_10_43_24-547465175563343253?project=apache-beam-testing
Worker logs: https://console.cloud.google.com/dataflow/jobs/us-central1/2021-01-30_10_51_21-12021223924817462290?project=apache-beam-testing
Worker logs: https://console.cloud.google.com/dataflow/jobs/us-central1/2021-01-30_11_00_00-9271811613664299491?project=apache-beam-testing
Worker logs: https://console.cloud.google.com/dataflow/jobs/us-central1/2021-01-30_11_07_59-6784544427504275028?project=apache-beam-testing
test_autocomplete_it (apache_beam.examples.complete.autocomplete_test.AutocompleteTest) ...
ok
test_bigquery_tornadoes_it (apache_beam.examples.cookbook.bigquery_tornadoes_it_test.BigqueryTornadoesIT)
... ok
test_streaming_wordcount_debugging_it (apache_beam.examples.streaming_wordcount_debugging_it_test.StreamingWordcountDebuggingIT)
... SKIP: Skipped due to [BEAM-3377]: assert_that not working for streaming
test_datastore_wordcount_it (apache_beam.examples.cookbook.datastore_wordcount_it_test.DatastoreWordCountIT)
... ok
test_leader_board_it (apache_beam.examples.complete.game.leader_board_it_test.LeaderBoardIT)
... ok
test_run_example_with_setup_file (apache_beam.examples.complete.juliaset.juliaset.juliaset_test_it.JuliaSetTestIT)
... ok
test_game_stats_it (apache_beam.examples.complete.game.game_stats_it_test.GameStatsIT) ...
ok
test_streaming_wordcount_it (apache_beam.examples.streaming_wordcount_it_test.StreamingWordCountIT)
... ok
test_user_score_it (apache_beam.examples.complete.game.user_score_it_test.UserScoreIT) ...
ok
test_wordcount_fnapi_it (apache_beam.examples.wordcount_it_test.WordCountIT) ... ok
test_hourly_team_score_it (apache_beam.examples.complete.game.hourly_team_score_it_test.HourlyTeamScoreIT)
... ok
test_wordcount_it (apache_beam.examples.wordcount_it_test.WordCountIT) ... ok
test_read_queries (apache_beam.io.gcp.bigquery_read_it_test.ReadAllBQTests) ... ok
test_avro_it (apache_beam.examples.fastavro_it_test.FastavroIT) ... ok
test_read_via_sql (apache_beam.io.gcp.experimental.spannerio_read_it_test.SpannerReadIntegrationTest)
... ok
test_read_via_table (apache_beam.io.gcp.experimental.spannerio_read_it_test.SpannerReadIntegrationTest)
... ok
test_bigquery_read_1M_python (apache_beam.io.gcp.bigquery_io_read_it_test.BigqueryIOReadIT)
... ok
test_bigquery_read_custom_1M_python (apache_beam.io.gcp.bigquery_io_read_it_test.BigqueryIOReadIT)
... ok
test_bqfl_streaming (apache_beam.io.gcp.bigquery_file_loads_test.BigQueryFileLoadsIT) ...
SKIP: TestStream is not supported on TestDataflowRunner
test_multiple_destinations_transform (apache_beam.io.gcp.bigquery_file_loads_test.BigQueryFileLoadsIT)
... ok
test_one_job_fails_all_jobs_fail (apache_beam.io.gcp.bigquery_file_loads_test.BigQueryFileLoadsIT)
... ok
test_avro_file_load (apache_beam.io.gcp.bigquery_test.BigQueryFileLoadsIntegrationTests) ...
ok
test_spanner_error (apache_beam.io.gcp.experimental.spannerio_write_it_test.SpannerWriteIntegrationTest)
... ok
test_spanner_update (apache_beam.io.gcp.experimental.spannerio_write_it_test.SpannerWriteIntegrationTest)
... ok
test_write_batches (apache_beam.io.gcp.experimental.spannerio_write_it_test.SpannerWriteIntegrationTest)
... ok
test_iobase_source (apache_beam.io.gcp.bigquery_read_it_test.ReadNewTypesTests) ... ok
test_native_source (apache_beam.io.gcp.bigquery_read_it_test.ReadNewTypesTests) ... ok
test_multiple_destinations_transform (apache_beam.io.gcp.bigquery_test.BigQueryStreamingInsertTransformIntegrationTests)
... ok
test_iobase_source (apache_beam.io.gcp.bigquery_read_it_test.ReadTests) ... ok
test_native_source (apache_beam.io.gcp.bigquery_read_it_test.ReadTests) ... ok
test_copy (apache_beam.io.gcp.gcsio_integration_test.GcsIOIntegrationTest) ... ok
test_copy_batch (apache_beam.io.gcp.gcsio_integration_test.GcsIOIntegrationTest) ... ok
test_copy_batch_kms (apache_beam.io.gcp.gcsio_integration_test.GcsIOIntegrationTest) ... ok
test_copy_batch_rewrite_token (apache_beam.io.gcp.gcsio_integration_test.GcsIOIntegrationTest)
... ok
test_copy_kms (apache_beam.io.gcp.gcsio_integration_test.GcsIOIntegrationTest) ... ok
test_copy_rewrite_token (apache_beam.io.gcp.gcsio_integration_test.GcsIOIntegrationTest) ...
ok
test_value_provider_transform (apache_beam.io.gcp.bigquery_test.BigQueryStreamingInsertTransformIntegrationTests)
... ok
test_datastore_write_limit (apache_beam.io.gcp.datastore.v1new.datastore_write_it_test.DatastoreWriteIT)
... ok
test_transform_on_gcs (apache_beam.io.fileio_test.MatchIntegrationTest) ... ok
test_parquetio_it (apache_beam.io.parquetio_it_test.TestParquetIT) ... ok
test_streaming_data_only (apache_beam.io.gcp.pubsub_integration_test.PubSubIntegrationTest)
... ok
test_streaming_with_attributes (apache_beam.io.gcp.pubsub_integration_test.PubSubIntegrationTest)
... ok
test_dicom_search_instances (apache_beam.io.gcp.dicomio_integration_test.DICOMIoIntegrationTest)
... ok
test_dicom_store_instance_from_gcs (apache_beam.io.gcp.dicomio_integration_test.DICOMIoIntegrationTest)
... ok
test_analyzing_syntax (apache_beam.ml.gcp.naturallanguageml_test_it.NaturalLanguageMlTestIT)
... ok
test_label_detection_with_video_context (apache_beam.ml.gcp.videointelligenceml_test_it.VideoIntelligenceMlTestIT)
... ok
test_big_query_write (apache_beam.io.gcp.bigquery_write_it_test.BigQueryWriteIntegrationTests)
... ok
test_big_query_write_new_types (apache_beam.io.gcp.bigquery_write_it_test.BigQueryWriteIntegrationTests)
... ok
test_big_query_write_schema_autodetect (apache_beam.io.gcp.bigquery_write_it_test.BigQueryWriteIntegrationTests)
... SKIP: DataflowRunner does not support schema autodetection
test_big_query_write_without_schema (apache_beam.io.gcp.bigquery_write_it_test.BigQueryWriteIntegrationTests)
... ok
test_basic_execution (apache_beam.testing.test_stream_it_test.TestStreamIntegrationTests)
... SKIP: The "TestDataflowRunner", does not support the TestStream transform. Supported runners:
['DirectRunner', 'SwitchingDirectRunner']
Tests that the TestStream supports emitting to multiple PCollections. ... SKIP: The "TestDataflowRunner",
does not support the TestStream transform. Supported runners: ['DirectRunner', 'SwitchingDirectRunner']
Tests that the TestStream can independently control output watermarks. ... SKIP: The "TestDataflowRunner",
does not support the TestStream transform. Supported runners: ['DirectRunner', 'SwitchingDirectRunner']
test_text_detection_with_language_hint (apache_beam.ml.gcp.visionml_test_it.VisionMlTestIT)
... ok
Runs streaming Dataflow job and verifies that user metrics are reported ... ok
test_big_query_legacy_sql (apache_beam.io.gcp.big_query_query_to_table_it_test.BigQueryQueryToTableIT)
... ok
test_big_query_new_types (apache_beam.io.gcp.big_query_query_to_table_it_test.BigQueryQueryToTableIT)
... ok
test_big_query_new_types_avro (apache_beam.io.gcp.big_query_query_to_table_it_test.BigQueryQueryToTableIT)
... ok
test_big_query_new_types_native (apache_beam.io.gcp.big_query_query_to_table_it_test.BigQueryQueryToTableIT)
... ok
test_big_query_standard_sql (apache_beam.io.gcp.big_query_query_to_table_it_test.BigQueryQueryToTableIT)
... ok
test_big_query_standard_sql_kms_key_native (apache_beam.io.gcp.big_query_query_to_table_it_test.BigQueryQueryToTableIT)
... ok
test_deidentification (apache_beam.ml.gcp.cloud_dlp_it_test.CloudDLPIT) ... ok
test_inspection (apache_beam.ml.gcp.cloud_dlp_it_test.CloudDLPIT) ... ok
test_job_python_from_python_it (apache_beam.transforms.external_it_test.ExternalTransformIT)
... ok
test_file_loads (apache_beam.io.gcp.bigquery_test.PubSubBigQueryIT) ... ok
test_streaming_inserts (apache_beam.io.gcp.bigquery_test.PubSubBigQueryIT) ... ok
test_metrics_fnapi_it (apache_beam.runners.dataflow.dataflow_exercise_metrics_pipeline_test.ExerciseMetricsPipelineTest)
... ok
test_metrics_it (apache_beam.runners.dataflow.dataflow_exercise_metrics_pipeline_test.ExerciseMetricsPipelineTest)
... ok

----------------------------------------------------------------------
XML: nosetests-postCommitIT-df-py36.xml
----------------------------------------------------------------------
XML: <https://ci-beam.apache.org/job/beam_PostCommit_Python36/ws/src/sdks/python/nosetests.xml>
----------------------------------------------------------------------
Ran 68 tests in 4369.597s

OK (SKIP=6)

FAILURE: Build failed with an exception.

* Where:
Script '<https://ci-beam.apache.org/job/beam_PostCommit_Python36/ws/src/sdks/python/test-suites/portable/common.gradle'>
line: 197

* What went wrong:
Execution failed for task ':sdks:python:test-suites:portable:py36:postCommitPy36IT'.
> Process 'command 'sh'' finished with non-zero exit value 1

* Try:
Run with --stacktrace option to get the stack trace. Run with --info or --debug option to
get more log output. Run with --scan to get full insights.

* Get more help at https://help.gradle.org

Deprecated Gradle features were used in this build, making it incompatible with Gradle 7.0.
Use '--warning-mode all' to show the individual deprecation warnings.
See https://docs.gradle.org/6.8/userguide/command_line_interface.html#sec:command_line_warnings

BUILD FAILED in 1h 17m 28s
213 actionable tasks: 151 executed, 58 from cache, 4 up-to-date
Gradle was unable to watch the file system for changes. The inotify watches limit is too low.

Publishing build scan...
https://gradle.com/s/kodfi73dnslpa

Build step 'Invoke Gradle script' changed build result to FAILURE
Build step 'Invoke Gradle script' marked build as failure

---------------------------------------------------------------------
To unsubscribe, e-mail: builds-unsubscribe@beam.apache.org
For additional commands, e-mail: builds-help@beam.apache.org


Mime
View raw message