beam-builds mailing list archives

Site index · List index
Message view « Date » · « Thread »
Top « Date » · « Thread »
From Apache Jenkins Server <jenk...@builds.apache.org>
Subject Build failed in Jenkins: beam_LoadTests_Go_CoGBK_Flink_batch #31
Date Thu, 07 Jan 2021 08:45:11 GMT
See <https://ci-beam.apache.org/job/beam_LoadTests_Go_CoGBK_Flink_batch/31/display/redirect?page=changes>

Changes:

[Pablo Estrada] Fix for Java container release

[nosacky] Fix sdk.properties caching, remove timestamp.

[anant.damle] replace Assert.asserThat with MacherAssert.assertThat across entire

[anant.damle] [BEAM-11572] Add lint rule to avoid Assert.assertThat usage

[anant.damle] Fix Assertion in Nexmark (non-test) class.

[Pablo Estrada] [BEAM-11569] Building wheels with airflow-clone of github-push action

[Pablo Estrada] [BEAM-11569] Fixing cancel workflows

[noreply] [BEAM-11415] Add Dataflow Runner to new Go ValidatesRunner framework.


------------------------------------------
[...truncated 55.50 KB...]
  coders: <
    key: "c4"
    value: <
      spec: <
        urn: "beam:coder:length_prefix:v1"
      >
      component_coder_ids: "c3"
    >
  >
  coders: <
    key: "c5"
    value: <
      spec: <
        urn: "beam:coder:kv:v1"
      >
      component_coder_ids: "c4"
      component_coder_ids: "c0"
    >
  >
  coders: <
    key: "c6"
    value: <
      spec: <
        urn: "beam:coder:kv:v1"
      >
      component_coder_ids: "c0"
      component_coder_ids: "c5"
    >
  >
  coders: <
    key: "c7"
    value: <
      spec: <
        urn: "beam:coder:iterable:v1"
      >
      component_coder_ids: "c5"
    >
  >
  coders: <
    key: "c8"
    value: <
      spec: <
        urn: "beam:coder:kv:v1"
      >
      component_coder_ids: "c0"
      component_coder_ids: "c7"
    >
  >
  coders: <
    key: "c9"
    value: <
      spec: <
        urn: "beam:go:coder:cogbklist:v1"
      >
      component_coder_ids: "c0"
      component_coder_ids: "c0"
    >
  >
  environments: <
    key: "go"
    value: <
      urn: "beam:env:docker:v1"
      payload: "\n>gcr.io/apache-beam-testing/beam_portability/beam_go_sdk:latest"
      capabilities: "beam:protocol:progress_reporting:v0"
      capabilities: "beam:protocol:multi_core_bundle_processing:v1"
      capabilities: "beam:version:sdk_base:go"
      capabilities: "beam:coder:bytes:v1"
      capabilities: "beam:coder:bool:v1"
      capabilities: "beam:coder:varint:v1"
      capabilities: "beam:coder:double:v1"
      capabilities: "beam:coder:string_utf8:v1"
      capabilities: "beam:coder:length_prefix:v1"
      capabilities: "beam:coder:kv:v1"
      capabilities: "beam:coder:iterable:v1"
      capabilities: "beam:coder:state_backed_iterable:v1"
      capabilities: "beam:coder:windowed_value:v1"
      capabilities: "beam:coder:global_window:v1"
      capabilities: "beam:coder:interval_window:v1"
      dependencies: <
        type_urn: "beam:artifact:type:go_****_binary:v1"
        role_urn: "beam:artifact:role:staging_to:v1"
        role_payload: "\n\006****"
      >
    >
  >
>
root_transform_ids: "s2"
root_transform_ids: "e8"
root_transform_ids: "s1"
root_transform_ids: "e4"
root_transform_ids: "e9_cogbk"
root_transform_ids: "e10"
root_transform_ids: "e11"
requirements: "beam:requirement:pardo:splittable_dofn:v1"
2021/01/07 08:32:39 Prepared job with id: load-tests-go-flink-batch-cogbk-2-0107065553_0cc98345-4d85-4a91-89fd-0d8618a42f84
and staging token: load-tests-go-flink-batch-cogbk-2-0107065553_0cc98345-4d85-4a91-89fd-0d8618a42f84
2021/01/07 08:32:39 Using specified **** binary: 'linux_amd64/cogbk'
2021/01/07 08:32:43 Staged binary artifact with token: 
2021/01/07 08:32:43 Submitted job: load0tests0go0flink0batch0cogbk0200107065553-root-0107083243-96aa208b_b277f615-78cf-42ba-8a91-7bd0570700be
2021/01/07 08:32:44 Job state: STOPPED
2021/01/07 08:32:44 Job state: STARTING
2021/01/07 08:32:44 Job state: RUNNING
2021/01/07 08:45:09  (): java.util.concurrent.ExecutionException: org.apache.flink.client.program.ProgramInvocationException:
Job failed (JobID: 49205ff6574d1a2730e7024ccacd34fe)
	at java.util.concurrent.CompletableFuture.reportGet(CompletableFuture.java:357)
	at java.util.concurrent.CompletableFuture.get(CompletableFuture.java:1908)
	at org.apache.flink.api.java.ExecutionEnvironment.execute(ExecutionEnvironment.java:864)
	at org.apache.beam.runners.flink.FlinkBatchPortablePipelineTranslator$BatchTranslationContext.execute(FlinkBatchPortablePipelineTranslator.java:199)
	at org.apache.beam.runners.flink.FlinkPipelineRunner.runPipelineWithTranslator(FlinkPipelineRunner.java:118)
	at org.apache.beam.runners.flink.FlinkPipelineRunner.run(FlinkPipelineRunner.java:85)
	at org.apache.beam.runners.jobsubmission.JobInvocation.runPipeline(JobInvocation.java:86)
	at org.apache.beam.vendor.guava.v26_0_jre.com.google.common.util.concurrent.TrustedListenableFutureTask$TrustedFutureInterruptibleTask.runInterruptibly(TrustedListenableFutureTask.java:125)
	at org.apache.beam.vendor.guava.v26_0_jre.com.google.common.util.concurrent.InterruptibleTask.run(InterruptibleTask.java:57)
	at org.apache.beam.vendor.guava.v26_0_jre.com.google.common.util.concurrent.TrustedListenableFutureTask.run(TrustedListenableFutureTask.java:78)
	at java.util.concurrent.ThreadPoolExecutor.runWorker(ThreadPoolExecutor.java:1149)
	at java.util.concurrent.ThreadPoolExecutor$Worker.run(ThreadPoolExecutor.java:624)
	at java.lang.Thread.run(Thread.java:748)
Caused by: org.apache.flink.client.program.ProgramInvocationException: Job failed (JobID:
49205ff6574d1a2730e7024ccacd34fe)
	at org.apache.flink.client.deployment.ClusterClientJobClientAdapter.lambda$null$6(ClusterClientJobClientAdapter.java:112)
	at java.util.concurrent.CompletableFuture.uniApply(CompletableFuture.java:616)
	at java.util.concurrent.CompletableFuture$UniApply.tryFire(CompletableFuture.java:591)
	at java.util.concurrent.CompletableFuture.postComplete(CompletableFuture.java:488)
	at java.util.concurrent.CompletableFuture.complete(CompletableFuture.java:1975)
	at org.apache.flink.client.program.rest.RestClusterClient.lambda$pollResourceAsync$21(RestClusterClient.java:565)
	at java.util.concurrent.CompletableFuture.uniWhenComplete(CompletableFuture.java:774)
	at java.util.concurrent.CompletableFuture$UniWhenComplete.tryFire(CompletableFuture.java:750)
	at java.util.concurrent.CompletableFuture.postComplete(CompletableFuture.java:488)
	at java.util.concurrent.CompletableFuture.complete(CompletableFuture.java:1975)
	at org.apache.flink.runtime.concurrent.FutureUtils.lambda$retryOperationWithDelay$8(FutureUtils.java:291)
	at java.util.concurrent.CompletableFuture.uniWhenComplete(CompletableFuture.java:774)
	at java.util.concurrent.CompletableFuture$UniWhenComplete.tryFire(CompletableFuture.java:750)
	at java.util.concurrent.CompletableFuture.postComplete(CompletableFuture.java:488)
	at java.util.concurrent.CompletableFuture.postFire(CompletableFuture.java:575)
	at java.util.concurrent.CompletableFuture$UniCompose.tryFire(CompletableFuture.java:943)
	at java.util.concurrent.CompletableFuture$Completion.run(CompletableFuture.java:456)
	... 3 more
Caused by: org.apache.flink.runtime.client.JobExecutionException: Job execution failed.
	at org.apache.flink.runtime.jobmaster.JobResult.toJobExecutionResult(JobResult.java:147)
	at org.apache.flink.client.deployment.ClusterClientJobClientAdapter.lambda$null$6(ClusterClientJobClientAdapter.java:110)
	... 19 more
Caused by: org.apache.flink.runtime.JobException: Recovery is suppressed by NoRestartBackoffTimeStrategy
	at org.apache.flink.runtime.executiongraph.failover.flip1.ExecutionFailureHandler.handleFailure(ExecutionFailureHandler.java:110)
	at org.apache.flink.runtime.executiongraph.failover.flip1.ExecutionFailureHandler.getFailureHandlingResult(ExecutionFailureHandler.java:76)
	at org.apache.flink.runtime.scheduler.DefaultScheduler.handleTaskFailure(DefaultScheduler.java:192)
	at org.apache.flink.runtime.scheduler.DefaultScheduler.maybeHandleTaskFailure(DefaultScheduler.java:186)
	at org.apache.flink.runtime.scheduler.DefaultScheduler.updateTaskExecutionStateInternal(DefaultScheduler.java:180)
	at org.apache.flink.runtime.scheduler.SchedulerBase.updateTaskExecutionState(SchedulerBase.java:496)
	at org.apache.flink.runtime.jobmaster.JobMaster.updateTaskExecutionState(JobMaster.java:380)
	at sun.reflect.GeneratedMethodAccessor23.invoke(Unknown Source)
	at sun.reflect.DelegatingMethodAccessorImpl.invoke(DelegatingMethodAccessorImpl.java:43)
	at java.lang.reflect.Method.invoke(Method.java:498)
	at org.apache.flink.runtime.rpc.akka.AkkaRpcActor.handleRpcInvocation(AkkaRpcActor.java:284)
	at org.apache.flink.runtime.rpc.akka.AkkaRpcActor.handleRpcMessage(AkkaRpcActor.java:199)
	at org.apache.flink.runtime.rpc.akka.FencedAkkaRpcActor.handleRpcMessage(FencedAkkaRpcActor.java:74)
	at org.apache.flink.runtime.rpc.akka.AkkaRpcActor.handleMessage(AkkaRpcActor.java:152)
	at akka.japi.pf.UnitCaseStatement.apply(CaseStatements.scala:26)
	at akka.japi.pf.UnitCaseStatement.apply(CaseStatements.scala:21)
	at scala.PartialFunction$class.applyOrElse(PartialFunction.scala:123)
	at akka.japi.pf.UnitCaseStatement.applyOrElse(CaseStatements.scala:21)
	at scala.PartialFunction$OrElse.applyOrElse(PartialFunction.scala:170)
	at scala.PartialFunction$OrElse.applyOrElse(PartialFunction.scala:171)
	at scala.PartialFunction$OrElse.applyOrElse(PartialFunction.scala:171)
	at akka.actor.Actor$class.aroundReceive(Actor.scala:517)
	at akka.actor.AbstractActor.aroundReceive(AbstractActor.scala:225)
	at akka.actor.ActorCell.receiveMessage(ActorCell.scala:592)
	at akka.actor.ActorCell.invoke(ActorCell.scala:561)
	at akka.dispatch.Mailbox.processMailbox(Mailbox.scala:258)
	at akka.dispatch.Mailbox.run(Mailbox.scala:225)
	at akka.dispatch.Mailbox.exec(Mailbox.scala:235)
	at akka.dispatch.forkjoin.ForkJoinTask.doExec(ForkJoinTask.java:260)
	at akka.dispatch.forkjoin.ForkJoinPool$WorkQueue.runTask(ForkJoinPool.java:1339)
	at akka.dispatch.forkjoin.ForkJoinPool.runWorker(ForkJoinPool.java:1979)
	at akka.dispatch.forkjoin.ForkJoinWorkerThread.run(ForkJoinWorkerThread.java:107)
Caused by: java.lang.RuntimeException: Emitting the record caused an I/O exception: Failed
to serialize element. Serialized size (> 268435833 bytes) exceeds JVM heap space
	at org.apache.flink.runtime.operators.shipping.OutputCollector.collect(OutputCollector.java:69)
	at org.apache.flink.runtime.operators.util.metrics.CountingCollector.collect(CountingCollector.java:35)
	at org.apache.beam.runners.flink.translation.functions.SortingFlinkCombineRunner.combine(SortingFlinkCombineRunner.java:141)
	at org.apache.beam.runners.flink.translation.functions.FlinkReduceFunction.reduce(FlinkReduceFunction.java:109)
	at org.apache.flink.api.java.operators.translation.PlanUnwrappingReduceGroupOperator$TupleUnwrappingNonCombinableGroupReducer.reduce(PlanUnwrappingReduceGroupOperator.java:111)
	at org.apache.flink.runtime.operators.GroupReduceDriver.run(GroupReduceDriver.java:131)
	at org.apache.flink.runtime.operators.BatchTask.run(BatchTask.java:504)
	at org.apache.flink.runtime.operators.BatchTask.invoke(BatchTask.java:369)
	at org.apache.flink.runtime.taskmanager.Task.doRun(Task.java:708)
	at org.apache.flink.runtime.taskmanager.Task.run(Task.java:533)
	at java.lang.Thread.run(Thread.java:748)
Caused by: java.io.IOException: Failed to serialize element. Serialized size (> 268435833
bytes) exceeds JVM heap space
	at org.apache.flink.core.memory.DataOutputSerializer.resize(DataOutputSerializer.java:334)
	at org.apache.flink.core.memory.DataOutputSerializer.write(DataOutputSerializer.java:136)
	at org.apache.beam.runners.flink.translation.wrappers.DataOutputViewWrapper.write(DataOutputViewWrapper.java:39)
	at java.io.DataOutputStream.write(DataOutputStream.java:88)
	at org.apache.beam.sdk.util.VarInt.encode(VarInt.java:50)
	at org.apache.beam.sdk.util.VarInt.encode(VarInt.java:40)
	at org.apache.beam.sdk.coders.LengthPrefixCoder.encode(LengthPrefixCoder.java:57)
	at org.apache.beam.sdk.coders.KvCoder.encode(KvCoder.java:72)
	at org.apache.beam.sdk.coders.KvCoder.encode(KvCoder.java:63)
	at org.apache.beam.sdk.coders.KvCoder.encode(KvCoder.java:37)
	at org.apache.beam.sdk.coders.IterableLikeCoder.encode(IterableLikeCoder.java:114)
	at org.apache.beam.sdk.coders.IterableLikeCoder.encode(IterableLikeCoder.java:60)
	at org.apache.beam.sdk.coders.Coder.encode(Coder.java:136)
	at org.apache.beam.sdk.coders.KvCoder.encode(KvCoder.java:73)
	at org.apache.beam.sdk.coders.KvCoder.encode(KvCoder.java:37)
	at org.apache.beam.sdk.util.WindowedValue$FullWindowedValueCoder.encode(WindowedValue.java:591)
	at org.apache.beam.sdk.util.WindowedValue$FullWindowedValueCoder.encode(WindowedValue.java:582)
	at org.apache.beam.sdk.util.WindowedValue$FullWindowedValueCoder.encode(WindowedValue.java:542)
	at org.apache.beam.runners.flink.translation.types.CoderTypeSerializer.serialize(CoderTypeSerializer.java:111)
	at org.apache.flink.runtime.plugable.SerializationDelegate.write(SerializationDelegate.java:54)
	at org.apache.flink.runtime.io.network.api.serialization.SpanningRecordSerializer.serializeRecord(SpanningRecordSerializer.java:71)
	at org.apache.flink.runtime.io.network.api.writer.RecordWriter.emit(RecordWriter.java:113)
	at org.apache.flink.runtime.io.network.api.writer.ChannelSelectorRecordWriter.emit(ChannelSelectorRecordWriter.java:60)
	at org.apache.flink.runtime.operators.shipping.OutputCollector.collect(OutputCollector.java:65)
	... 10 more
Caused by: java.lang.OutOfMemoryError: Java heap space
2021/01/07 08:45:09  (): java.lang.OutOfMemoryError: Java heap space
2021/01/07 08:45:09 Job state: FAILED
2021/01/07 08:45:09 Failed to execute job: job load0tests0go0flink0batch0cogbk0200107065553-root-0107083243-96aa208b_b277f615-78cf-42ba-8a91-7bd0570700be
failed
panic: Failed to execute job: job load0tests0go0flink0batch0cogbk0200107065553-root-0107083243-96aa208b_b277f615-78cf-42ba-8a91-7bd0570700be
failed

goroutine 1 [running]:
github.com/apache/beam/sdks/go/test/load/vendor/github.com/apache/beam/sdks/go/pkg/beam/log.Fatalf(0x1191ce0,
0xc00003e0b0, 0x1051650, 0x19, 0xc00035dee8, 0x1, 0x1)
	<https://ci-beam.apache.org/job/beam_LoadTests_Go_CoGBK_Flink_batch/ws/src/sdks/go/test/load/.gogradle/project_gopath/src/github.com/apache/beam/sdks/go/test/load/vendor/github.com/apache/beam/sdks/go/pkg/beam/log/log.go>:153
+0xec
main.main()
	<https://ci-beam.apache.org/job/beam_LoadTests_Go_CoGBK_Flink_batch/ws/src/sdks/go/test/load/.gogradle/project_gopath/src/github.com/apache/beam/sdks/go/test/load/cogbk/cogbk.go>:99
+0x577

> Task :sdks:go:test:load:run FAILED

FAILURE: Build failed with an exception.

* Where:
Build file '<https://ci-beam.apache.org/job/beam_LoadTests_Go_CoGBK_Flink_batch/ws/src/sdks/go/test/load/build.gradle'>
line: 65

* What went wrong:
Execution failed for task ':sdks:go:test:load:run'.
> Process 'command 'sh'' finished with non-zero exit value 2

* Try:
Run with --stacktrace option to get the stack trace. Run with --info or --debug option to
get more log output. Run with --scan to get full insights.

* Get more help at https://help.gradle.org

Deprecated Gradle features were used in this build, making it incompatible with Gradle 7.0.
Use '--warning-mode all' to show the individual deprecation warnings.
See https://docs.gradle.org/6.7.1/userguide/command_line_interface.html#sec:command_line_warnings

BUILD FAILED in 16m 16s
6 actionable tasks: 6 executed

Publishing build scan...
https://gradle.com/s/vztxygnqzsl4k

Build step 'Invoke Gradle script' changed build result to FAILURE
Build step 'Invoke Gradle script' marked build as failure

---------------------------------------------------------------------
To unsubscribe, e-mail: builds-unsubscribe@beam.apache.org
For additional commands, e-mail: builds-help@beam.apache.org


Mime
View raw message