beam-builds mailing list archives

Site index · List index
Message view « Date » · « Thread »
Top « Date » · « Thread »
From Apache Jenkins Server <jenk...@builds.apache.org>
Subject Build failed in Jenkins: beam_PostCommit_XVR_Flink #3470
Date Fri, 08 Jan 2021 00:26:22 GMT
See <https://ci-beam.apache.org/job/beam_PostCommit_XVR_Flink/3470/display/redirect?page=changes>

Changes:

[dcavazos] [BEAM-10983] Add getting started from Spark page

[dcavazos] Add "From Apache Spark" entry to side menu

[dcavazos] Add links to transform catalog

[dcavazos] Add more links

[dcavazos] Add RDD/DataFrame clarification

[dcavazos] Add link to from-spark page

[dcavazos] Added extra explanations

[dcavazos] Fixed typos + removed italics

[Kyle Weaver] [BEAM-11504] Clean up direct runner parallelism section.

[Robert Bradshaw] [BEAM-1833] Give transforms more control over the names of their inputs

[Ismaël Mejía] [BEAM-11419] Update Flink supported versions in the website

[noreply] Clarify some assertions (#13515)

[Robert Bradshaw] mypy

[noreply] Revert "[BEAM-11474] Track transform processing thread in Java SDK


------------------------------------------
[...truncated 90.05 KB...]
Requirement already satisfied: pluggy<1.0,>=0.12 in <https://ci-beam.apache.org/job/beam_PostCommit_XVR_Flink/ws/src/build/gradleenv/1922375555/lib/python3.6/site-packages>
(from pytest<5.0,>=4.4.0->apache-beam==2.28.0.dev0) (0.13.1)
Requirement already satisfied: importlib-metadata>=0.12 in <https://ci-beam.apache.org/job/beam_PostCommit_XVR_Flink/ws/src/build/gradleenv/1922375555/lib/python3.6/site-packages>
(from pytest<5.0,>=4.4.0->apache-beam==2.28.0.dev0) (3.3.0)
Requirement already satisfied: py>=1.5.0 in <https://ci-beam.apache.org/job/beam_PostCommit_XVR_Flink/ws/src/build/gradleenv/1922375555/lib/python3.6/site-packages>
(from pytest<5.0,>=4.4.0->apache-beam==2.28.0.dev0) (1.10.0)
Collecting atomicwrites>=1.0
  Using cached atomicwrites-1.4.0-py2.py3-none-any.whl (6.8 kB)
Collecting attrs>=17.4.0
  Using cached attrs-20.3.0-py2.py3-none-any.whl (49 kB)
Requirement already satisfied: zipp>=0.5 in <https://ci-beam.apache.org/job/beam_PostCommit_XVR_Flink/ws/src/build/gradleenv/1922375555/lib/python3.6/site-packages>
(from importlib-metadata>=0.12->pytest<5.0,>=4.4.0->apache-beam==2.28.0.dev0)
(3.4.0)
Collecting more-itertools>=4.0.0
  Using cached more_itertools-8.6.0-py3-none-any.whl (45 kB)
Collecting pytest-timeout<2,>=1.3.3
  Using cached pytest_timeout-1.4.2-py2.py3-none-any.whl (10 kB)
Collecting pytest-xdist<2,>=1.29.0
  Using cached pytest_xdist-1.34.0-py2.py3-none-any.whl (36 kB)
Collecting execnet>=1.1
  Using cached execnet-1.7.1-py2.py3-none-any.whl (39 kB)
Collecting apipkg>=1.4
  Using cached apipkg-1.5-py2.py3-none-any.whl (4.9 kB)
Collecting python-dateutil<3,>=2.8.0
  Using cached python_dateutil-2.8.1-py2.py3-none-any.whl (227 kB)
Collecting pytz>=2018.3
  Using cached pytz-2020.5-py2.py3-none-any.whl (510 kB)
Collecting pyyaml<6.0.0,>=3.12
  Using cached PyYAML-5.3.1-cp36-cp36m-linux_x86_64.whl
Collecting requests<3.0.0,>=2.24.0
  Using cached requests-2.25.1-py2.py3-none-any.whl (61 kB)
Collecting chardet<5,>=3.0.2
  Using cached chardet-4.0.0-py2.py3-none-any.whl (178 kB)
Collecting idna<3,>=2.5
  Using cached idna-2.10-py2.py3-none-any.whl (58 kB)
Collecting requests_mock<2.0,>=1.7
  Using cached requests_mock-1.8.0-py2.py3-none-any.whl (23 kB)
Collecting requests-oauthlib>=0.5.0
  Using cached requests_oauthlib-1.3.0-py2.py3-none-any.whl (23 kB)
Collecting oauthlib>=3.0.0
  Using cached oauthlib-3.1.0-py2.py3-none-any.whl (147 kB)
Collecting rsa<5,>=3.1.4
  Using cached rsa-4.6-py3-none-any.whl (47 kB)
Collecting s3transfer<0.4.0,>=0.3.0
  Using cached s3transfer-0.3.3-py2.py3-none-any.whl (69 kB)
Collecting sqlalchemy<2.0,>=1.3
  Using cached SQLAlchemy-1.3.22-cp36-cp36m-manylinux2010_x86_64.whl (1.3 MB)
Collecting tenacity<6.0,>=5.0.2
  Using cached tenacity-5.1.5-py2.py3-none-any.whl (34 kB)
Collecting testcontainers<4.0.0,>=3.0.3
  Using cached testcontainers-3.2.0-py2.py3-none-any.whl
Collecting typing-inspect>=0.4.0
  Using cached typing_inspect-0.6.0-py3-none-any.whl (8.1 kB)
Collecting mypy-extensions>=0.3.0
  Using cached mypy_extensions-0.4.3-py2.py3-none-any.whl (4.5 kB)
Collecting urllib3<1.27,>=1.25.4
  Using cached urllib3-1.26.2-py2.py3-none-any.whl (136 kB)
Collecting deprecation
  Using cached deprecation-2.1.0-py2.py3-none-any.whl (11 kB)
Collecting docker
  Using cached docker-4.4.1-py2.py3-none-any.whl (146 kB)
Collecting websocket-client>=0.32.0
  Using cached websocket_client-0.57.0-py2.py3-none-any.whl (200 kB)
Collecting docopt
  Using cached docopt-0.6.2-py2.py3-none-any.whl
Collecting packaging
  Using cached packaging-20.8-py2.py3-none-any.whl (39 kB)
Collecting pycparser
  Using cached pycparser-2.20-py2.py3-none-any.whl (112 kB)
Collecting pytest-forked
  Using cached pytest_forked-1.3.0-py2.py3-none-any.whl (4.7 kB)
Collecting wcwidth
  Using cached wcwidth-0.2.5-py2.py3-none-any.whl (30 kB)
Collecting wrapt
  Using cached wrapt-1.12.1-cp36-cp36m-linux_x86_64.whl
Building wheels for collected packages: apache-beam
  Building wheel for apache-beam (setup.py): started
  Building wheel for apache-beam (setup.py): finished with status 'done'
  Created wheel for apache-beam: filename=apache_beam-2.28.0.dev0-py3-none-any.whl size=2383171
sha256=e4641d53b88672643bfa7c6a795f83923ca92b0d53b16860df4ea72e7d09f9e3
  Stored in directory: /home/jenkins/.cache/pip/wheels/31/98/b1/9858555ac8fcdc3063e8a81a6f59968f826ee33593c036de9e
Successfully built apache-beam
Installing collected packages: pyasn1, urllib3, rsa, pyparsing, pycparser, pyasn1-modules,
idna, chardet, certifi, cachetools, wcwidth, requests, pytz, python-dateutil, packaging, oauthlib,
mypy-extensions, more-itertools, jmespath, googleapis-common-protos, google-auth, cffi, attrs,
atomicwrites, websocket-client, typing-inspect, requests-oauthlib, pyyaml, pytest, pbr, numpy,
isodate, httplib2, grpcio-gcp, google-crc32c, google-api-core, docopt, dataclasses, botocore,
apipkg, wrapt, s3transfer, pytest-forked, pymongo, pydot, pyarrow, proto-plus, oauth2client,
nose, msrest, mock, libcst, hdfs, grpc-google-iam-v1, google-resumable-media, google-cloud-core,
fasteners, fastavro, execnet, docker, dill, deprecation, cryptography, crcmod, azure-core,
avro-python3, testcontainers, tenacity, sqlalchemy, requests-mock, pytest-xdist, pytest-timeout,
pyhamcrest, psycopg2-binary, parameterized, pandas, nose-xunitmp, google-cloud-vision, google-cloud-videointelligence,
google-cloud-spanner, google-cloud-pubsub, google-cloud-language, google-cloud-dlp, google-cloud-datastore,
google-cloud-build, google-cloud-bigtable, google-cloud-bigquery, google-apitools, freezegun,
boto3, azure-storage-blob, apache-beam

> Task :release:go-licenses:py:dockerRun
+ go-licenses save github.com/apache/beam/sdks/python/container --save_path=/output/licenses
+ tee /output/licenses/list.csv
+ go-licenses csv github.com/apache/beam/sdks/python/container

> Task :sdks:java:harness:compileJava
Note: Some input files use or override a deprecated API.
Note: Recompile with -Xlint:deprecation for details.
Note: Some input files use unchecked or unsafe operations.
Note: Recompile with -Xlint:unchecked for details.

> Task :sdks:java:harness:classes
> Task :sdks:java:harness:jar

> Task :release:go-licenses:py:dockerRun
github.com/golang/protobuf,https://github.com/golang/protobuf/blob/master/LICENSE,BSD-3-Clause
google.golang.org/protobuf,https://go.googlesource.com/protobuf/+/refs/heads/master/LICENSE,BSD-3-Clause
google.golang.org/grpc,https://github.com/grpc/grpc-go/blob/master/LICENSE,Apache-2.0
golang.org/x/net,https://go.googlesource.com/net/+/refs/heads/master/LICENSE,BSD-3-Clause
google.golang.org/genproto/googleapis/rpc/status,https://github.com/googleapis/go-genproto/blob/master/LICENSE,Apache-2.0
github.com/apache/beam/sdks/python/container,https://github.com/apache/beam/blob/master/LICENSE,Apache-2.0
github.com/apache/beam/sdks/go/pkg/beam,https://github.com/apache/beam/blob/master/sdks/go/README.md,Apache-2.0
golang.org/x/sys,https://go.googlesource.com/sys/+/refs/heads/master/LICENSE,BSD-3-Clause
golang.org/x/text,https://go.googlesource.com/text/+/refs/heads/master/LICENSE,BSD-3-Clause
github.com/nightlyone/lockfile,https://github.com/nightlyone/lockfile/blob/master/LICENSE,MIT
+ chmod -R a+w /output/licenses

> Task :sdks:java:harness:shadowJar FROM-CACHE
> Task :release:go-licenses:py:createLicenses
> Task :sdks:python:container:py36:copyGolangLicenses

> Task :sdks:python:installGcpTest
Successfully installed apache-beam-2.28.0.dev0 apipkg-1.5 atomicwrites-1.4.0 attrs-20.3.0
avro-python3-1.9.2.1 azure-core-1.9.0 azure-storage-blob-12.6.0 boto3-1.16.51 botocore-1.19.51
cachetools-4.2.0 certifi-2020.12.5 cffi-1.14.4 chardet-4.0.0 crcmod-1.7 cryptography-3.3.1
dataclasses-0.8 deprecation-2.1.0 dill-0.3.1.1 docker-4.4.1 docopt-0.6.2 execnet-1.7.1 fastavro-1.2.3
fasteners-0.16 freezegun-1.0.0 google-api-core-1.24.1 google-apitools-0.5.31 google-auth-1.24.0
google-cloud-bigquery-1.28.0 google-cloud-bigtable-1.6.1 google-cloud-build-2.0.0 google-cloud-core-1.5.0
google-cloud-datastore-1.15.3 google-cloud-dlp-1.0.0 google-cloud-language-1.3.0 google-cloud-pubsub-1.7.0
google-cloud-spanner-1.19.1 google-cloud-videointelligence-1.16.1 google-cloud-vision-1.0.0
google-crc32c-1.1.0 google-resumable-media-1.2.0 googleapis-common-protos-1.52.0 grpc-google-iam-v1-0.12.3
grpcio-gcp-0.2.2 hdfs-2.5.8 httplib2-0.17.4 idna-2.10 isodate-0.6.0 jmespath-0.10.0 libcst-0.3.16
mock-2.0.0 more-itertools-8.6.0 msrest-0.6.19 mypy-extensions-0.4.3 nose-1.3.7 nose-xunitmp-0.4.1
numpy-1.19.5 oauth2client-4.1.3 oauthlib-3.1.0 packaging-20.8 pandas-1.1.5 parameterized-0.7.5
pbr-5.5.1 proto-plus-1.13.0 psycopg2-binary-2.8.6 pyarrow-2.0.0 pyasn1-0.4.8 pyasn1-modules-0.2.8
pycparser-2.20 pydot-1.4.1 pyhamcrest-1.10.1 pymongo-3.11.2 pyparsing-2.4.7 pytest-4.6.11
pytest-forked-1.3.0 pytest-timeout-1.4.2 pytest-xdist-1.34.0 python-dateutil-2.8.1 pytz-2020.5
pyyaml-5.3.1 requests-2.25.1 requests-mock-1.8.0 requests-oauthlib-1.3.0 rsa-4.6 s3transfer-0.3.3
sqlalchemy-1.3.22 tenacity-5.1.5 testcontainers-3.2.0 typing-inspect-0.6.0 urllib3-1.26.2
wcwidth-0.2.5 websocket-client-0.57.0 wrapt-1.12.1

> Task :sdks:go:resolveBuildDependencies
Resolving golang.org/x/text: commit='23ae387dee1f90d29a23c0e87ee0b46038fbed0e', urls=[https://go.googlesource.com/text]
Resolving cached github.com/etcd-io/etcd: commit='11214aa33bf5a47d3d9d8dafe0f6b97237dfe921',
urls=[https://github.com/etcd-io/etcd.git, git@github.com:etcd-io/etcd.git]

> Task :runners:java-fn-execution:compileJava
Note: Some input files use or override a deprecated API.
Note: Recompile with -Xlint:deprecation for details.
Note: Some input files use unchecked or unsafe operations.
Note: Recompile with -Xlint:unchecked for details.

> Task :runners:java-fn-execution:classes
> Task :runners:java-fn-execution:jar
> Task :sdks:java:expansion-service:compileJava FROM-CACHE
> Task :sdks:java:expansion-service:classes UP-TO-DATE
> Task :sdks:java:expansion-service:jar
> Task :sdks:java:testing:expansion-service:compileJava NO-SOURCE
> Task :sdks:java:testing:expansion-service:classes UP-TO-DATE
> Task :runners:direct-java:compileJava FROM-CACHE
> Task :runners:direct-java:classes UP-TO-DATE
> Task :sdks:java:testing:expansion-service:compileTestJava FROM-CACHE
> Task :sdks:java:testing:expansion-service:testClasses UP-TO-DATE
> Task :runners:java-job-service:compileJava FROM-CACHE
> Task :runners:java-job-service:classes UP-TO-DATE
> Task :sdks:java:io:kafka:compileJava FROM-CACHE
> Task :runners:direct-java:shadowJar FROM-CACHE
> Task :sdks:java:io:kafka:classes UP-TO-DATE
> Task :runners:java-job-service:jar
> Task :sdks:java:io:kafka:jar
> Task :sdks:java:io:google-cloud-platform:compileJava FROM-CACHE
> Task :sdks:java:io:google-cloud-platform:classes UP-TO-DATE
> Task :sdks:java:io:google-cloud-platform:jar
> Task :runners:flink:1.10:compileJava FROM-CACHE
> Task :runners:flink:1.10:classes
> Task :runners:flink:1.10:jar
> Task :runners:flink:1.10:job-server:compileJava NO-SOURCE
> Task :runners:flink:1.10:job-server:classes UP-TO-DATE

> Task :sdks:java:container:java8:copyDockerfileDependencies
Unable to watch the file system for changes. The inotify watches limit is too low.

> Task :sdks:java:extensions:sql:extractIncludeProto
> Task :sdks:java:extensions:sql:generateProto NO-SOURCE
> Task :sdks:java:testing:expansion-service:buildTestExpansionServiceJar FROM-CACHE
> Task :sdks:java:extensions:sql:compileJava FROM-CACHE
> Task :sdks:java:extensions:sql:classes
> Task :sdks:java:extensions:sql:jar
> Task :sdks:java:extensions:sql:zetasql:compileJava FROM-CACHE
> Task :sdks:java:extensions:sql:zetasql:classes UP-TO-DATE
> Task :sdks:java:extensions:sql:zetasql:jar
> Task :sdks:java:extensions:sql:expansion-service:compileJava FROM-CACHE
> Task :sdks:java:extensions:sql:expansion-service:classes UP-TO-DATE
> Task :sdks:java:extensions:sql:expansion-service:jar
> Task :sdks:java:extensions:sql:expansion-service:shadowJar FROM-CACHE
> Task :runners:portability:java:compileJava
> Task :runners:flink:1.10:compileTestJava
> Task :runners:portability:java:classes
> Task :runners:portability:java:jar
> Task :runners:flink:1.10:job-server:shadowJar
> Task :runners:portability:java:compileTestJava
> Task :runners:flink:1.10:job-server:shadowJar FROM-CACHE

> Task :runners:flink:1.10:job-server:flinkJobServerSetup
Launching job server @ 18091 ...

> Task :runners:portability:java:compileTestJava
Note: <https://ci-beam.apache.org/job/beam_PostCommit_XVR_Flink/ws/src/runners/portability/java/src/test/java/org/apache/beam/runners/portability/CloseableResourceTest.java>
uses or overrides a deprecated API.
Note: Recompile with -Xlint:deprecation for details.

> Task :runners:portability:java:testClasses
> Task :runners:portability:java:testJar

> Task :runners:flink:1.10:compileTestJava
Note: Some input files use or override a deprecated API.
Note: Recompile with -Xlint:deprecation for details.
Note: Some input files use unchecked or unsafe operations.
Note: Recompile with -Xlint:unchecked for details.

> Task :runners:flink:1.10:testClasses
> Task :runners:flink:1.10:testJar

> Task :sdks:go:resolveBuildDependencies
Resolving google.golang.org/api: commit='0324d5e90dc7753607860272666845fad9ceb97e', urls=[https://code.googlesource.com/google-api-go-client]
Resolving google.golang.org/genproto: commit='4d944d34d83c502a5f761500a14d8842648415c3', urls=[https://github.com/google/go-genproto]
Resolving google.golang.org/grpc: commit='5e8f83304c0563d1ba74db05fee83d9c18ab9a58', urls=[https://github.com/grpc/grpc-go]
Resolving google.golang.org/protobuf: commit='d165be301fb1e13390ad453281ded24385fd8ebc', urls=[https://go.googlesource.com/protobuf]
Resolving cached github.com/etcd-io/etcd: commit='11214aa33bf5a47d3d9d8dafe0f6b97237dfe921',
urls=[https://github.com/etcd-io/etcd.git, git@github.com:etcd-io/etcd.git]
Resolving cached github.com/etcd-io/etcd: commit='11214aa33bf5a47d3d9d8dafe0f6b97237dfe921',
urls=[https://github.com/etcd-io/etcd.git, git@github.com:etcd-io/etcd.git]

> Task :sdks:go:installDependencies
> Task :sdks:go:buildLinuxAmd64
> Task :sdks:go:goBuild

> Task :sdks:python:container:resolveBuildDependencies
Resolving ./github.com/apache/beam/sdks/go@<https://ci-beam.apache.org/job/beam_PostCommit_XVR_Flink/ws/src/sdks/go>

> Task :sdks:java:container:resolveBuildDependencies
Resolving ./github.com/apache/beam/sdks/go@<https://ci-beam.apache.org/job/beam_PostCommit_XVR_Flink/ws/src/sdks/go>

> Task :sdks:python:container:installDependencies
> Task :sdks:java:container:installDependencies
> Task :sdks:python:container:buildDarwinAmd64
> Task :sdks:java:container:buildLinuxAmd64
> Task :sdks:java:container:goBuild
> Task :sdks:java:container:java8:copySdkHarnessLauncher
> Task :sdks:python:container:buildLinuxAmd64
> Task :sdks:python:container:goBuild
> Task :sdks:python:container:py36:copyLauncherDependencies
> Task :sdks:python:container:py36:dockerPrepare
> Task :sdks:python:container:py36:docker

> Task :runners:flink:1.10:job-server:flinkJobServerCleanup
Stopping job server pid: 22741.

FAILURE: Build failed with an exception.

* What went wrong:
Execution failed for task ':release:go-licenses:java:dockerRun'.
> Process 'command 'docker'' finished with non-zero exit value 1

* Try:
Run with --stacktrace option to get the stack trace. Run with --info or --debug option to
get more log output. Run with --scan to get full insights.

* Get more help at https://help.gradle.org

Deprecated Gradle features were used in this build, making it incompatible with Gradle 7.0.
Use '--warning-mode all' to show the individual deprecation warnings.
See https://docs.gradle.org/6.7.1/userguide/command_line_interface.html#sec:command_line_warnings

BUILD FAILED in 25m 55s
185 actionable tasks: 135 executed, 46 from cache, 4 up-to-date
Gradle was unable to watch the file system for changes. The inotify watches limit is too low.

Publishing build scan...
https://gradle.com/s/ead6dsmsxxy7q

Build step 'Invoke Gradle script' changed build result to FAILURE
Build step 'Invoke Gradle script' marked build as failure

---------------------------------------------------------------------
To unsubscribe, e-mail: builds-unsubscribe@beam.apache.org
For additional commands, e-mail: builds-help@beam.apache.org


Mime
View raw message