beam-builds mailing list archives

Site index · List index
Message view « Date » · « Thread »
Top « Date » · « Thread »
From Apache Jenkins Server <jenk...@builds.apache.org>
Subject Build failed in Jenkins: beam_PostCommit_Java_ValidatesRunner_Direct_Java11 #2067
Date Thu, 28 Jan 2021 00:22:54 GMT
See <https://ci-beam.apache.org/job/beam_PostCommit_Java_ValidatesRunner_Direct_Java11/2067/display/redirect?page=changes>

Changes:

[sonam.ramchand] Enabled strict dependency on flink runner

[sonam.ramchand] Added new line

[sonam.ramchand] removed checker-qual

[sonam.ramchand] Removed flink-clients dep

[sonam.ramchand] set enableStrictDependencies:true

[sonam.ramchand] made flink-clients runtimeOnly

[noreply] Remove stray colon.

[zyichi] [BEAM-11679] Override PubsubUnboundedSource transform for dataflow

[zyichi] Populate PubsubMessage message id

[zyichi] Enable tests

[zyichi] Exclude failing FhirIO ITs

[zyichi] Include runner v2 IT tests in java post commit

[Ismaël Mejía] [BEAM-11697] Upgrade Flink runner to Flink versions 1.12.1 and 1.11.3

[shehzaad] strict dependency checking on sdks/io/amazon-web-services*

[shehzaad] move amazon-web-services* changes to another PR

[shehzaad] undo previous erroneous commit

[shehzaad] better use of variables

[randomstep] [BEAM-8725] bump snappy-java to 1.1.8.4

[nielm] Add BigDecimal support for SpannerIO

[noreply] [BEAM-11695] Remove translations.pack_combiners from default optimizers

[Kyle Weaver] [BEAM-11689] Add public.nexus.pentaho.org to offline repositories.

[Chamikara Madhusanka Jayalath] Moving to 2.29.0-SNAPSHOT on master branch.

[noreply] [BEAM-11531] Add pd.to_datetime, handle DeferredBase args in

[Andrew Pilloud] [BEAM-11165] Async ZetaSQL Calc

[noreply] [BEAM-11695] Combiner packing in Dataflow (#13763)


------------------------------------------
[...truncated 13.19 KB...]
> Task :runners:java-fn-execution:processResources NO-SOURCE
> Task :sdks:java:core:generateAvroProtocol NO-SOURCE
> Task :model:job-management:extractProto
> Task :model:fn-execution:extractProto
> Task :sdks:java:core:generateAvroJava NO-SOURCE
> Task :model:job-management:processResources
> Task :model:fn-execution:processResources
> Task :sdks:java:core:generateGrammarSource FROM-CACHE
> Task :sdks:java:core:processResources
> Task :sdks:java:core:generateTestAvroProtocol NO-SOURCE
> Task :sdks:java:core:generateTestAvroJava
> Task :sdks:java:core:generateTestGrammarSource NO-SOURCE
> Task :sdks:java:core:processTestResources
> Task :model:pipeline:extractIncludeProto
> Task :model:pipeline:extractProto
> Task :model:pipeline:generateProto FROM-CACHE
> Task :model:pipeline:compileJava FROM-CACHE
> Task :model:pipeline:processResources
> Task :model:pipeline:classes
> Task :model:pipeline:jar
> Task :model:pipeline:shadowJar FROM-CACHE
> Task :model:job-management:extractIncludeProto
> Task :model:job-management:generateProto FROM-CACHE
> Task :model:fn-execution:extractIncludeProto
> Task :model:fn-execution:generateProto FROM-CACHE
> Task :model:job-management:compileJava FROM-CACHE
> Task :model:job-management:classes
> Task :model:fn-execution:compileJava FROM-CACHE
> Task :model:fn-execution:classes
> Task :model:job-management:shadowJar FROM-CACHE
> Task :model:fn-execution:shadowJar FROM-CACHE
> Task :sdks:java:core:compileJava
Note: Some input files use or override a deprecated API.
Note: Recompile with -Xlint:deprecation for details.
Note: Some input files use unchecked or unsafe operations.
Note: Recompile with -Xlint:unchecked for details.

> Task :sdks:java:core:classes
> Task :sdks:java:core:shadowJar FROM-CACHE
> Task :runners:local-java:compileJava FROM-CACHE
> Task :runners:local-java:classes UP-TO-DATE
> Task :vendor:sdks-java-extensions-protobuf:compileJava FROM-CACHE
> Task :vendor:sdks-java-extensions-protobuf:classes UP-TO-DATE
> Task :runners:local-java:jar
> Task :sdks:java:fn-execution:compileJava FROM-CACHE
> Task :sdks:java:fn-execution:classes UP-TO-DATE
> Task :sdks:java:fn-execution:jar
> Task :vendor:sdks-java-extensions-protobuf:shadowJar FROM-CACHE
> Task :sdks:java:core:compileTestJava
> Task :runners:core-construction-java:compileJava

> Task :sdks:java:core:compileTestJava
Note: Some input files use or override a deprecated API.
Note: Recompile with -Xlint:deprecation for details.
Note: Some input files use unchecked or unsafe operations.
Note: Recompile with -Xlint:unchecked for details.

> Task :sdks:java:core:testClasses
> Task :sdks:java:core:shadowTestJar FROM-CACHE

> Task :runners:core-construction-java:compileJava
Note: Some input files use or override a deprecated API.
Note: Recompile with -Xlint:deprecation for details.
Note: Some input files use unchecked or unsafe operations.
Note: Recompile with -Xlint:unchecked for details.

> Task :runners:core-construction-java:classes
> Task :runners:core-construction-java:jar
> Task :runners:core-java:compileJava
Note: Some input files use or override a deprecated API.
Note: Recompile with -Xlint:deprecation for details.
Note: Some input files use unchecked or unsafe operations.
Note: Recompile with -Xlint:unchecked for details.

> Task :runners:core-java:classes
> Task :runners:core-java:jar
> Task :sdks:java:extensions:google-cloud-platform-core:compileJava
> Task :runners:core-java:compileTestJava

> Task :sdks:java:extensions:google-cloud-platform-core:compileJava
Note: Some input files use or override a deprecated API.
Note: Recompile with -Xlint:deprecation for details.

> Task :sdks:java:extensions:google-cloud-platform-core:classes
> Task :sdks:java:extensions:google-cloud-platform-core:jar
> Task :sdks:java:harness:compileJava

> Task :runners:core-java:compileTestJava
Note: Some input files use or override a deprecated API.
Note: Recompile with -Xlint:deprecation for details.
Note: Some input files use unchecked or unsafe operations.
Note: Recompile with -Xlint:unchecked for details.

> Task :runners:core-java:testClasses
> Task :runners:core-java:testJar

> Task :sdks:java:harness:compileJava
Note: Some input files use or override a deprecated API.
Note: Recompile with -Xlint:deprecation for details.
Note: Some input files use unchecked or unsafe operations.
Note: Recompile with -Xlint:unchecked for details.

> Task :sdks:java:harness:classes
> Task :sdks:java:harness:jar
> Task :sdks:java:harness:shadowJar
> Task :runners:java-fn-execution:compileJava
Note: Some input files use or override a deprecated API.
Note: Recompile with -Xlint:deprecation for details.
Note: Some input files use unchecked or unsafe operations.
Note: Recompile with -Xlint:unchecked for details.

> Task :runners:java-fn-execution:classes
> Task :runners:java-fn-execution:jar
> Task :runners:direct-java:compileJava
Note: Some input files use or override a deprecated API.
Note: Recompile with -Xlint:deprecation for details.
Note: Some input files use unchecked or unsafe operations.
Note: Recompile with -Xlint:unchecked for details.

> Task :runners:direct-java:classes
> Task :runners:direct-java:shadowJar FROM-CACHE
> Task :runners:direct-java:compileTestJava
Note: Some input files use or override a deprecated API.
Note: Recompile with -Xlint:deprecation for details.
Note: Some input files use unchecked or unsafe operations.
Note: Recompile with -Xlint:unchecked for details.

> Task :runners:direct-java:testClasses
> Task :runners:direct-java:shadowTestJar

Deprecated Gradle features were used in this build, making it incompatible with Gradle 7.0.
Use '--warning-mode all' to show the individual deprecation warnings.
See https://docs.gradle.org/6.8/userguide/command_line_interface.html#sec:command_line_warnings

BUILD SUCCESSFUL in 17m 28s
63 actionable tasks: 46 executed, 17 from cache

Publishing build scan...
https://gradle.com/s/jemllgqb2nxhi

Build step 'Invoke Gradle script' changed build result to SUCCESS
[Gradle] - Launching build.
[src] $ <https://ci-beam.apache.org/job/beam_PostCommit_Java_ValidatesRunner_Direct_Java11/ws/src/gradlew>
-Dorg.gradle.java.home=/usr/lib/jvm/java-11-openjdk-amd64 -x shadowJar -x shadowTestJar -x
compileJava -x compileTestJava :runners:direct-java:validatesRunner
Starting a Gradle Daemon, 3 busy and 1 incompatible Daemons could not be reused, use --status
for details
> Task :buildSrc:compileJava NO-SOURCE

> Task :buildSrc:compileGroovy
WARNING: An illegal reflective access operation has occurred
WARNING: Illegal reflective access by org.codehaus.groovy.reflection.CachedClass (file:/home/jenkins/.gradle/wrapper/dists/gradle-6.8-bin/1jblhjyydfkclfzx1agp92nyl/gradle-6.8/lib/groovy-all-1.3-2.5.12.jar)
to method java.util.AbstractCollection.hugeCapacity(int)
WARNING: Please consider reporting this to the maintainers of org.codehaus.groovy.reflection.CachedClass
WARNING: Use --illegal-access=warn to enable warnings of further illegal reflective access
operations
WARNING: All illegal access operations will be denied in a future release

> Task :buildSrc:pluginDescriptors UP-TO-DATE
> Task :buildSrc:processResources UP-TO-DATE
> Task :buildSrc:classes
> Task :buildSrc:jar
> Task :buildSrc:assemble
> Task :buildSrc:spotlessGroovy UP-TO-DATE
> Task :buildSrc:spotlessGroovyCheck UP-TO-DATE
> Task :buildSrc:spotlessGroovyGradle UP-TO-DATE
> Task :buildSrc:spotlessGroovyGradleCheck UP-TO-DATE
> Task :buildSrc:spotlessCheck UP-TO-DATE
> Task :buildSrc:pluginUnderTestMetadata
> Task :buildSrc:compileTestJava NO-SOURCE
> Task :buildSrc:compileTestGroovy NO-SOURCE
> Task :buildSrc:processTestResources NO-SOURCE
> Task :buildSrc:testClasses UP-TO-DATE
> Task :buildSrc:test NO-SOURCE
> Task :buildSrc:validatePlugins
> Task :buildSrc:check
> Task :buildSrc:build
Configuration on demand is an incubating feature.

> Configure project :sdks:go
Found go 1.12 in /usr/bin/go, use it.

> Configure project :sdks:java:container
Found go 1.12 in /usr/bin/go, use it.

> Configure project :sdks:go:container
Found go 1.12 in /usr/bin/go, use it.

> Configure project :sdks:go:examples
Found go 1.12 in /usr/bin/go, use it.

> Configure project :sdks:go:test
Found go 1.12 in /usr/bin/go, use it.

> Configure project :sdks:python:container
Found go 1.12 in /usr/bin/go, use it.

> Configure project :sdks:go:test:load
Found go 1.12 in /usr/bin/go, use it.

> Task :runners:core-construction-java:processResources NO-SOURCE
> Task :runners:direct-java:processTestResources NO-SOURCE
> Task :runners:core-java:processResources NO-SOURCE
> Task :sdks:java:fn-execution:processResources NO-SOURCE
> Task :runners:core-construction-java:classes
> Task :sdks:java:core:processResources UP-TO-DATE
> Task :runners:core-java:classes
> Task :sdks:java:core:classes
> Task :runners:direct-java:testClasses
> Task :sdks:java:fn-execution:classes
> Task :sdks:java:fn-execution:jar UP-TO-DATE
> Task :runners:core-construction-java:jar UP-TO-DATE
> Task :runners:core-construction-java:processTestResources NO-SOURCE
> Task :runners:core-construction-java:testClasses
> Task :runners:core-java:jar UP-TO-DATE
> Task :runners:core-java:processTestResources NO-SOURCE
> Task :runners:core-java:testClasses
> Task :runners:core-construction-java:testJar
> Task :runners:core-java:testJar UP-TO-DATE
> Task :sdks:java:core:jar
> Task :sdks:java:core:processTestResources UP-TO-DATE
> Task :sdks:java:core:testClasses
> Task :runners:direct-java:validatesRunner

org.apache.beam.sdk.transforms.ParDoLifecycleTest > testTeardownCalledAfterExceptionInFinishBundle
FAILED
    java.lang.AssertionError at ParDoLifecycleTest.java:301

314 tests completed, 1 failed, 3 skipped

> Task :runners:direct-java:validatesRunner FAILED

FAILURE: Build failed with an exception.

* What went wrong:
Execution failed for task ':runners:direct-java:validatesRunner'.
> There were failing tests. See the report at: file://<https://ci-beam.apache.org/job/beam_PostCommit_Java_ValidatesRunner_Direct_Java11/ws/src/runners/direct-java/build/reports/tests/validatesRunner/index.html>

* Try:
Run with --stacktrace option to get the stack trace. Run with --info or --debug option to
get more log output. Run with --scan to get full insights.

* Get more help at https://help.gradle.org

Deprecated Gradle features were used in this build, making it incompatible with Gradle 7.0.
Use '--warning-mode all' to show the individual deprecation warnings.
See https://docs.gradle.org/6.8/userguide/command_line_interface.html#sec:command_line_warnings

BUILD FAILED in 4m 51s
9 actionable tasks: 3 executed, 6 up-to-date

Publishing build scan...
https://gradle.com/s/4g7h66ap4hea2

Build step 'Invoke Gradle script' changed build result to FAILURE
Build step 'Invoke Gradle script' marked build as failure

---------------------------------------------------------------------
To unsubscribe, e-mail: builds-unsubscribe@beam.apache.org
For additional commands, e-mail: builds-help@beam.apache.org


Mime
View raw message