beam-builds mailing list archives

Site index · List index
Message view « Date » · « Thread »
Top « Date » · « Thread »
From Apache Jenkins Server <jenk...@builds.apache.org>
Subject Build failed in Jenkins: beam_LoadTests_Go_CoGBK_Flink_batch #50
Date Tue, 26 Jan 2021 08:41:26 GMT
See <https://ci-beam.apache.org/job/beam_LoadTests_Go_CoGBK_Flink_batch/50/display/redirect?page=changes>

Changes:

[zyichi] [BEAM-10112] Add more state and timer python examples to website

[zyichi] [BEAM-11581] Start ExecutionStateSampler in Java SDK harness before

[Elliotte Rusty Harold] sync libraries-bom version

[emilyye] re-remove finalizedBy cleanup for docker container test

[palmere] feat: Allow Pub/Sub Lite Sink to support increasing partitions

[noreply] [BEAM-11411] [BEAM-11410] Kafka to pub sub E2E test (#13636)

[ajamato] Add capabilities for the HarnessMonitoringInfosRequest/Response and set

[noreply] Merge pull request #13786 from [BEAM-11686] Add FhirSearchParameter

[zyichi] Address comments

[zyichi] Render py

[noreply] [BEAM-11665] Publish Beam GCP BOM (#13737)

[noreply] Merge pull request #12647 from [BEAM-10378] Deserializing Azure

[Pablo Estrada] Revert "Merge pull request #12647 from [BEAM-10378] Deserializing Azure

[noreply] Changing random to seconds since epoch to prevent BQ job name colliss…

[noreply] Merge pull request #13792 from Metric updates for FhirIO: Fix metrics +


------------------------------------------
[...truncated 54.65 KB...]
    >
  >
  coders: <
    key: "c16"
    value: <
      spec: <
        urn: "beam:coder:length_prefix:v1"
      >
      component_coder_ids: "c15"
    >
  >
  coders: <
    key: "c2"
    value: <
      spec: <
        urn: "beam:coder:global_window:v1"
      >
    >
  >
  coders: <
    key: "c3"
    value: <
      spec: <
        urn: "beam:go:coder:custom:v1"
        payload: "Cgd2YXJpbnR6EgIIAhqKAQp2Z2l0aHViLmNvbS9hcGFjaGUvYmVhbS9zZGtzL2dvL3Rlc3QvbG9hZC92ZW5kb3IvZ2l0aHViLmNvbS9hcGFjaGUvYmVhbS9zZGtzL2dvL3BrZy9iZWFtL2NvcmUvcnVudGltZS9jb2RlcnguZW5jVmFySW50WhIQCBYiBAgZQA8qBggUEgIICCKWAQp2Z2l0aHViLmNvbS9hcGFjaGUvYmVhbS9zZGtzL2dvL3Rlc3QvbG9hZC92ZW5kb3IvZ2l0aHViLmNvbS9hcGFjaGUvYmVhbS9zZGtzL2dvL3BrZy9iZWFtL2NvcmUvcnVudGltZS9jb2RlcnguZGVjVmFySW50WhIcCBYiBAgZQAMiBggUEgIICCoECBlADyoECBlAAQ=="
      >
    >
  >
  coders: <
    key: "c4"
    value: <
      spec: <
        urn: "beam:coder:length_prefix:v1"
      >
      component_coder_ids: "c3"
    >
  >
  coders: <
    key: "c5"
    value: <
      spec: <
        urn: "beam:coder:kv:v1"
      >
      component_coder_ids: "c4"
      component_coder_ids: "c0"
    >
  >
  coders: <
    key: "c6"
    value: <
      spec: <
        urn: "beam:coder:kv:v1"
      >
      component_coder_ids: "c0"
      component_coder_ids: "c5"
    >
  >
  coders: <
    key: "c7"
    value: <
      spec: <
        urn: "beam:coder:iterable:v1"
      >
      component_coder_ids: "c5"
    >
  >
  coders: <
    key: "c8"
    value: <
      spec: <
        urn: "beam:coder:kv:v1"
      >
      component_coder_ids: "c0"
      component_coder_ids: "c7"
    >
  >
  coders: <
    key: "c9"
    value: <
      spec: <
        urn: "beam:go:coder:cogbklist:v1"
      >
      component_coder_ids: "c0"
      component_coder_ids: "c0"
    >
  >
  environments: <
    key: "go"
    value: <
      urn: "beam:env:docker:v1"
      payload: "\n>gcr.io/apache-beam-testing/beam_portability/beam_go_sdk:latest"
      capabilities: "beam:protocol:progress_reporting:v0"
      capabilities: "beam:protocol:multi_core_bundle_processing:v1"
      capabilities: "beam:version:sdk_base:go"
      capabilities: "beam:coder:bytes:v1"
      capabilities: "beam:coder:bool:v1"
      capabilities: "beam:coder:varint:v1"
      capabilities: "beam:coder:double:v1"
      capabilities: "beam:coder:string_utf8:v1"
      capabilities: "beam:coder:length_prefix:v1"
      capabilities: "beam:coder:kv:v1"
      capabilities: "beam:coder:iterable:v1"
      capabilities: "beam:coder:state_backed_iterable:v1"
      capabilities: "beam:coder:windowed_value:v1"
      capabilities: "beam:coder:global_window:v1"
      capabilities: "beam:coder:interval_window:v1"
      dependencies: <
        type_urn: "beam:artifact:type:go_****_binary:v1"
        role_urn: "beam:artifact:role:staging_to:v1"
        role_payload: "\n\006****"
      >
    >
  >
>
root_transform_ids: "s2"
root_transform_ids: "s1"
root_transform_ids: "e8"
root_transform_ids: "e4"
root_transform_ids: "e9_cogbk"
root_transform_ids: "e10"
root_transform_ids: "e11"
requirements: "beam:requirement:pardo:splittable_dofn:v1"
2021/01/26 08:29:02 Prepared job with id: load-tests-go-flink-batch-cogbk-2-0126065555_6b33810b-2ea9-4866-8872-ff15df706c9f
and staging token: load-tests-go-flink-batch-cogbk-2-0126065555_6b33810b-2ea9-4866-8872-ff15df706c9f
2021/01/26 08:29:02 Using specified **** binary: 'linux_amd64/cogbk'
2021/01/26 08:29:05 Staged binary artifact with token: 
2021/01/26 08:29:06 Submitted job: load0tests0go0flink0batch0cogbk0200126065555-root-0126082905-de48d096_f1f1c288-19b2-4cea-8324-db6b5910a421
2021/01/26 08:29:06 Job state: STOPPED
2021/01/26 08:29:06 Job state: STARTING
2021/01/26 08:29:06 Job state: RUNNING
2021/01/26 08:41:24  (): java.util.concurrent.ExecutionException: org.apache.flink.client.program.ProgramInvocationException:
Job failed (JobID: a5d94c9a6e53742960d5a256ce1b794f)
	at java.util.concurrent.CompletableFuture.reportGet(CompletableFuture.java:357)
	at java.util.concurrent.CompletableFuture.get(CompletableFuture.java:1908)
	at org.apache.flink.api.java.ExecutionEnvironment.execute(ExecutionEnvironment.java:864)
	at org.apache.beam.runners.flink.FlinkBatchPortablePipelineTranslator$BatchTranslationContext.execute(FlinkBatchPortablePipelineTranslator.java:199)
	at org.apache.beam.runners.flink.FlinkPipelineRunner.runPipelineWithTranslator(FlinkPipelineRunner.java:118)
	at org.apache.beam.runners.flink.FlinkPipelineRunner.run(FlinkPipelineRunner.java:85)
	at org.apache.beam.runners.jobsubmission.JobInvocation.runPipeline(JobInvocation.java:86)
	at org.apache.beam.vendor.guava.v26_0_jre.com.google.common.util.concurrent.TrustedListenableFutureTask$TrustedFutureInterruptibleTask.runInterruptibly(TrustedListenableFutureTask.java:125)
	at org.apache.beam.vendor.guava.v26_0_jre.com.google.common.util.concurrent.InterruptibleTask.run(InterruptibleTask.java:57)
	at org.apache.beam.vendor.guava.v26_0_jre.com.google.common.util.concurrent.TrustedListenableFutureTask.run(TrustedListenableFutureTask.java:78)
	at java.util.concurrent.ThreadPoolExecutor.runWorker(ThreadPoolExecutor.java:1149)
	at java.util.concurrent.ThreadPoolExecutor$Worker.run(ThreadPoolExecutor.java:624)
	at java.lang.Thread.run(Thread.java:748)
Caused by: org.apache.flink.client.program.ProgramInvocationException: Job failed (JobID:
a5d94c9a6e53742960d5a256ce1b794f)
	at org.apache.flink.client.deployment.ClusterClientJobClientAdapter.lambda$null$6(ClusterClientJobClientAdapter.java:112)
	at java.util.concurrent.CompletableFuture.uniApply(CompletableFuture.java:616)
	at java.util.concurrent.CompletableFuture$UniApply.tryFire(CompletableFuture.java:591)
	at java.util.concurrent.CompletableFuture.postComplete(CompletableFuture.java:488)
	at java.util.concurrent.CompletableFuture.complete(CompletableFuture.java:1975)
	at org.apache.flink.client.program.rest.RestClusterClient.lambda$pollResourceAsync$21(RestClusterClient.java:565)
	at java.util.concurrent.CompletableFuture.uniWhenComplete(CompletableFuture.java:774)
	at java.util.concurrent.CompletableFuture$UniWhenComplete.tryFire(CompletableFuture.java:750)
	at java.util.concurrent.CompletableFuture.postComplete(CompletableFuture.java:488)
	at java.util.concurrent.CompletableFuture.complete(CompletableFuture.java:1975)
	at org.apache.flink.runtime.concurrent.FutureUtils.lambda$retryOperationWithDelay$8(FutureUtils.java:291)
	at java.util.concurrent.CompletableFuture.uniWhenComplete(CompletableFuture.java:774)
	at java.util.concurrent.CompletableFuture$UniWhenComplete.tryFire(CompletableFuture.java:750)
	at java.util.concurrent.CompletableFuture.postComplete(CompletableFuture.java:488)
	at java.util.concurrent.CompletableFuture.postFire(CompletableFuture.java:575)
	at java.util.concurrent.CompletableFuture$UniCompose.tryFire(CompletableFuture.java:943)
	at java.util.concurrent.CompletableFuture$Completion.run(CompletableFuture.java:456)
	... 3 more
Caused by: org.apache.flink.runtime.client.JobExecutionException: Job execution failed.
	at org.apache.flink.runtime.jobmaster.JobResult.toJobExecutionResult(JobResult.java:147)
	at org.apache.flink.client.deployment.ClusterClientJobClientAdapter.lambda$null$6(ClusterClientJobClientAdapter.java:110)
	... 19 more
Caused by: org.apache.flink.runtime.JobException: Recovery is suppressed by NoRestartBackoffTimeStrategy
	at org.apache.flink.runtime.executiongraph.failover.flip1.ExecutionFailureHandler.handleFailure(ExecutionFailureHandler.java:110)
	at org.apache.flink.runtime.executiongraph.failover.flip1.ExecutionFailureHandler.getFailureHandlingResult(ExecutionFailureHandler.java:76)
	at org.apache.flink.runtime.scheduler.DefaultScheduler.handleTaskFailure(DefaultScheduler.java:192)
	at org.apache.flink.runtime.scheduler.DefaultScheduler.maybeHandleTaskFailure(DefaultScheduler.java:186)
	at org.apache.flink.runtime.scheduler.DefaultScheduler.updateTaskExecutionStateInternal(DefaultScheduler.java:180)
	at org.apache.flink.runtime.scheduler.SchedulerBase.updateTaskExecutionState(SchedulerBase.java:496)
	at org.apache.flink.runtime.jobmaster.JobMaster.updateTaskExecutionState(JobMaster.java:380)
	at sun.reflect.GeneratedMethodAccessor25.invoke(Unknown Source)
	at sun.reflect.DelegatingMethodAccessorImpl.invoke(DelegatingMethodAccessorImpl.java:43)
	at java.lang.reflect.Method.invoke(Method.java:498)
	at org.apache.flink.runtime.rpc.akka.AkkaRpcActor.handleRpcInvocation(AkkaRpcActor.java:284)
	at org.apache.flink.runtime.rpc.akka.AkkaRpcActor.handleRpcMessage(AkkaRpcActor.java:199)
	at org.apache.flink.runtime.rpc.akka.FencedAkkaRpcActor.handleRpcMessage(FencedAkkaRpcActor.java:74)
	at org.apache.flink.runtime.rpc.akka.AkkaRpcActor.handleMessage(AkkaRpcActor.java:152)
	at akka.japi.pf.UnitCaseStatement.apply(CaseStatements.scala:26)
	at akka.japi.pf.UnitCaseStatement.apply(CaseStatements.scala:21)
	at scala.PartialFunction$class.applyOrElse(PartialFunction.scala:123)
	at akka.japi.pf.UnitCaseStatement.applyOrElse(CaseStatements.scala:21)
	at scala.PartialFunction$OrElse.applyOrElse(PartialFunction.scala:170)
	at scala.PartialFunction$OrElse.applyOrElse(PartialFunction.scala:171)
	at scala.PartialFunction$OrElse.applyOrElse(PartialFunction.scala:171)
	at akka.actor.Actor$class.aroundReceive(Actor.scala:517)
	at akka.actor.AbstractActor.aroundReceive(AbstractActor.scala:225)
	at akka.actor.ActorCell.receiveMessage(ActorCell.scala:592)
	at akka.actor.ActorCell.invoke(ActorCell.scala:561)
	at akka.dispatch.Mailbox.processMailbox(Mailbox.scala:258)
	at akka.dispatch.Mailbox.run(Mailbox.scala:225)
	at akka.dispatch.Mailbox.exec(Mailbox.scala:235)
	at akka.dispatch.forkjoin.ForkJoinTask.doExec(ForkJoinTask.java:260)
	at akka.dispatch.forkjoin.ForkJoinPool$WorkQueue.runTask(ForkJoinPool.java:1339)
	at akka.dispatch.forkjoin.ForkJoinPool.runWorker(ForkJoinPool.java:1979)
	at akka.dispatch.forkjoin.ForkJoinWorkerThread.run(ForkJoinWorkerThread.java:107)
Caused by: java.lang.IllegalArgumentException: Self-suppression not permitted
	at java.lang.Throwable.addSuppressed(Throwable.java:1072)
	at org.apache.beam.runners.flink.translation.functions.FlinkExecutableStageFunction.$closeResource(FlinkExecutableStageFunction.java:268)
	at org.apache.beam.runners.flink.translation.functions.FlinkExecutableStageFunction.mapPartition(FlinkExecutableStageFunction.java:268)
	at org.apache.flink.runtime.operators.MapPartitionDriver.run(MapPartitionDriver.java:103)
	at org.apache.flink.runtime.operators.BatchTask.run(BatchTask.java:504)
	at org.apache.flink.runtime.operators.BatchTask.invoke(BatchTask.java:369)
	at org.apache.flink.runtime.taskmanager.Task.doRun(Task.java:708)
	at org.apache.flink.runtime.taskmanager.Task.run(Task.java:533)
	at java.lang.Thread.run(Thread.java:748)
Caused by: java.lang.OutOfMemoryError: Java heap space
2021/01/26 08:41:24  (): java.lang.OutOfMemoryError: Java heap space
2021/01/26 08:41:24 Job state: FAILED
2021/01/26 08:41:24 Failed to execute job: job load0tests0go0flink0batch0cogbk0200126065555-root-0126082905-de48d096_f1f1c288-19b2-4cea-8324-db6b5910a421
failed
panic: Failed to execute job: job load0tests0go0flink0batch0cogbk0200126065555-root-0126082905-de48d096_f1f1c288-19b2-4cea-8324-db6b5910a421
failed

goroutine 1 [running]:
github.com/apache/beam/sdks/go/test/load/vendor/github.com/apache/beam/sdks/go/pkg/beam/log.Fatalf(0x1199960,
0xc0000da010, 0x1057dca, 0x19, 0xc0002c9ee8, 0x1, 0x1)
	<https://ci-beam.apache.org/job/beam_LoadTests_Go_CoGBK_Flink_batch/ws/src/sdks/go/test/load/.gogradle/project_gopath/src/github.com/apache/beam/sdks/go/test/load/vendor/github.com/apache/beam/sdks/go/pkg/beam/log/log.go>:153
+0xec
main.main()
	<https://ci-beam.apache.org/job/beam_LoadTests_Go_CoGBK_Flink_batch/ws/src/sdks/go/test/load/.gogradle/project_gopath/src/github.com/apache/beam/sdks/go/test/load/cogbk/cogbk.go>:99
+0x577

> Task :sdks:go:test:load:run FAILED

FAILURE: Build failed with an exception.

* Where:
Build file '<https://ci-beam.apache.org/job/beam_LoadTests_Go_CoGBK_Flink_batch/ws/src/sdks/go/test/load/build.gradle'>
line: 65

* What went wrong:
Execution failed for task ':sdks:go:test:load:run'.
> Process 'command 'sh'' finished with non-zero exit value 2

* Try:
Run with --stacktrace option to get the stack trace. Run with --info or --debug option to
get more log output. Run with --scan to get full insights.

* Get more help at https://help.gradle.org

Deprecated Gradle features were used in this build, making it incompatible with Gradle 7.0.
Use '--warning-mode all' to show the individual deprecation warnings.
See https://docs.gradle.org/6.8/userguide/command_line_interface.html#sec:command_line_warnings

BUILD FAILED in 16m 4s
6 actionable tasks: 6 executed

Publishing build scan...
https://gradle.com/s/3tlef75qedwvw

Build step 'Invoke Gradle script' changed build result to FAILURE
Build step 'Invoke Gradle script' marked build as failure

---------------------------------------------------------------------
To unsubscribe, e-mail: builds-unsubscribe@beam.apache.org
For additional commands, e-mail: builds-help@beam.apache.org


Mime
View raw message