beam-builds mailing list archives

Site index · List index
Message view « Date » · « Thread »
Top « Date » · « Thread »
From Apache Jenkins Server <jenk...@builds.apache.org>
Subject Build failed in Jenkins: beam_PostCommit_Java #7146
Date Sat, 30 Jan 2021 07:44:46 GMT
See <https://ci-beam.apache.org/job/beam_PostCommit_Java/7146/display/redirect?page=changes>

Changes:

[Kyle Weaver] [BEAM-11634] Give JobInvoker threads unique names.

[Kyle Weaver] [BEAM-10925] Add rule to replace Calc with BeamCalcRel for ZetaSQL UDFs.

[noreply] [BEAM-5214] Update java quickstart (#13833)


------------------------------------------
[...truncated 101.97 KB...]
> Task :release:go-licenses:java:dockerRun
+ tee /output/licenses/list.csv
+ go-licenses csv github.com/apache/beam/sdks/java/container
golang.org/x/sys,https://go.googlesource.com/sys/+/refs/heads/master/LICENSE,BSD-3-Clause
golang.org/x/text,https://go.googlesource.com/text/+/refs/heads/master/LICENSE,BSD-3-Clause
google.golang.org/genproto/googleapis/rpc/status,https://github.com/googleapis/go-genproto/blob/master/LICENSE,Apache-2.0
github.com/apache/beam/sdks/go/pkg/beam,https://github.com/apache/beam/blob/master/sdks/go/README.md,Apache-2.0
github.com/golang/protobuf,https://github.com/golang/protobuf/blob/master/LICENSE,BSD-3-Clause
google.golang.org/protobuf,https://go.googlesource.com/protobuf/+/refs/heads/master/LICENSE,BSD-3-Clause
google.golang.org/grpc,https://github.com/grpc/grpc-go/blob/master/LICENSE,Apache-2.0
golang.org/x/net,https://go.googlesource.com/net/+/refs/heads/master/LICENSE,BSD-3-Clause
github.com/apache/beam/sdks/java/container,https://github.com/apache/beam/blob/master/LICENSE,Apache-2.0
+ chmod -R a+w /output/licenses

> Task :release:go-licenses:java:createLicenses
> Task :sdks:java:container:java8:copyGolangLicenses
> Task :sdks:java:io:hadoop-file-system:hadoopVersion285Test
> Task :sdks:java:io:hadoop-format:runHadoopFormatIO2101IT
> Task :sdks:java:io:kafka:kafkaVersion100BatchIT
> Task :sdks:java:io:hadoop-format:runHadoopFormatIO2101Test
> Task :sdks:java:io:kafka:kafkaVersion100Test
> Task :sdks:java:io:hadoop-file-system:hadoopVersion292Test
> Task :sdks:java:io:kafka:kafkaVersion111BatchIT
> Task :sdks:java:io:hadoop-format:runHadoopFormatIO285ElasticIT
> Task :sdks:java:io:hadoop-file-system:hadoopVersion321Test
> Task :sdks:java:io:kafka:kafkaVersion111Test
> Task :sdks:java:io:hadoop-file-system:hadoopVersionsTest
> Task :runners:spark:hadoopVersion285Test
> Task :sdks:java:io:hadoop-format:runHadoopFormatIO285IT

> Task :sdks:java:io:google-cloud-platform:integrationTest

org.apache.beam.sdk.io.gcp.healthcare.FhirIOWriteIT > testFhirIO_Import[R4] FAILED
    org.apache.beam.sdk.Pipeline$PipelineExecutionException at FhirIOWriteIT.java:139
        Caused by: java.lang.AssertionError at FhirIOWriteIT.java:137
            Caused by: java.lang.AssertionError at MatcherAssert.java:18

> Task :sdks:java:io:kafka:kafkaVersion201BatchIT

> Task :sdks:go:resolveBuildDependencies
Resolving google.golang.org/api: commit='0324d5e90dc7753607860272666845fad9ceb97e', urls=[https://code.googlesource.com/google-api-go-client]

> Task :sdks:java:io:hadoop-format:runHadoopFormatIO285Test
> Task :sdks:java:io:kafka:kafkaVersion201Test
> Task :sdks:java:io:kafka:kafkaVersion211BatchIT
> Task :sdks:java:io:hadoop-format:runHadoopFormatIO292ElasticIT

> Task :sdks:go:resolveBuildDependencies
Resolving google.golang.org/genproto: commit='4d944d34d83c502a5f761500a14d8842648415c3', urls=[https://github.com/google/go-genproto]
Resolving google.golang.org/grpc: commit='5e8f83304c0563d1ba74db05fee83d9c18ab9a58', urls=[https://github.com/grpc/grpc-go]
Resolving google.golang.org/protobuf: commit='d165be301fb1e13390ad453281ded24385fd8ebc', urls=[https://go.googlesource.com/protobuf]
Resolving cached github.com/etcd-io/etcd: commit='11214aa33bf5a47d3d9d8dafe0f6b97237dfe921',
urls=[https://github.com/etcd-io/etcd.git, git@github.com:etcd-io/etcd.git]
Resolving cached github.com/etcd-io/etcd: commit='11214aa33bf5a47d3d9d8dafe0f6b97237dfe921',
urls=[https://github.com/etcd-io/etcd.git, git@github.com:etcd-io/etcd.git]

> Task :sdks:java:io:kafka:kafkaVersion211Test
> Task :sdks:go:installDependencies
> Task :sdks:go:buildLinuxAmd64
> Task :sdks:go:goBuild

> Task :sdks:java:io:google-cloud-platform:integrationTest

43 tests completed, 1 failed, 1 skipped

> Task :sdks:java:io:google-cloud-platform:integrationTest FAILED
> Task :runners:spark:hadoopVersion292Test

> Task :sdks:java:container:resolveBuildDependencies
Resolving ./github.com/apache/beam/sdks/go@<https://ci-beam.apache.org/job/beam_PostCommit_Java/ws/src/sdks/go>

> Task :sdks:java:container:installDependencies
> Task :sdks:java:container:buildLinuxAmd64
> Task :sdks:java:container:goBuild
> Task :sdks:java:container:java8:copySdkHarnessLauncher
> Task :sdks:java:container:java8:dockerPrepare
> Task :sdks:java:io:google-cloud-platform:integrationTestKms
> Task :sdks:java:io:hadoop-format:runHadoopFormatIO292IT
> Task :sdks:java:io:kafka:kafkaVersion222BatchIT
> Task :sdks:java:container:java8:docker

> Task :runners:google-cloud-dataflow-java:buildAndPushDockerContainer
WARNING: `gcloud docker` will not be supported for Docker client versions above 18.03.

As an alternative, use `gcloud auth configure-docker` to configure `docker` to
use `gcloud` as a credential helper, then use `docker` as you would for non-GCR
registries, e.g. `docker pull gcr.io/project-id/my-image`. Add
`--verbosity=error` to silence this warning: `gcloud docker
--verbosity=error -- pull gcr.io/project-id/my-image`.

See: https://cloud.google.com/container-registry/docs/support/deprecation-notices#gcloud-docker

The push refers to repository [us.gcr.io/apache-beam-testing/java-postcommit-it/java]
000757032230: Preparing
f93813193ce7: Preparing
b7934aa9b9f1: Preparing
27a584cf8c0c: Preparing
3279568aaed8: Preparing
e6bd1847db6b: Preparing
129f3d3d1e82: Preparing
83c17685e184: Preparing
dc96ba9402db: Preparing
6f12193ac739: Preparing
de5270e894f9: Preparing
25b2e6cfc187: Preparing
7df6dd475950: Preparing
7496c5e8691b: Preparing
aa7af8a465c6: Preparing
ef9a7b8862f4: Preparing
a1f2f42922b1: Preparing
4762552ad7d8: Preparing
e6bd1847db6b: Waiting
129f3d3d1e82: Waiting
83c17685e184: Waiting
dc96ba9402db: Waiting
6f12193ac739: Waiting
de5270e894f9: Waiting
25b2e6cfc187: Waiting
7df6dd475950: Waiting
7496c5e8691b: Waiting
aa7af8a465c6: Waiting
ef9a7b8862f4: Waiting
a1f2f42922b1: Waiting
4762552ad7d8: Waiting
27a584cf8c0c: Pushed
3279568aaed8: Pushed
000757032230: Pushed
f93813193ce7: Pushed
83c17685e184: Pushed
b7934aa9b9f1: Pushed
129f3d3d1e82: Pushed
25b2e6cfc187: Layer already exists
7df6dd475950: Layer already exists
7496c5e8691b: Layer already exists
aa7af8a465c6: Layer already exists
ef9a7b8862f4: Layer already exists
a1f2f42922b1: Layer already exists
4762552ad7d8: Layer already exists
6f12193ac739: Pushed
de5270e894f9: Pushed
e6bd1847db6b: Pushed
dc96ba9402db: Pushed
20210130060349: digest: sha256:ef183f65a3b37080a128e2935712bc0c0cdc2342054918178976a661b933916e
size: 4098

> Task :runners:google-cloud-dataflow-java:coreSDKJavaRunnerV2IntegrationTest NO-SOURCE
> Task :sdks:java:io:kafka:kafkaVersion222Test
> Task :runners:google-cloud-dataflow-java:examplesJavaRunnerV2IntegrationTest
> Task :sdks:java:io:hadoop-format:runHadoopFormatIO292Test
> Task :sdks:java:io:kafka:kafkaVersion231BatchIT
> Task :runners:spark:hadoopVersion321Test
> Task :sdks:java:io:kafka:kafkaVersion231Test
> Task :sdks:java:io:hadoop-format:runHadoopFormatIO321ElasticIT
> Task :sdks:java:io:kafka:kafkaVersion241BatchIT
> Task :sdks:java:io:hadoop-format:runHadoopFormatIO321IT
> Task :sdks:java:io:kafka:kafkaVersion241Test
> Task :runners:spark:hadoopVersionsTest
> Task :sdks:java:io:hadoop-format:runHadoopFormatIO321Test
> Task :sdks:java:io:kafka:kafkaVersion251BatchIT
> Task :sdks:java:io:kafka:kafkaVersion251Test
> Task :sdks:java:io:hadoop-format:hadoopVersionsTest
> Task :javaHadoopVersionsTest
> Task :sdks:java:io:kafka:kafkaVersionsCompatibilityTest
> Task :sdks:java:extensions:zetasketch:postCommit

> Task :runners:google-cloud-dataflow-java:examplesJavaRunnerV2IntegrationTest

***********************************************************
***********************************************************
**********************Set Up Pubsub************************
The Pub/Sub topic has been set up for this example: projects/apache-beam-testing/topics/testpipeline-jenkins-0130061639-56656e8f
The Pub/Sub subscription has been set up for this example: projects/apache-beam-testing/subscriptions/testpipeline-jenkins-0130061639-56656e8f
******************Set Up Big Query Table*******************
The BigQuery table has been set up for this example: apache-beam-testing:traffic_routes_1611987392260.traffic_routes_table
*************************Tear Down*************************
The Pub/Sub topic has been deleted: projects/apache-beam-testing/topics/testpipeline-jenkins-0130061639-56656e8f
The Pub/Sub subscription has been deleted: projects/apache-beam-testing/subscriptions/testpipeline-jenkins-0130061639-56656e8f
The BigQuery table might contain the example's output, and it is not deleted automatically:
apache-beam-testing:traffic_routes_1611987392260.traffic_routes_table
Please go to the Developers Console to delete it manually. Otherwise, you may be charged for
its usage.
***********************************************************
***********************************************************

***********************************************************
***********************************************************
**********************Set Up Pubsub************************
The Pub/Sub topic has been set up for this example: projects/apache-beam-testing/topics/testpipeline-jenkins-0130064118-a915ea54
The Pub/Sub subscription has been set up for this example: projects/apache-beam-testing/subscriptions/testpipeline-jenkins-0130064118-a915ea54
******************Set Up Big Query Table*******************
The BigQuery table has been set up for this example: apache-beam-testing:traffic_max_lane_flow_1611988877897.traffic_max_lane_flow_table
*************************Tear Down*************************
The Pub/Sub topic has been deleted: projects/apache-beam-testing/topics/testpipeline-jenkins-0130064118-a915ea54
The Pub/Sub subscription has been deleted: projects/apache-beam-testing/subscriptions/testpipeline-jenkins-0130064118-a915ea54
The BigQuery table might contain the example's output, and it is not deleted automatically:
apache-beam-testing:traffic_max_lane_flow_1611988877897.traffic_max_lane_flow_table
Please go to the Developers Console to delete it manually. Otherwise, you may be charged for
its usage.
***********************************************************
***********************************************************

> Task :runners:google-cloud-dataflow-java:googleCloudPlatformRunnerV2IntegrationTest

> Task :runners:google-cloud-dataflow-java:cleanUpDockerImages
Untagged: us.gcr.io/apache-beam-testing/java-postcommit-it/java:20210130060349
Untagged: us.gcr.io/apache-beam-testing/java-postcommit-it/java@sha256:ef183f65a3b37080a128e2935712bc0c0cdc2342054918178976a661b933916e
Deleted: sha256:85851ac378c856c6ef83541a91e253cca3cceca0f1aad1324a3df122a158e839
Deleted: sha256:355ac10e50566930f0fed17d710cf171c8f5fb22bf05c6e5e9e3f3c09179c79a
Deleted: sha256:bec11ec058db42b81cffe855825cad30fbacc68d540178562d2d72840bf32990
Deleted: sha256:85575ce8f71f8711abe938a6f69087adb1fcebb346e6c56e7cd4b0c32aa5c58c
Deleted: sha256:7291a235c1ab4d7efcc5e75c2f0d574bd93c0aa266d56a534e855bcc9ea12726
Deleted: sha256:1abcdcb93726eda648577c934443395a97482b212ee20b010efd90564d2c8b0d
Deleted: sha256:40ec3cb53622ef44fa88c9f4a4c303bf3d98b359e1a476698580a4a480c715df
Deleted: sha256:a2e2f9560a602e8dad01293f1d1e64846426fc086e500c3c29ec7ada803d1190
Deleted: sha256:56634c43e2e38628931834a394485b737057db244dfb31e6ea68996e7f990312
Deleted: sha256:c062413ea990201bfafdfd9bc4ce632df19195fff99c1b96f14f2fed80cf7f44
Deleted: sha256:c41e506fd43d4f27662c4cbf87435d2ce7bb044096d7af2f4a36ef525d58315e
Deleted: sha256:f67e23b7c9ab09e0fbeebaa170182d186acfac5b751fc3346c9dd461bf88ac36
Deleted: sha256:84200035a45b683ddbf1100b10733084946db36238554aa9e960a2ebf01cc757
Deleted: sha256:1fb4429d1a84892114f0d0f48583e66aac5ed83c658a3c71395944b4871fff70
Deleted: sha256:eda2acec10c39323cb84f1915d71b4737bd7a21548219d7eb5d016ae9e78b273
Digests:
- us.gcr.io/apache-beam-testing/java-postcommit-it/java@sha256:ef183f65a3b37080a128e2935712bc0c0cdc2342054918178976a661b933916e
  Associated tags:
 - 20210130060349
Tags:
- us.gcr.io/apache-beam-testing/java-postcommit-it/java:20210130060349
Deleted [us.gcr.io/apache-beam-testing/java-postcommit-it/java:20210130060349].
Deleted [us.gcr.io/apache-beam-testing/java-postcommit-it/java@sha256:ef183f65a3b37080a128e2935712bc0c0cdc2342054918178976a661b933916e].

> Task :runners:google-cloud-dataflow-java:postCommitRunnerV2

FAILURE: Build failed with an exception.

* What went wrong:
Execution failed for task ':sdks:java:io:google-cloud-platform:integrationTest'.
> There were failing tests. See the report at: file://<https://ci-beam.apache.org/job/beam_PostCommit_Java/ws/src/sdks/java/io/google-cloud-platform/build/reports/tests/integrationTest/index.html>

* Try:
Run with --stacktrace option to get the stack trace. Run with --info or --debug option to
get more log output. Run with --scan to get full insights.

* Get more help at https://help.gradle.org

Deprecated Gradle features were used in this build, making it incompatible with Gradle 7.0.
Use '--warning-mode all' to show the individual deprecation warnings.
See https://docs.gradle.org/6.8/userguide/command_line_interface.html#sec:command_line_warnings

BUILD FAILED in 1h 41m 8s
248 actionable tasks: 160 executed, 86 from cache, 2 up-to-date
Gradle was unable to watch the file system for changes. The inotify watches limit is too low.

Publishing build scan...
https://gradle.com/s/fh6oh2nr6uir6

Build step 'Invoke Gradle script' changed build result to FAILURE
Build step 'Invoke Gradle script' marked build as failure

---------------------------------------------------------------------
To unsubscribe, e-mail: builds-unsubscribe@beam.apache.org
For additional commands, e-mail: builds-help@beam.apache.org


Mime
View raw message