beam-builds mailing list archives

Site index · List index
Message view « Date » · « Thread »
Top « Date » · « Thread »
From Apache Jenkins Server <jenk...@builds.apache.org>
Subject Build failed in Jenkins: beam_PreCommit_Python_Cron #3710
Date Sat, 09 Jan 2021 06:37:57 GMT
See <https://ci-beam.apache.org/job/beam_PreCommit_Python_Cron/3710/display/redirect>

Changes:


------------------------------------------
[...truncated 1.22 MB...]
    },
    {
      "kind": "ParallelDo",
      "name": "s10",
      "properties": {
        "display_data": [
          {
            "key": "fn",
            "label": "Transform Function",
            "namespace": "apache_beam.transforms.core.ParDo",
            "shortValue": "CallableWrapperDoFn",
            "type": "STRING",
            "value": "apache_beam.transforms.core.CallableWrapperDoFn"
          },
          {
            "key": "fn",
            "label": "Transform Function",
            "namespace": "apache_beam.transforms.core.CallableWrapperDoFn",
            "type": "STRING",
            "value": "bytes_to_proto_str"
          }
        ],
        "non_parallel_inputs": {},
        "output_info": [
          {
            "encoding": {
              "@type": "kind:windowed_value",
              "component_encodings": [
                {
                  "@type": "kind:bytes"
                },
                {
                  "@type": "kind:interval_window"
                }
              ],
              "is_wrapper": true
            },
            "output_name": "None",
            "user_name": "WriteToPubSub/ToProtobuf.out"
          }
        ],
        "parallel_input": {
          "@type": "OutputReference",
          "output_name": "None",
          "step_name": "s9"
        },
        "serialized_fn": "ref_AppliedPTransform_WriteToPubSub/ToProtobuf_13",
        "user_name": "WriteToPubSub/ToProtobuf"
      }
    },
    {
      "kind": "ParallelWrite",
      "name": "s11",
      "properties": {
        "display_data": [],
        "encoding": {
          "@type": "kind:windowed_value",
          "component_encodings": [
            {
              "@type": "kind:bytes"
            },
            {
              "@type": "kind:global_window"
            }
          ],
          "is_wrapper": true
        },
        "format": "pubsub",
        "parallel_input": {
          "@type": "OutputReference",
          "output_name": "None",
          "step_name": "s10"
        },
        "pubsub_serialized_attributes_fn": "",
        "pubsub_topic": "projects/apache-beam-testing/topics/wc_topic_output227d7da4-b9b7-4409-aa69-6b9844c58e20",
        "user_name": "WriteToPubSub/Write/NativeWrite"
      }
    }
  ],
  "type": "JOB_TYPE_STREAMING"
}
INFO:apache_beam.runners.dataflow.internal.apiclient:Create job: <Job
 createTime: '2021-01-09T06:29:30.860958Z'
 currentStateTime: '1970-01-01T00:00:00Z'
 id: '2021-01-08_22_29_29-11225169630141089589'
 location: 'us-central1'
 name: 'beamapp-jenkins-0109062920-906540'
 projectId: 'apache-beam-testing'
 stageStates: []
 startTime: '2021-01-09T06:29:30.860958Z'
 steps: []
 tempFiles: []
 type: TypeValueValuesEnum(JOB_TYPE_STREAMING, 2)>
INFO:apache_beam.runners.dataflow.internal.apiclient:Created job with id: [2021-01-08_22_29_29-11225169630141089589]
INFO:apache_beam.runners.dataflow.internal.apiclient:Submitted job: 2021-01-08_22_29_29-11225169630141089589
INFO:apache_beam.runners.dataflow.internal.apiclient:To access the Dataflow monitoring console,
please navigate to https://console.cloud.google.com/dataflow/jobs/us-central1/2021-01-08_22_29_29-11225169630141089589?project=apache-beam-testing
INFO:apache_beam.runners.dataflow.dataflow_runner:Job 2021-01-08_22_29_29-11225169630141089589
is in state JOB_STATE_RUNNING
INFO:apache_beam.runners.dataflow.dataflow_runner:2021-01-09T06:29:29.249Z: JOB_MESSAGE_DETAILED:
Autoscaling is enabled for job 2021-01-08_22_29_29-11225169630141089589. The number of workers
will be between 1 and 100.
INFO:apache_beam.runners.dataflow.dataflow_runner:2021-01-09T06:29:29.249Z: JOB_MESSAGE_WARNING:
Autoscaling is enabled for Dataflow Streaming Engine. Workers will scale between 1 and 100
unless maxNumWorkers is specified.
INFO:apache_beam.runners.dataflow.dataflow_runner:2021-01-09T06:29:29.249Z: JOB_MESSAGE_DETAILED:
Autoscaling was automatically enabled for job 2021-01-08_22_29_29-11225169630141089589.
INFO:apache_beam.runners.dataflow.dataflow_runner:2021-01-09T06:29:33.393Z: JOB_MESSAGE_BASIC:
Worker configuration: n1-standard-2 in us-central1-f.
INFO:apache_beam.runners.dataflow.dataflow_runner:2021-01-09T06:29:33.894Z: JOB_MESSAGE_DETAILED:
Expanding SplittableParDo operations into optimizable parts.
INFO:apache_beam.runners.dataflow.dataflow_runner:2021-01-09T06:29:33.923Z: JOB_MESSAGE_DETAILED:
Expanding CollectionToSingleton operations into optimizable parts.
INFO:apache_beam.runners.dataflow.dataflow_runner:2021-01-09T06:29:33.981Z: JOB_MESSAGE_DETAILED:
Expanding CoGroupByKey operations into optimizable parts.
INFO:apache_beam.runners.dataflow.dataflow_runner:2021-01-09T06:29:34.002Z: JOB_MESSAGE_DEBUG:
Combiner lifting skipped for step group: GroupByKey not followed by a combiner.
INFO:apache_beam.runners.dataflow.dataflow_runner:2021-01-09T06:29:34.032Z: JOB_MESSAGE_DETAILED:
Expanding SplittableProcessKeyed operations into optimizable parts.
INFO:apache_beam.runners.dataflow.dataflow_runner:2021-01-09T06:29:34.053Z: JOB_MESSAGE_DETAILED:
Expanding GroupByKey operations into streaming Read/Write steps
INFO:apache_beam.runners.dataflow.dataflow_runner:2021-01-09T06:29:34.101Z: JOB_MESSAGE_DETAILED:
Lifting ValueCombiningMappingFns into MergeBucketsMappingFns
INFO:apache_beam.runners.dataflow.dataflow_runner:2021-01-09T06:29:34.162Z: JOB_MESSAGE_DEBUG:
Annotating graph with Autotuner information.
INFO:apache_beam.runners.dataflow.dataflow_runner:2021-01-09T06:29:34.199Z: JOB_MESSAGE_DETAILED:
Fusing adjacent ParDo, Read, Write, and Flatten operations
INFO:apache_beam.runners.dataflow.dataflow_runner:2021-01-09T06:29:34.222Z: JOB_MESSAGE_DETAILED:
Fusing consumer decode into ReadFromPubSub/Read
INFO:apache_beam.runners.dataflow.dataflow_runner:2021-01-09T06:29:34.243Z: JOB_MESSAGE_DETAILED:
Fusing consumer split into decode
INFO:apache_beam.runners.dataflow.dataflow_runner:2021-01-09T06:29:34.270Z: JOB_MESSAGE_DETAILED:
Fusing consumer pair_with_one into split
INFO:apache_beam.runners.dataflow.dataflow_runner:2021-01-09T06:29:34.290Z: JOB_MESSAGE_DETAILED:
Fusing consumer WindowInto(WindowIntoFn) into pair_with_one
INFO:apache_beam.runners.dataflow.dataflow_runner:2021-01-09T06:29:34.320Z: JOB_MESSAGE_DETAILED:
Fusing consumer group/WriteStream into WindowInto(WindowIntoFn)
INFO:apache_beam.runners.dataflow.dataflow_runner:2021-01-09T06:29:34.352Z: JOB_MESSAGE_DETAILED:
Fusing consumer group/MergeBuckets into group/ReadStream
INFO:apache_beam.runners.dataflow.dataflow_runner:2021-01-09T06:29:34.373Z: JOB_MESSAGE_DETAILED:
Fusing consumer count into group/MergeBuckets
INFO:apache_beam.runners.dataflow.dataflow_runner:2021-01-09T06:29:34.402Z: JOB_MESSAGE_DETAILED:
Fusing consumer format into count
INFO:apache_beam.runners.dataflow.dataflow_runner:2021-01-09T06:29:34.432Z: JOB_MESSAGE_DETAILED:
Fusing consumer encode into format
INFO:apache_beam.runners.dataflow.dataflow_runner:2021-01-09T06:29:34.461Z: JOB_MESSAGE_DETAILED:
Fusing consumer WriteToPubSub/ToProtobuf into encode
INFO:apache_beam.runners.dataflow.dataflow_runner:2021-01-09T06:29:34.485Z: JOB_MESSAGE_DETAILED:
Fusing consumer WriteToPubSub/Write/NativeWrite into WriteToPubSub/ToProtobuf
INFO:apache_beam.runners.dataflow.dataflow_runner:2021-01-09T06:29:34.518Z: JOB_MESSAGE_DEBUG:
Workflow config is missing a default resource spec.
INFO:apache_beam.runners.dataflow.dataflow_runner:2021-01-09T06:29:34.564Z: JOB_MESSAGE_DEBUG:
Adding StepResource setup and teardown to workflow graph.
INFO:apache_beam.runners.dataflow.dataflow_runner:2021-01-09T06:29:34.588Z: JOB_MESSAGE_DEBUG:
Adding workflow start and stop steps.
INFO:apache_beam.runners.dataflow.dataflow_runner:2021-01-09T06:29:34.629Z: JOB_MESSAGE_DEBUG:
Assigning stage ids.
INFO:apache_beam.runners.dataflow.dataflow_runner:2021-01-09T06:29:36.176Z: JOB_MESSAGE_DEBUG:
Starting worker pool setup.
INFO:apache_beam.runners.dataflow.dataflow_runner:2021-01-09T06:29:36.203Z: JOB_MESSAGE_BASIC:
Starting 1 workers in us-central1-f...
INFO:apache_beam.runners.dataflow.dataflow_runner:2021-01-09T06:29:36.227Z: JOB_MESSAGE_DEBUG:
Starting worker pool setup.

> Task :sdks:python:test-suites:dataflow:py37:preCommitIT_streaming_V2
INFO:apache_beam.runners.dataflow.dataflow_runner:2021-01-09T06:29:54.325Z: JOB_MESSAGE_DETAILED:
Autoscaling: Raised the number of workers to 1 so that the pipeline can catch up with its
backlog and keep up with its input rate.
INFO:apache_beam.runners.dataflow.dataflow_runner:2021-01-09T06:29:56.839Z: JOB_MESSAGE_BASIC:
Your project already contains 100 Dataflow-created metric descriptors, so new user metrics
of the form custom.googleapis.com/* will not be created. However, all user metrics are also
available in the metric dataflow.googleapis.com/job/user_counter. If you rely on the custom
metrics, you can delete old / unused metric descriptors. See https://developers.google.com/apis-explorer/#p/monitoring/v3/monitoring.projects.metricDescriptors.list
and https://developers.google.com/apis-explorer/#p/monitoring/v3/monitoring.projects.metricDescriptors.delete

> Task :sdks:python:test-suites:dataflow:py36:preCommitIT_streaming_V2
INFO:apache_beam.runners.dataflow.dataflow_runner:2021-01-09T06:30:02.034Z: JOB_MESSAGE_BASIC:
Your project already contains 100 Dataflow-created metric descriptors, so new user metrics
of the form custom.googleapis.com/* will not be created. However, all user metrics are also
available in the metric dataflow.googleapis.com/job/user_counter. If you rely on the custom
metrics, you can delete old / unused metric descriptors. See https://developers.google.com/apis-explorer/#p/monitoring/v3/monitoring.projects.metricDescriptors.list
and https://developers.google.com/apis-explorer/#p/monitoring/v3/monitoring.projects.metricDescriptors.delete
INFO:apache_beam.runners.dataflow.dataflow_runner:2021-01-09T06:30:12.302Z: JOB_MESSAGE_DETAILED:
Autoscaling: Raised the number of workers to 1 so that the pipeline can catch up with its
backlog and keep up with its input rate.

> Task :sdks:python:test-suites:dataflow:py37:preCommitIT_streaming_V2
INFO:apache_beam.runners.dataflow.dataflow_runner:2021-01-09T06:30:35.634Z: JOB_MESSAGE_DETAILED:
Workers have started successfully.
INFO:apache_beam.runners.dataflow.dataflow_runner:2021-01-09T06:30:35.663Z: JOB_MESSAGE_DETAILED:
Workers have started successfully.

> Task :sdks:python:test-suites:dataflow:py36:preCommitIT_streaming_V2
INFO:apache_beam.runners.dataflow.dataflow_runner:2021-01-09T06:30:47.473Z: JOB_MESSAGE_DETAILED:
Workers have started successfully.
INFO:apache_beam.runners.dataflow.dataflow_runner:2021-01-09T06:30:47.510Z: JOB_MESSAGE_DETAILED:
Workers have started successfully.

> Task :sdks:python:test-suites:dataflow:py37:preCommitIT_streaming_V2
WARNING:apache_beam.runners.dataflow.dataflow_runner:Timing out on waiting for job 2021-01-08_22_29_19-6888172505245477650
after 360 seconds
DEBUG:google.auth._default:Checking None for explicit credentials as part of auth process...
DEBUG:google.auth._default:Checking Cloud SDK credentials as part of auth process...
DEBUG:google.auth._default:Cloud SDK credentials not found on disk; not using them
DEBUG:google.auth._default:Checking for App Engine runtime as part of auth process...
DEBUG:google.auth._default:No App Engine library was found so cannot authentication via App
Engine Identity Credentials.
DEBUG:google.auth.transport._http_client:Making request: GET http://169.254.169.254
DEBUG:google.auth.transport._http_client:Making request: GET http://metadata.google.internal/computeMetadata/v1/project/project-id
DEBUG:google.auth.transport.requests:Making request: GET http://metadata.google.internal/computeMetadata/v1/instance/service-accounts/default/?recursive=true
DEBUG:urllib3.connectionpool:Starting new HTTP connection (1): metadata.google.internal:80
DEBUG:urllib3.connectionpool:http://metadata.google.internal:80 "GET /computeMetadata/v1/instance/service-accounts/default/?recursive=true
HTTP/1.1" 200 144
DEBUG:google.auth.transport.requests:Making request: GET http://metadata.google.internal/computeMetadata/v1/instance/service-accounts/844138762903-compute@developer.gserviceaccount.com/token?scopes=https%3A%2F%2Fwww.googleapis.com%2Fauth%2Fcloud-platform%2Chttps%3A%2F%2Fwww.googleapis.com%2Fauth%2Fpubsub
DEBUG:urllib3.connectionpool:http://metadata.google.internal:80 "GET /computeMetadata/v1/instance/service-accounts/844138762903-compute@developer.gserviceaccount.com/token?scopes=https%3A%2F%2Fwww.googleapis.com%2Fauth%2Fcloud-platform%2Chttps%3A%2F%2Fwww.googleapis.com%2Fauth%2Fpubsub
HTTP/1.1" 200 241

> Task :sdks:python:test-suites:dataflow:py36:preCommitIT_streaming_V2
WARNING:apache_beam.runners.dataflow.dataflow_runner:Timing out on waiting for job 2021-01-08_22_29_29-11225169630141089589
after 360 seconds
DEBUG:google.auth._default:Checking None for explicit credentials as part of auth process...
DEBUG:google.auth._default:Checking Cloud SDK credentials as part of auth process...
DEBUG:google.auth._default:Cloud SDK credentials not found on disk; not using them
DEBUG:google.auth._default:Checking for App Engine runtime as part of auth process...
DEBUG:google.auth._default:No App Engine library was found so cannot authentication via App
Engine Identity Credentials.
DEBUG:google.auth.transport._http_client:Making request: GET http://169.254.169.254
DEBUG:google.auth.transport._http_client:Making request: GET http://metadata.google.internal/computeMetadata/v1/project/project-id
DEBUG:google.auth.transport.requests:Making request: GET http://metadata.google.internal/computeMetadata/v1/instance/service-accounts/default/?recursive=true
DEBUG:urllib3.connectionpool:Starting new HTTP connection (1): metadata.google.internal:80
DEBUG:urllib3.connectionpool:http://metadata.google.internal:80 "GET /computeMetadata/v1/instance/service-accounts/default/?recursive=true
HTTP/1.1" 200 144
DEBUG:google.auth.transport.requests:Making request: GET http://metadata.google.internal/computeMetadata/v1/instance/service-accounts/844138762903-compute@developer.gserviceaccount.com/token?scopes=https%3A%2F%2Fwww.googleapis.com%2Fauth%2Fcloud-platform%2Chttps%3A%2F%2Fwww.googleapis.com%2Fauth%2Fpubsub
DEBUG:urllib3.connectionpool:http://metadata.google.internal:80 "GET /computeMetadata/v1/instance/service-accounts/844138762903-compute@developer.gserviceaccount.com/token?scopes=https%3A%2F%2Fwww.googleapis.com%2Fauth%2Fcloud-platform%2Chttps%3A%2F%2Fwww.googleapis.com%2Fauth%2Fpubsub
HTTP/1.1" 200 241

> Task :sdks:python:test-suites:dataflow:py37:preCommitIT_streaming_V2
Worker logs: https://console.cloud.google.com/dataflow/jobs/us-central1/2021-01-08_22_29_19-6888172505245477650?project=apache-beam-testing
test_streaming_wordcount_it (apache_beam.examples.streaming_wordcount_it_test.StreamingWordCountIT)
... ok

----------------------------------------------------------------------
XML: nosetests-preCommitIT-df-py37.xml
----------------------------------------------------------------------
XML: <https://ci-beam.apache.org/job/beam_PreCommit_Python_Cron/ws/src/sdks/python/nosetests.xml>
----------------------------------------------------------------------
Ran 1 test in 528.437s

OK

> Task :sdks:python:test-suites:dataflow:py36:preCommitIT_streaming_V2
Worker logs: https://console.cloud.google.com/dataflow/jobs/us-central1/2021-01-08_22_29_29-11225169630141089589?project=apache-beam-testing
test_streaming_wordcount_it (apache_beam.examples.streaming_wordcount_it_test.StreamingWordCountIT)
... ok

----------------------------------------------------------------------
XML: nosetests-preCommitIT-df-py36.xml
----------------------------------------------------------------------
XML: <https://ci-beam.apache.org/job/beam_PreCommit_Python_Cron/ws/src/sdks/python/nosetests.xml>
----------------------------------------------------------------------
Ran 1 test in 520.289s

OK

> Task :sdks:python:test-suites:dataflow:preCommitIT_V2

FAILURE: Build completed with 3 failures.

1: Task failed with an exception.
-----------
* What went wrong:
Execution failed for task ':sdks:python:test-suites:tox:py38:testPy38CloudCoverage'.
> Process 'command 'sh'' finished with non-zero exit value 1

* Try:
Run with --stacktrace option to get the stack trace. Run with --info or --debug option to
get more log output. Run with --scan to get full insights.
==============================================================================

2: Task failed with an exception.
-----------
* What went wrong:
Execution failed for task ':sdks:python:test-suites:tox:py37:testPy37Cloud'.
> Process 'command 'sh'' finished with non-zero exit value 1

* Try:
Run with --stacktrace option to get the stack trace. Run with --info or --debug option to
get more log output. Run with --scan to get full insights.
==============================================================================

3: Task failed with an exception.
-----------
* What went wrong:
Execution failed for task ':sdks:python:test-suites:tox:py36:testPy36Cloud'.
> Process 'command 'sh'' finished with non-zero exit value 1

* Try:
Run with --stacktrace option to get the stack trace. Run with --info or --debug option to
get more log output. Run with --scan to get full insights.
==============================================================================

* Get more help at https://help.gradle.org

Deprecated Gradle features were used in this build, making it incompatible with Gradle 7.0.
Use '--warning-mode all' to show the individual deprecation warnings.
See https://docs.gradle.org/6.7.1/userguide/command_line_interface.html#sec:command_line_warnings

BUILD FAILED in 36m 47s
101 actionable tasks: 71 executed, 30 from cache

Publishing build scan...
https://gradle.com/s/ouzxjvwgjudyo

Build step 'Invoke Gradle script' changed build result to FAILURE
Build step 'Invoke Gradle script' marked build as failure

---------------------------------------------------------------------
To unsubscribe, e-mail: builds-unsubscribe@beam.apache.org
For additional commands, e-mail: builds-help@beam.apache.org


Mime
View raw message