beam-builds mailing list archives

Site index · List index
Message view « Date » · « Thread »
Top « Date » · « Thread »
From Apache Jenkins Server <jenk...@builds.apache.org>
Subject Build failed in Jenkins: beam_PostCommit_XVR_Dataflow #305
Date Thu, 28 Jan 2021 00:21:40 GMT
See <https://ci-beam.apache.org/job/beam_PostCommit_XVR_Dataflow/305/display/redirect?page=changes>

Changes:

[sonam.ramchand] Enabled strict dependency on flink runner

[sonam.ramchand] Added new line

[sonam.ramchand] removed checker-qual

[sonam.ramchand] Removed flink-clients dep

[sonam.ramchand] set enableStrictDependencies:true

[sonam.ramchand] made flink-clients runtimeOnly

[noreply] Remove stray colon.

[zyichi] [BEAM-11679] Override PubsubUnboundedSource transform for dataflow

[zyichi] Populate PubsubMessage message id

[zyichi] Enable tests

[zyichi] Exclude failing FhirIO ITs

[zyichi] Include runner v2 IT tests in java post commit

[Ismaël Mejía] [BEAM-11697] Upgrade Flink runner to Flink versions 1.12.1 and 1.11.3

[shehzaad] strict dependency checking on sdks/io/amazon-web-services*

[shehzaad] move amazon-web-services* changes to another PR

[shehzaad] undo previous erroneous commit

[shehzaad] better use of variables

[randomstep] [BEAM-8725] bump snappy-java to 1.1.8.4

[nielm] Add BigDecimal support for SpannerIO

[noreply] [BEAM-11695] Remove translations.pack_combiners from default optimizers

[Kyle Weaver] [BEAM-11689] Add public.nexus.pentaho.org to offline repositories.

[Chamikara Madhusanka Jayalath] Moving to 2.29.0-SNAPSHOT on master branch.

[noreply] [BEAM-11531] Add pd.to_datetime, handle DeferredBase args in

[Andrew Pilloud] [BEAM-11165] Async ZetaSQL Calc

[noreply] [BEAM-11695] Combiner packing in Dataflow (#13763)


------------------------------------------
[...truncated 64.60 KB...]
Collecting msrest>=0.6.18
  Using cached msrest-0.6.21-py2.py3-none-any.whl (85 kB)
Collecting cryptography>=2.1.4
  Using cached cryptography-3.3.1-cp36-abi3-manylinux2010_x86_64.whl (2.6 MB)
Collecting botocore<1.20.0,>=1.19.61
  Downloading botocore-1.19.61-py2.py3-none-any.whl (7.2 MB)
Collecting s3transfer<0.4.0,>=0.3.0
  Using cached s3transfer-0.3.4-py2.py3-none-any.whl (69 kB)
Collecting jmespath<1.0.0,>=0.7.1
  Using cached jmespath-0.10.0-py2.py3-none-any.whl (24 kB)
Collecting urllib3<1.27,>=1.25.4
  Using cached urllib3-1.26.3-py2.py3-none-any.whl (137 kB)
Collecting cffi>=1.12
  Using cached cffi-1.14.4-cp36-cp36m-manylinux1_x86_64.whl (401 kB)
Collecting pycparser
  Using cached pycparser-2.20-py2.py3-none-any.whl (112 kB)
Collecting fasteners>=0.14
  Using cached fasteners-0.16-py2.py3-none-any.whl (28 kB)
Collecting rsa<5,>=3.1.4
  Using cached rsa-4.7-py3-none-any.whl (34 kB)
Requirement already satisfied: setuptools>=40.3.0 in <https://ci-beam.apache.org/job/beam_PostCommit_XVR_Dataflow/ws/src/build/gradleenv/1922375555/lib/python3.6/site-packages>
(from google-auth<2,>=1.18.0->apache-beam==2.29.0.dev0) (52.0.0)
Collecting pyasn1-modules>=0.2.1
  Using cached pyasn1_modules-0.2.8-py2.py3-none-any.whl (155 kB)
Collecting google-resumable-media<2.0dev,>=0.6.0
  Using cached google_resumable_media-1.2.0-py2.py3-none-any.whl (75 kB)
Collecting google-api-core<2.0dev,>=1.21.0
  Using cached google_api_core-1.25.1-py2.py3-none-any.whl (92 kB)
Collecting googleapis-common-protos<2.0dev,>=1.6.0
  Using cached googleapis_common_protos-1.52.0-py2.py3-none-any.whl (100 kB)
Collecting grpc-google-iam-v1<0.13dev,>=0.12.3
  Using cached grpc_google_iam_v1-0.12.3-py3-none-any.whl
Collecting libcst>=0.2.5
  Using cached libcst-0.3.16-py3-none-any.whl (505 kB)
Collecting proto-plus>=0.4.0
  Using cached proto_plus-1.13.0-py3-none-any.whl
Collecting google-crc32c<2.0dev,>=1.0
  Using cached google_crc32c-1.1.2-cp36-cp36m-manylinux2014_x86_64.whl (38 kB)
Collecting docopt
  Using cached docopt-0.6.2-py2.py3-none-any.whl
Collecting dataclasses>=0.6.0
  Using cached dataclasses-0.8-py3-none-any.whl (19 kB)
Collecting typing-inspect>=0.4.0
  Using cached typing_inspect-0.6.0-py3-none-any.whl (8.1 kB)
Collecting pbr>=0.11
  Using cached pbr-5.5.1-py2.py3-none-any.whl (106 kB)
Collecting certifi>=2017.4.17
  Using cached certifi-2020.12.5-py2.py3-none-any.whl (147 kB)
Collecting isodate>=0.6.0
  Using cached isodate-0.6.0-py2.py3-none-any.whl (45 kB)
Collecting requests-oauthlib>=0.5.0
  Using cached requests_oauthlib-1.3.0-py2.py3-none-any.whl (23 kB)
Collecting pyasn1>=0.1.7
  Using cached pyasn1-0.4.8-py2.py3-none-any.whl (77 kB)
Requirement already satisfied: pyparsing>=2.1.4 in <https://ci-beam.apache.org/job/beam_PostCommit_XVR_Dataflow/ws/src/build/gradleenv/1922375555/lib/python3.6/site-packages>
(from pydot<2,>=1.2.0->apache-beam==2.29.0.dev0) (2.4.7)
Requirement already satisfied: pluggy<1.0,>=0.12 in <https://ci-beam.apache.org/job/beam_PostCommit_XVR_Dataflow/ws/src/build/gradleenv/1922375555/lib/python3.6/site-packages>
(from pytest<5.0,>=4.4.0->apache-beam==2.29.0.dev0) (0.13.1)
Collecting atomicwrites>=1.0
  Using cached atomicwrites-1.4.0-py2.py3-none-any.whl (6.8 kB)
Collecting wcwidth
  Using cached wcwidth-0.2.5-py2.py3-none-any.whl (30 kB)
Requirement already satisfied: py>=1.5.0 in <https://ci-beam.apache.org/job/beam_PostCommit_XVR_Dataflow/ws/src/build/gradleenv/1922375555/lib/python3.6/site-packages>
(from pytest<5.0,>=4.4.0->apache-beam==2.29.0.dev0) (1.10.0)
Requirement already satisfied: packaging in <https://ci-beam.apache.org/job/beam_PostCommit_XVR_Dataflow/ws/src/build/gradleenv/1922375555/lib/python3.6/site-packages>
(from pytest<5.0,>=4.4.0->apache-beam==2.29.0.dev0) (20.8)
Collecting more-itertools>=4.0.0
  Using cached more_itertools-8.6.0-py3-none-any.whl (45 kB)
Collecting attrs>=17.4.0
  Using cached attrs-20.3.0-py2.py3-none-any.whl (49 kB)
Requirement already satisfied: importlib-metadata>=0.12 in <https://ci-beam.apache.org/job/beam_PostCommit_XVR_Dataflow/ws/src/build/gradleenv/1922375555/lib/python3.6/site-packages>
(from pytest<5.0,>=4.4.0->apache-beam==2.29.0.dev0) (2.1.1)
Requirement already satisfied: zipp>=0.5 in <https://ci-beam.apache.org/job/beam_PostCommit_XVR_Dataflow/ws/src/build/gradleenv/1922375555/lib/python3.6/site-packages>
(from importlib-metadata>=0.12->pytest<5.0,>=4.4.0->apache-beam==2.29.0.dev0)
(3.4.0)
Collecting execnet>=1.1
  Using cached execnet-1.8.0-py2.py3-none-any.whl (39 kB)
Collecting pytest-forked
  Using cached pytest_forked-1.3.0-py2.py3-none-any.whl (4.7 kB)
Collecting apipkg>=1.4
  Using cached apipkg-1.5-py2.py3-none-any.whl (4.9 kB)
Collecting chardet<5,>=3.0.2
  Using cached chardet-4.0.0-py2.py3-none-any.whl (178 kB)
Collecting idna<3,>=2.5
  Using cached idna-2.10-py2.py3-none-any.whl (58 kB)
Collecting oauthlib>=3.0.0
  Using cached oauthlib-3.1.0-py2.py3-none-any.whl (147 kB)
Collecting docker
  Using cached docker-4.4.1-py2.py3-none-any.whl (146 kB)
Collecting wrapt
  Using cached wrapt-1.12.1-cp36-cp36m-linux_x86_64.whl
Collecting deprecation
  Using cached deprecation-2.1.0-py2.py3-none-any.whl (11 kB)
Collecting mypy-extensions>=0.3.0
  Using cached mypy_extensions-0.4.3-py2.py3-none-any.whl (4.5 kB)
Collecting websocket-client>=0.32.0
  Using cached websocket_client-0.57.0-py2.py3-none-any.whl (200 kB)
Building wheels for collected packages: apache-beam
  Building wheel for apache-beam (setup.py): started
  Building wheel for apache-beam (setup.py): finished with status 'done'
  Created wheel for apache-beam: filename=apache_beam-2.29.0.dev0-py3-none-any.whl size=2388650
sha256=cef278bebbc099d425816221ac55f11ec89583aa1b7ec415fe580c99ddce39cf
  Stored in directory: /home/jenkins/.cache/pip/wheels/ac/28/6e/20a1cb68f78721e12815f377be5bd7dc86dac3332b84355793
Successfully built apache-beam
Installing collected packages: pyasn1, urllib3, rsa, pycparser, pyasn1-modules, idna, chardet,
certifi, cachetools, wcwidth, typing-extensions, requests, pytz, python-dateutil, oauthlib,
mypy-extensions, more-itertools, jmespath, googleapis-common-protos, google-auth, cffi, attrs,
atomicwrites, websocket-client, typing-inspect, requests-oauthlib, pyyaml, pytest, pbr, numpy,
isodate, httplib2, grpcio-gcp, google-crc32c, google-api-core, docopt, dataclasses, botocore,
apipkg, wrapt, s3transfer, pytest-forked, pymongo, pydot, pyarrow, proto-plus, oauth2client,
nose, msrest, mock, libcst, hdfs, grpc-google-iam-v1, google-resumable-media, google-cloud-core,
fasteners, fastavro, execnet, docker, dill, deprecation, cryptography, crcmod, azure-core,
avro-python3, testcontainers, tenacity, sqlalchemy, requests-mock, pytest-xdist, pytest-timeout,
pyhamcrest, psycopg2-binary, parameterized, pandas, nose-xunitmp, google-cloud-vision, google-cloud-videointelligence,
google-cloud-spanner, google-cloud-pubsub, google-cloud-language, google-cloud-dlp, google-cloud-datastore,
google-cloud-build, google-cloud-bigtable, google-cloud-bigquery, google-apitools, freezegun,
boto3, azure-storage-blob, apache-beam
Successfully installed apache-beam-2.29.0.dev0 apipkg-1.5 atomicwrites-1.4.0 attrs-20.3.0
avro-python3-1.9.2.1 azure-core-1.10.0 azure-storage-blob-12.7.1 boto3-1.16.61 botocore-1.19.61
cachetools-4.2.1 certifi-2020.12.5 cffi-1.14.4 chardet-4.0.0 crcmod-1.7 cryptography-3.3.1
dataclasses-0.8 deprecation-2.1.0 dill-0.3.1.1 docker-4.4.1 docopt-0.6.2 execnet-1.8.0 fastavro-1.3.0
fasteners-0.16 freezegun-1.1.0 google-api-core-1.25.1 google-apitools-0.5.31 google-auth-1.24.0
google-cloud-bigquery-1.28.0 google-cloud-bigtable-1.6.1 google-cloud-build-2.0.0 google-cloud-core-1.5.0
google-cloud-datastore-1.15.3 google-cloud-dlp-1.0.0 google-cloud-language-1.3.0 google-cloud-pubsub-1.7.0
google-cloud-spanner-1.19.1 google-cloud-videointelligence-1.16.1 google-cloud-vision-1.0.0
google-crc32c-1.1.2 google-resumable-media-1.2.0 googleapis-common-protos-1.52.0 grpc-google-iam-v1-0.12.3
grpcio-gcp-0.2.2 hdfs-2.5.8 httplib2-0.17.4 idna-2.10 isodate-0.6.0 jmespath-0.10.0 libcst-0.3.16
mock-2.0.0 more-itertools-8.6.0 msrest-0.6.21 mypy-extensions-0.4.3 nose-1.3.7 nose-xunitmp-0.4.1
numpy-1.19.5 oauth2client-4.1.3 oauthlib-3.1.0 pandas-1.1.5 parameterized-0.7.5 pbr-5.5.1
proto-plus-1.13.0 psycopg2-binary-2.8.6 pyarrow-2.0.0 pyasn1-0.4.8 pyasn1-modules-0.2.8 pycparser-2.20
pydot-1.4.1 pyhamcrest-1.10.1 pymongo-3.11.2 pytest-4.6.11 pytest-forked-1.3.0 pytest-timeout-1.4.2
pytest-xdist-1.34.0 python-dateutil-2.8.1 pytz-2020.5 pyyaml-5.4.1 requests-2.25.1 requests-mock-1.8.0
requests-oauthlib-1.3.0 rsa-4.7 s3transfer-0.3.4 sqlalchemy-1.3.22 tenacity-5.1.5 testcontainers-3.2.0
typing-extensions-3.7.4.3 typing-inspect-0.6.0 urllib3-1.26.3 wcwidth-0.2.5 websocket-client-0.57.0
wrapt-1.12.1

> Task :sdks:go:resolveBuildDependencies
Resolving google.golang.org/api: commit='0324d5e90dc7753607860272666845fad9ceb97e', urls=[https://code.googlesource.com/google-api-go-client]
Resolving google.golang.org/genproto: commit='4d944d34d83c502a5f761500a14d8842648415c3', urls=[https://github.com/google/go-genproto]
Resolving google.golang.org/grpc: commit='5e8f83304c0563d1ba74db05fee83d9c18ab9a58', urls=[https://github.com/grpc/grpc-go]
Resolving google.golang.org/protobuf: commit='d165be301fb1e13390ad453281ded24385fd8ebc', urls=[https://go.googlesource.com/protobuf]
Resolving cached github.com/etcd-io/etcd: commit='11214aa33bf5a47d3d9d8dafe0f6b97237dfe921',
urls=[https://github.com/etcd-io/etcd.git, git@github.com:etcd-io/etcd.git]
Resolving cached github.com/etcd-io/etcd: commit='11214aa33bf5a47d3d9d8dafe0f6b97237dfe921',
urls=[https://github.com/etcd-io/etcd.git, git@github.com:etcd-io/etcd.git]

> Task :sdks:go:installDependencies

> Task :sdks:java:core:compileJava
Note: Some input files use or override a deprecated API.
Note: Recompile with -Xlint:deprecation for details.
Note: Some input files use unchecked or unsafe operations.
Note: Recompile with -Xlint:unchecked for details.

> Task :sdks:java:core:classes
> Task :sdks:java:core:shadowJar FROM-CACHE
> Task :vendor:sdks-java-extensions-protobuf:compileJava FROM-CACHE
> Task :vendor:sdks-java-extensions-protobuf:classes UP-TO-DATE
> Task :sdks:java:fn-execution:compileJava FROM-CACHE
> Task :sdks:java:fn-execution:classes UP-TO-DATE
> Task :sdks:java:fn-execution:jar
> Task :vendor:sdks-java-extensions-protobuf:shadowJar FROM-CACHE
> Task :sdks:java:io:hadoop-common:compileJava
> Task :sdks:java:io:hadoop-common:classes
> Task :sdks:java:io:hadoop-common:jar
> Task :runners:core-construction-java:compileJava
> Task :sdks:java:io:parquet:compileJava
> Task :sdks:java:io:parquet:classes
> Task :sdks:java:io:parquet:jar

> Task :runners:core-construction-java:compileJava
Note: Some input files use or override a deprecated API.
Note: Recompile with -Xlint:deprecation for details.
Note: Some input files use unchecked or unsafe operations.
Note: Recompile with -Xlint:unchecked for details.

> Task :runners:core-construction-java:classes
> Task :runners:core-construction-java:jar
> Task :runners:core-java:compileJava
Note: Some input files use or override a deprecated API.
Note: Recompile with -Xlint:deprecation for details.
Note: Some input files use unchecked or unsafe operations.
Note: Recompile with -Xlint:unchecked for details.

> Task :runners:core-java:classes
> Task :runners:core-java:jar
> Task :sdks:java:extensions:google-cloud-platform-core:compileJava FROM-CACHE
> Task :sdks:java:extensions:google-cloud-platform-core:classes UP-TO-DATE
> Task :sdks:java:extensions:google-cloud-platform-core:jar
> Task :sdks:java:harness:compileJava
Note: Some input files use or override a deprecated API.
Note: Recompile with -Xlint:deprecation for details.
Note: Some input files use unchecked or unsafe operations.
Note: Recompile with -Xlint:unchecked for details.

> Task :sdks:java:harness:classes
> Task :sdks:java:harness:jar
> Task :sdks:java:harness:shadowJar
> Task :sdks:go:buildLinuxAmd64
> Task :sdks:go:goBuild

> Task :sdks:python:container:resolveBuildDependencies
Resolving ./github.com/apache/beam/sdks/go@<https://ci-beam.apache.org/job/beam_PostCommit_XVR_Dataflow/ws/src/sdks/go>

> Task :sdks:java:container:resolveBuildDependencies
Resolving ./github.com/apache/beam/sdks/go@<https://ci-beam.apache.org/job/beam_PostCommit_XVR_Dataflow/ws/src/sdks/go>

> Task :runners:java-fn-execution:compileJava
> Task :sdks:python:container:installDependencies
> Task :sdks:java:container:installDependencies

> Task :sdks:python:container:buildDarwinAmd64
Unable to watch the file system for changes. The inotify watches limit is too low.

> Task :sdks:java:container:buildLinuxAmd64
> Task :sdks:java:container:goBuild
> Task :sdks:java:container:java8:copySdkHarnessLauncher
> Task :sdks:python:container:buildLinuxAmd64
> Task :sdks:python:container:goBuild
> Task :sdks:python:container:py36:copyLauncherDependencies

> Task :runners:java-fn-execution:compileJava
Note: Some input files use or override a deprecated API.
Note: Recompile with -Xlint:deprecation for details.
Note: Some input files use unchecked or unsafe operations.
Note: Recompile with -Xlint:unchecked for details.

> Task :runners:java-fn-execution:classes
> Task :runners:java-fn-execution:jar
> Task :sdks:java:expansion-service:compileJava FROM-CACHE
> Task :sdks:java:expansion-service:classes UP-TO-DATE
> Task :sdks:java:expansion-service:jar
> Task :sdks:java:io:kafka:compileJava
> Task :sdks:java:testing:expansion-service:compileTestJava
Note: <https://ci-beam.apache.org/job/beam_PostCommit_XVR_Dataflow/ws/src/sdks/java/testing/expansion-service/src/test/java/org/apache/beam/sdk/testing/expansion/TestExpansionService.java>
uses or overrides a deprecated API.
Note: Recompile with -Xlint:deprecation for details.
Note: <https://ci-beam.apache.org/job/beam_PostCommit_XVR_Dataflow/ws/src/sdks/java/testing/expansion-service/src/test/java/org/apache/beam/sdk/testing/expansion/TestExpansionService.java>
uses unchecked or unsafe operations.
Note: Recompile with -Xlint:unchecked for details.

> Task :sdks:java:testing:expansion-service:testClasses
> Task :sdks:java:testing:expansion-service:buildTestExpansionServiceJar

> Task :sdks:java:io:kafka:compileJava
Note: Some input files use or override a deprecated API.
Note: Recompile with -Xlint:deprecation for details.
Note: Some input files use unchecked or unsafe operations.
Note: Recompile with -Xlint:unchecked for details.

> Task :sdks:java:io:kafka:classes
> Task :sdks:java:io:kafka:jar
> Task :sdks:java:container:java8:copyDockerfileDependencies

FAILURE: Build completed with 2 failures.

1: Task failed with an exception.
-----------
* What went wrong:
Execution failed for task ':release:go-licenses:py:dockerRun'.
> Process 'command 'docker'' finished with non-zero exit value 1

* Try:
Run with --stacktrace option to get the stack trace. Run with --info or --debug option to
get more log output. Run with --scan to get full insights.
==============================================================================

2: Task failed with an exception.
-----------
* What went wrong:
Execution failed for task ':release:go-licenses:java:dockerRun'.
> Process 'command 'docker'' finished with non-zero exit value 1

* Try:
Run with --stacktrace option to get the stack trace. Run with --info or --debug option to
get more log output. Run with --scan to get full insights.
==============================================================================

* Get more help at https://help.gradle.org

Deprecated Gradle features were used in this build, making it incompatible with Gradle 7.0.
Use '--warning-mode all' to show the individual deprecation warnings.
See https://docs.gradle.org/6.8/userguide/command_line_interface.html#sec:command_line_warnings

BUILD FAILED in 20m 18s
104 actionable tasks: 84 executed, 16 from cache, 4 up-to-date
Gradle was unable to watch the file system for changes. The inotify watches limit is too low.

Publishing build scan...
https://gradle.com/s/idz4sd7l4y2g4

Build step 'Invoke Gradle script' changed build result to FAILURE
Build step 'Invoke Gradle script' marked build as failure

---------------------------------------------------------------------
To unsubscribe, e-mail: builds-unsubscribe@beam.apache.org
For additional commands, e-mail: builds-help@beam.apache.org


Mime
View raw message