beam-builds mailing list archives

Site index · List index
Message view « Date » · « Thread »
Top « Date » · « Thread »
From Apache Jenkins Server <jenk...@builds.apache.org>
Subject Build failed in Jenkins: beam_LoadTests_Go_Combine_Flink_Batch #63
Date Wed, 27 Jan 2021 08:54:00 GMT
See <https://ci-beam.apache.org/job/beam_LoadTests_Go_Combine_Flink_Batch/63/display/redirect?page=changes>

Changes:

[Kyle Weaver] [BEAM-10925] Load SQL UDFs from jar.

[Kyle Weaver] Move JavaUdfLoader from zetasql -> sql.

[Kyle Weaver] Make JavaUdfDefinitions a subclass of JavaUdfLoader.

[Kyle Weaver] [BEAM-9541] Push all docker images from RC instead of hard-coding them.

[randomstep] [BEAM-9369] bump mockito-core to 3.7.7

[Fokko Driesprong] BEAM-4986: Bump to Apache Parquet 1.11.1

[Kyle Weaver] Don't set context classloader.

[Pablo Estrada] Revert "Revert "Merge pull request #12647 from [BEAM-10378]

[Pablo Estrada] Fixing checker framework checks

[Kyle Weaver] [BEAM-9541] Update Python SDK's Flink version list.

[Kyle Weaver] [BEAM-9541] Create a Gradle task to push all docker images, and use it

[Kyle Weaver] [BEAM-11689] Use public.nexus.pentaho.org for pentaho dependencies

[noreply] [BEAM-11272] Remove combiner label constructor arg (#13355)

[noreply] [BEAM-11691] Skip JavaUdfLoaderTest instead of failing when jar path

[noreply] Merge pull request #13757: [BEAM-11640] Linkage Checker version upgrade


------------------------------------------
[...truncated 48.74 KB...]
      spec: <
        urn: "beam:go:coder:custom:v1"
        payload: "CgRqc29uEgoIFBIGCBQSAggIGnkKX2dpdGh1Yi5jb20vYXBhY2hlL2JlYW0vc2Rrcy9nby90ZXN0L2xvYWQvdmVuZG9yL2dpdGh1Yi5jb20vYXBhY2hlL2JlYW0vc2Rrcy9nby9wa2cvYmVhbS5qc29uRW5jEhYIFiIECBlADyoGCBQSAggIKgQIGUABIn8KX2dpdGh1Yi5jb20vYXBhY2hlL2JlYW0vc2Rrcy9nby90ZXN0L2xvYWQvdmVuZG9yL2dpdGh1Yi5jb20vYXBhY2hlL2JlYW0vc2Rrcy9nby9wa2cvYmVhbS5qc29uRGVjEhwIFiIECBlAAyIGCBQSAggIKgQIGUAPKgQIGUAB"
      >
    >
  >
  coders: <
    key: "c4"
    value: <
      spec: <
        urn: "beam:coder:length_prefix:v1"
      >
      component_coder_ids: "c3"
    >
  >
  coders: <
    key: "c5"
    value: <
      spec: <
        urn: "beam:coder:kv:v1"
      >
      component_coder_ids: "c0"
      component_coder_ids: "c4"
    >
  >
  coders: <
    key: "c6"
    value: <
      spec: <
        urn: "beam:go:coder:custom:v1"
        payload: "CgRqc29uEosCCBUaKAoLTnVtRWxlbWVudHMaAggCIhJqc29uOiJudW1fcmVjb3JkcyIyAQAaLwoNSW5pdGlhbFNwbGl0cxoCCAIiFWpzb246ImluaXRpYWxfc3BsaXRzIigIMgEBGiMKB0tleVNpemUaAggCIg9qc29uOiJrZXlfc2l6ZSIoEDIBAhonCglWYWx1ZVNpemUaAggCIhFqc29uOiJ2YWx1ZV9zaXplIigYMgEDGioKCk51bUhvdEtleXMaAggCIhNqc29uOiJudW1faG90X2tleXMiKCAyAQQaMgoOSG90S2V5RnJhY3Rpb24aAggOIhdqc29uOiJob3Rfa2V5X2ZyYWN0aW9uIigoMgEFGnkKX2dpdGh1Yi5jb20vYXBhY2hlL2JlYW0vc2Rrcy9nby90ZXN0L2xvYWQvdmVuZG9yL2dpdGh1Yi5jb20vYXBhY2hlL2JlYW0vc2Rrcy9nby9wa2cvYmVhbS5qc29uRW5jEhYIFiIECBlADyoGCBQSAggIKgQIGUABIn8KX2dpdGh1Yi5jb20vYXBhY2hlL2JlYW0vc2Rrcy9nby90ZXN0L2xvYWQvdmVuZG9yL2dpdGh1Yi5jb20vYXBhY2hlL2JlYW0vc2Rrcy9nby9wa2cvYmVhbS5qc29uRGVjEhwIFiIECBlAAyIGCBQSAggIKgQIGUAPKgQIGUAB"
      >
    >
  >
  coders: <
    key: "c7"
    value: <
      spec: <
        urn: "beam:coder:length_prefix:v1"
      >
      component_coder_ids: "c6"
    >
  >
  coders: <
    key: "c8"
    value: <
      spec: <
        urn: "beam:go:coder:custom:v1"
        payload: "ChdvZmZzZXRyYW5nZS5SZXN0cmljdGlvbhKAAQgaSnxnaXRodWIuY29tL2FwYWNoZS9iZWFtL3Nka3MvZ28vdGVzdC9sb2FkL3ZlbmRvci9naXRodWIuY29tL2FwYWNoZS9iZWFtL3Nka3MvZ28vcGtnL2JlYW0vaW8vcnRyYWNrZXJzL29mZnNldHJhbmdlLlJlc3RyaWN0aW9uGpACCnhnaXRodWIuY29tL2FwYWNoZS9iZWFtL3Nka3MvZ28vdGVzdC9sb2FkL3ZlbmRvci9naXRodWIuY29tL2FwYWNoZS9iZWFtL3Nka3MvZ28vcGtnL2JlYW0vaW8vcnRyYWNrZXJzL29mZnNldHJhbmdlLnJlc3RFbmMSkwEIFiKAAQgaSnxnaXRodWIuY29tL2FwYWNoZS9iZWFtL3Nka3MvZ28vdGVzdC9sb2FkL3ZlbmRvci9naXRodWIuY29tL2FwYWNoZS9iZWFtL3Nka3MvZ28vcGtnL2JlYW0vaW8vcnRyYWNrZXJzL29mZnNldHJhbmdlLlJlc3RyaWN0aW9uKgYIFBICCAgqBAgZQAEikAIKeGdpdGh1Yi5jb20vYXBhY2hlL2JlYW0vc2Rrcy9nby90ZXN0L2xvYWQvdmVuZG9yL2dpdGh1Yi5jb20vYXBhY2hlL2JlYW0vc2Rrcy9nby9wa2cvYmVhbS9pby9ydHJhY2tlcnMvb2Zmc2V0cmFuZ2UucmVzdERlYxKTAQgWIgYIFBICCAgqgAEIGkp8Z2l0aHViLmNvbS9hcGFjaGUvYmVhbS9zZGtzL2dvL3Rlc3QvbG9hZC92ZW5kb3IvZ2l0aHViLmNvbS9hcGFjaGUvYmVhbS9zZGtzL2dvL3BrZy9iZWFtL2lvL3J0cmFja2Vycy9vZmZzZXRyYW5nZS5SZXN0cmljdGlvbioECBlAAQ=="
      >
    >
  >
  coders: <
    key: "c9"
    value: <
      spec: <
        urn: "beam:coder:length_prefix:v1"
      >
      component_coder_ids: "c8"
    >
  >
  environments: <
    key: "go"
    value: <
      urn: "beam:env:docker:v1"
      payload: "\n>gcr.io/apache-beam-testing/beam_portability/beam_go_sdk:latest"
      capabilities: "beam:protocol:progress_reporting:v0"
      capabilities: "beam:protocol:multi_core_bundle_processing:v1"
      capabilities: "beam:version:sdk_base:go"
      capabilities: "beam:coder:bytes:v1"
      capabilities: "beam:coder:bool:v1"
      capabilities: "beam:coder:varint:v1"
      capabilities: "beam:coder:double:v1"
      capabilities: "beam:coder:string_utf8:v1"
      capabilities: "beam:coder:length_prefix:v1"
      capabilities: "beam:coder:kv:v1"
      capabilities: "beam:coder:iterable:v1"
      capabilities: "beam:coder:state_backed_iterable:v1"
      capabilities: "beam:coder:windowed_value:v1"
      capabilities: "beam:coder:global_window:v1"
      capabilities: "beam:coder:interval_window:v1"
      dependencies: <
        type_urn: "beam:artifact:type:go_****_binary:v1"
        role_urn: "beam:artifact:role:staging_to:v1"
        role_payload: "\n\006****"
      >
    >
  >
>
root_transform_ids: "s1"
root_transform_ids: "e4"
root_transform_ids: "s2"
root_transform_ids: "e7"
root_transform_ids: "e8"
requirements: "beam:requirement:pardo:splittable_dofn:v1"
2021/01/27 08:48:46 Prepared job with id: load-tests-go-flink-batch-combine-1-0127065305_b4c8b619-25e1-48e8-8c3e-376eb94cfc75
and staging token: load-tests-go-flink-batch-combine-1-0127065305_b4c8b619-25e1-48e8-8c3e-376eb94cfc75
2021/01/27 08:48:46 Using specified **** binary: 'linux_amd64/combine'
2021/01/27 08:48:49 Staged binary artifact with token: 
2021/01/27 08:48:50 Submitted job: load0tests0go0flink0batch0combine0100127065305-root-0127084850-61618947_b8d4c4c0-012c-4ee8-8c7f-420a8ffd7524
2021/01/27 08:48:50 Job state: STOPPED
2021/01/27 08:48:50 Job state: STARTING
2021/01/27 08:48:50 Job state: RUNNING
2021/01/27 08:53:58  (): java.util.concurrent.ExecutionException: org.apache.flink.client.program.ProgramInvocationException:
Job failed (JobID: b6707d04a010e3e519b32fb7f5967618)
	at java.util.concurrent.CompletableFuture.reportGet(CompletableFuture.java:357)
	at java.util.concurrent.CompletableFuture.get(CompletableFuture.java:1908)
	at org.apache.flink.api.java.ExecutionEnvironment.execute(ExecutionEnvironment.java:864)
	at org.apache.beam.runners.flink.FlinkBatchPortablePipelineTranslator$BatchTranslationContext.execute(FlinkBatchPortablePipelineTranslator.java:199)
	at org.apache.beam.runners.flink.FlinkPipelineRunner.runPipelineWithTranslator(FlinkPipelineRunner.java:118)
	at org.apache.beam.runners.flink.FlinkPipelineRunner.run(FlinkPipelineRunner.java:85)
	at org.apache.beam.runners.jobsubmission.JobInvocation.runPipeline(JobInvocation.java:86)
	at org.apache.beam.vendor.guava.v26_0_jre.com.google.common.util.concurrent.TrustedListenableFutureTask$TrustedFutureInterruptibleTask.runInterruptibly(TrustedListenableFutureTask.java:125)
	at org.apache.beam.vendor.guava.v26_0_jre.com.google.common.util.concurrent.InterruptibleTask.run(InterruptibleTask.java:57)
	at org.apache.beam.vendor.guava.v26_0_jre.com.google.common.util.concurrent.TrustedListenableFutureTask.run(TrustedListenableFutureTask.java:78)
	at java.util.concurrent.ThreadPoolExecutor.runWorker(ThreadPoolExecutor.java:1149)
	at java.util.concurrent.ThreadPoolExecutor$Worker.run(ThreadPoolExecutor.java:624)
	at java.lang.Thread.run(Thread.java:748)
Caused by: org.apache.flink.client.program.ProgramInvocationException: Job failed (JobID:
b6707d04a010e3e519b32fb7f5967618)
	at org.apache.flink.client.deployment.ClusterClientJobClientAdapter.lambda$null$6(ClusterClientJobClientAdapter.java:112)
	at java.util.concurrent.CompletableFuture.uniApply(CompletableFuture.java:616)
	at java.util.concurrent.CompletableFuture$UniApply.tryFire(CompletableFuture.java:591)
	at java.util.concurrent.CompletableFuture.postComplete(CompletableFuture.java:488)
	at java.util.concurrent.CompletableFuture.complete(CompletableFuture.java:1975)
	at org.apache.flink.client.program.rest.RestClusterClient.lambda$pollResourceAsync$21(RestClusterClient.java:565)
	at java.util.concurrent.CompletableFuture.uniWhenComplete(CompletableFuture.java:774)
	at java.util.concurrent.CompletableFuture$UniWhenComplete.tryFire(CompletableFuture.java:750)
	at java.util.concurrent.CompletableFuture.postComplete(CompletableFuture.java:488)
	at java.util.concurrent.CompletableFuture.complete(CompletableFuture.java:1975)
	at org.apache.flink.runtime.concurrent.FutureUtils.lambda$retryOperationWithDelay$8(FutureUtils.java:291)
	at java.util.concurrent.CompletableFuture.uniWhenComplete(CompletableFuture.java:774)
	at java.util.concurrent.CompletableFuture$UniWhenComplete.tryFire(CompletableFuture.java:750)
	at java.util.concurrent.CompletableFuture.postComplete(CompletableFuture.java:488)
	at java.util.concurrent.CompletableFuture.postFire(CompletableFuture.java:575)
	at java.util.concurrent.CompletableFuture$UniCompose.tryFire(CompletableFuture.java:943)
	at java.util.concurrent.CompletableFuture$Completion.run(CompletableFuture.java:456)
	... 3 more
Caused by: org.apache.flink.runtime.client.JobExecutionException: Job execution failed.
	at org.apache.flink.runtime.jobmaster.JobResult.toJobExecutionResult(JobResult.java:147)
	at org.apache.flink.client.deployment.ClusterClientJobClientAdapter.lambda$null$6(ClusterClientJobClientAdapter.java:110)
	... 19 more
Caused by: org.apache.flink.runtime.JobException: Recovery is suppressed by NoRestartBackoffTimeStrategy
	at org.apache.flink.runtime.executiongraph.failover.flip1.ExecutionFailureHandler.handleFailure(ExecutionFailureHandler.java:110)
	at org.apache.flink.runtime.executiongraph.failover.flip1.ExecutionFailureHandler.getFailureHandlingResult(ExecutionFailureHandler.java:76)
	at org.apache.flink.runtime.scheduler.DefaultScheduler.handleTaskFailure(DefaultScheduler.java:192)
	at org.apache.flink.runtime.scheduler.DefaultScheduler.maybeHandleTaskFailure(DefaultScheduler.java:186)
	at org.apache.flink.runtime.scheduler.DefaultScheduler.updateTaskExecutionStateInternal(DefaultScheduler.java:180)
	at org.apache.flink.runtime.scheduler.SchedulerBase.updateTaskExecutionState(SchedulerBase.java:496)
	at org.apache.flink.runtime.scheduler.UpdateSchedulerNgOnInternalFailuresListener.notifyTaskFailure(UpdateSchedulerNgOnInternalFailuresListener.java:49)
	at org.apache.flink.runtime.executiongraph.ExecutionGraph.notifySchedulerNgAboutInternalTaskFailure(ExecutionGraph.java:1703)
	at org.apache.flink.runtime.executiongraph.Execution.processFail(Execution.java:1252)
	at org.apache.flink.runtime.executiongraph.Execution.processFail(Execution.java:1220)
	at org.apache.flink.runtime.executiongraph.Execution.markFailed(Execution.java:1051)
	at org.apache.flink.runtime.executiongraph.ExecutionVertex.markFailed(ExecutionVertex.java:748)
	at org.apache.flink.runtime.scheduler.DefaultExecutionVertexOperations.markFailed(DefaultExecutionVertexOperations.java:41)
	at org.apache.flink.runtime.scheduler.DefaultScheduler.handleTaskDeploymentFailure(DefaultScheduler.java:446)
	at org.apache.flink.runtime.scheduler.DefaultScheduler.lambda$assignResourceOrHandleError$5(DefaultScheduler.java:433)
	at java.util.concurrent.CompletableFuture.uniHandle(CompletableFuture.java:836)
	at java.util.concurrent.CompletableFuture$UniHandle.tryFire(CompletableFuture.java:811)
	at java.util.concurrent.CompletableFuture.postComplete(CompletableFuture.java:488)
	at java.util.concurrent.CompletableFuture.completeExceptionally(CompletableFuture.java:1990)
	at org.apache.flink.runtime.jobmaster.slotpool.SchedulerImpl.lambda$internalAllocateSlot$0(SchedulerImpl.java:168)
	at java.util.concurrent.CompletableFuture.uniWhenComplete(CompletableFuture.java:774)
	at java.util.concurrent.CompletableFuture$UniWhenComplete.tryFire(CompletableFuture.java:750)
	at java.util.concurrent.CompletableFuture.postComplete(CompletableFuture.java:488)
	at java.util.concurrent.CompletableFuture.completeExceptionally(CompletableFuture.java:1990)
	at org.apache.flink.runtime.jobmaster.slotpool.SlotSharingManager$SingleTaskSlot.release(SlotSharingManager.java:726)
	at org.apache.flink.runtime.jobmaster.slotpool.SlotSharingManager$MultiTaskSlot.release(SlotSharingManager.java:537)
	at org.apache.flink.runtime.jobmaster.slotpool.SlotSharingManager$MultiTaskSlot.lambda$new$0(SlotSharingManager.java:432)
	at java.util.concurrent.CompletableFuture.uniHandle(CompletableFuture.java:836)
	at java.util.concurrent.CompletableFuture$UniHandle.tryFire(CompletableFuture.java:811)
	at java.util.concurrent.CompletableFuture.postComplete(CompletableFuture.java:488)
	at java.util.concurrent.CompletableFuture.completeExceptionally(CompletableFuture.java:1990)
	at org.apache.flink.runtime.concurrent.FutureUtils.lambda$forward$21(FutureUtils.java:1065)
	at java.util.concurrent.CompletableFuture.uniWhenComplete(CompletableFuture.java:774)
	at java.util.concurrent.CompletableFuture$UniWhenComplete.tryFire(CompletableFuture.java:750)
	at java.util.concurrent.CompletableFuture.postComplete(CompletableFuture.java:488)
	at java.util.concurrent.CompletableFuture.completeExceptionally(CompletableFuture.java:1990)
	at org.apache.flink.runtime.concurrent.FutureUtils$Timeout.run(FutureUtils.java:999)
	at org.apache.flink.runtime.rpc.akka.AkkaRpcActor.handleRunAsync(AkkaRpcActor.java:402)
	at org.apache.flink.runtime.rpc.akka.AkkaRpcActor.handleRpcMessage(AkkaRpcActor.java:195)
	at org.apache.flink.runtime.rpc.akka.FencedAkkaRpcActor.handleRpcMessage(FencedAkkaRpcActor.java:74)
	at org.apache.flink.runtime.rpc.akka.AkkaRpcActor.handleMessage(AkkaRpcActor.java:152)
	at akka.japi.pf.UnitCaseStatement.apply(CaseStatements.scala:26)
	at akka.japi.pf.UnitCaseStatement.apply(CaseStatements.scala:21)
	at scala.PartialFunction$class.applyOrElse(PartialFunction.scala:123)
	at akka.japi.pf.UnitCaseStatement.applyOrElse(CaseStatements.scala:21)
	at scala.PartialFunction$OrElse.applyOrElse(PartialFunction.scala:170)
	at scala.PartialFunction$OrElse.applyOrElse(PartialFunction.scala:171)
	at scala.PartialFunction$OrElse.applyOrElse(PartialFunction.scala:171)
	at akka.actor.Actor$class.aroundReceive(Actor.scala:517)
	at akka.actor.AbstractActor.aroundReceive(AbstractActor.scala:225)
	at akka.actor.ActorCell.receiveMessage(ActorCell.scala:592)
	at akka.actor.ActorCell.invoke(ActorCell.scala:561)
	at akka.dispatch.Mailbox.processMailbox(Mailbox.scala:258)
	at akka.dispatch.Mailbox.run(Mailbox.scala:225)
	at akka.dispatch.Mailbox.exec(Mailbox.scala:235)
	at akka.dispatch.forkjoin.ForkJoinTask.doExec(ForkJoinTask.java:260)
	at akka.dispatch.forkjoin.ForkJoinPool$WorkQueue.runTask(ForkJoinPool.java:1339)
	at akka.dispatch.forkjoin.ForkJoinPool.runWorker(ForkJoinPool.java:1979)
	at akka.dispatch.forkjoin.ForkJoinWorkerThread.run(ForkJoinWorkerThread.java:107)
Caused by: org.apache.flink.runtime.jobmanager.scheduler.NoResourceAvailableException: Could
not allocate the required slot within slot request timeout. Please make sure that the cluster
has enough resources.
	at org.apache.flink.runtime.scheduler.DefaultScheduler.maybeWrapWithNoResourceAvailableException(DefaultScheduler.java:452)
	... 45 more
Caused by: java.util.concurrent.CompletionException: java.util.concurrent.TimeoutException
	at java.util.concurrent.CompletableFuture.encodeThrowable(CompletableFuture.java:292)
	at java.util.concurrent.CompletableFuture.completeThrowable(CompletableFuture.java:308)
	at java.util.concurrent.CompletableFuture.uniApply(CompletableFuture.java:607)
	at java.util.concurrent.CompletableFuture$UniApply.tryFire(CompletableFuture.java:591)
	... 25 more
Caused by: java.util.concurrent.TimeoutException
	... 23 more
2021/01/27 08:53:58  (): java.util.concurrent.TimeoutException
2021/01/27 08:53:59 Job state: FAILED
2021/01/27 08:53:59 Failed to execute job: job load0tests0go0flink0batch0combine0100127065305-root-0127084850-61618947_b8d4c4c0-012c-4ee8-8c7f-420a8ffd7524
failed
panic: Failed to execute job: job load0tests0go0flink0batch0combine0100127065305-root-0127084850-61618947_b8d4c4c0-012c-4ee8-8c7f-420a8ffd7524
failed

goroutine 1 [running]:
github.com/apache/beam/sdks/go/test/load/vendor/github.com/apache/beam/sdks/go/pkg/beam/log.Fatalf(0x11a4a80,
0xc00003e0b0, 0x106134d, 0x19, 0xc0003c1ee8, 0x1, 0x1)
	<https://ci-beam.apache.org/job/beam_LoadTests_Go_Combine_Flink_Batch/ws/src/sdks/go/test/load/.gogradle/project_gopath/src/github.com/apache/beam/sdks/go/test/load/vendor/github.com/apache/beam/sdks/go/pkg/beam/log/log.go>:153
+0xec
main.main()
	<https://ci-beam.apache.org/job/beam_LoadTests_Go_Combine_Flink_Batch/ws/src/sdks/go/test/load/.gogradle/project_gopath/src/github.com/apache/beam/sdks/go/test/load/combine/combine.go>:80
+0x451

> Task :sdks:go:test:load:run FAILED

FAILURE: Build failed with an exception.

* Where:
Build file '<https://ci-beam.apache.org/job/beam_LoadTests_Go_Combine_Flink_Batch/ws/src/sdks/go/test/load/build.gradle'>
line: 65

* What went wrong:
Execution failed for task ':sdks:go:test:load:run'.
> Process 'command 'sh'' finished with non-zero exit value 2

* Try:
Run with --stacktrace option to get the stack trace. Run with --info or --debug option to
get more log output. Run with --scan to get full insights.

* Get more help at https://help.gradle.org

Deprecated Gradle features were used in this build, making it incompatible with Gradle 7.0.
Use '--warning-mode all' to show the individual deprecation warnings.
See https://docs.gradle.org/6.8/userguide/command_line_interface.html#sec:command_line_warnings

BUILD FAILED in 8m 49s
6 actionable tasks: 6 executed

Publishing build scan...
https://gradle.com/s/otackv7p25dhg

Build step 'Invoke Gradle script' changed build result to FAILURE
Build step 'Invoke Gradle script' marked build as failure

---------------------------------------------------------------------
To unsubscribe, e-mail: builds-unsubscribe@beam.apache.org
For additional commands, e-mail: builds-help@beam.apache.org


Mime
View raw message